module customware.com.ar/hacktonranking

go 1.22.0

require (
	github.com/gorilla/mux v1.8.1
	gorm.io/driver/sqlite v1.5.5
	gorm.io/gorm v1.25.9
)

require (
	github.com/jinzhu/inflection v1.0.0 // indirect
	github.com/jinzhu/now v1.1.5 // indirect
	github.com/mattn/go-sqlite3 v1.14.17 // indirect
)
