%YAML 1.1
%TAG !u! tag:unity3d.com,2011:
--- !u!114 &11400000
MonoBehaviour:
  m_ObjectHideFlags: 0
  m_CorrespondingSourceObject: {fileID: 0}
  m_PrefabInstance: {fileID: 0}
  m_PrefabAsset: {fileID: 0}
  m_GameObject: {fileID: 0}
  m_Enabled: 1
  m_EditorHideFlags: 0
  m_Script: {fileID: 11500000, guid: 64c7eb974d6586a4ab7c2d44d2eb3ccd, type: 3}
  m_Name: First_Night
  m_EditorClassIdentifier: 
  id: 0
  logo: {fileID: 21300000, guid: 53987c33836986741aa0c3fb0259f066, type: 3}
  title: "Premi\xE8re soir\xE9e"
  description: "Vous \xEAtes sorti en soir\xE9e pour la premi\xE8re fois!"
  earn: 1
  award: 10
  level: 0
  unlock: 0
