%YAML 1.1
%TAG !u! tag:unity3d.com,2011:
--- !u!114 &11400000
MonoBehaviour:
  m_ObjectHideFlags: 0
  m_CorrespondingSourceObject: {fileID: 0}
  m_PrefabInstance: {fileID: 0}
  m_PrefabAsset: {fileID: 0}
  m_GameObject: {fileID: 0}
  m_Enabled: 1
  m_EditorHideFlags: 0
  m_Script: {fileID: 11500000, guid: 5be51871efa6c3e4eae1703925c8f5ac, type: 3}
  m_Name: CustomProfil_Text
  m_EditorClassIdentifier: 
  m_SharedTableData: {fileID: 11400000, guid: 51edc336070e981418a10b8c255e8424, type: 2}
  m_Tables:
  - {fileID: 11400000, guid: b5e572f4562ff6143b444d6597f53458, type: 2}
  - {fileID: 11400000, guid: 0540d89e6b3212c4294f4b03bbb759fe, type: 2}
  - {fileID: 11400000, guid: b39523f842a1e62438a3bf3ed39fcc30, type: 2}
  m_Extensions: []
  m_Group: String Table
  references:
    version: 1
