%YAML 1.1
%TAG !u! tag:unity3d.com,2011:
--- !u!1001 &3622531669608268369
PrefabInstance:
  m_ObjectHideFlags: 0
  serializedVersion: 2
  m_Modification:
    m_TransformParent: {fileID: 0}
    m_Modifications:
    - target: {fileID: 311954521, guid: c53631e471b124d48a92b417f637e6a7, type: 3}
      propertyPath: badge
      value: 
      objectReference: {fileID: 11400000, guid: 11c9f5f95aa4c5a43aa84fbeee48de59, type: 2}
    - target: {fileID: 7285497787010698605, guid: c53631e471b124d48a92b417f637e6a7, type: 3}
      propertyPath: m_AnchorMax.y
      value: 0
      objectReference: {fileID: 0}
    - target: {fileID: 7285497787010698605, guid: c53631e471b124d48a92b417f637e6a7, type: 3}
      propertyPath: m_AnchorMin.y
      value: 0
      objectReference: {fileID: 0}
    - target: {fileID: 7285497787010698605, guid: c53631e471b124d48a92b417f637e6a7, type: 3}
      propertyPath: m_SizeDelta.x
      value: 0
      objectReference: {fileID: 0}
    - target: {fileID: 7285497787010698605, guid: c53631e471b124d48a92b417f637e6a7, type: 3}
      propertyPath: m_SizeDelta.y
      value: 0
      objectReference: {fileID: 0}
    - target: {fileID: 7285497787010698605, guid: c53631e471b124d48a92b417f637e6a7, type: 3}
      propertyPath: m_AnchoredPosition.x
      value: 0
      objectReference: {fileID: 0}
    - target: {fileID: 7285497787010698605, guid: c53631e471b124d48a92b417f637e6a7, type: 3}
      propertyPath: m_AnchoredPosition.y
      value: 0
      objectReference: {fileID: 0}
    - target: {fileID: 7285497788035409201, guid: c53631e471b124d48a92b417f637e6a7, type: 3}
      propertyPath: m_AnchorMax.y
      value: 0
      objectReference: {fileID: 0}
    - target: {fileID: 7285497788035409201, guid: c53631e471b124d48a92b417f637e6a7, type: 3}
      propertyPath: m_AnchorMin.y
      value: 0
      objectReference: {fileID: 0}
    - target: {fileID: 7285497788035409201, guid: c53631e471b124d48a92b417f637e6a7, type: 3}
      propertyPath: m_SizeDelta.x
      value: 0
      objectReference: {fileID: 0}
    - target: {fileID: 7285497788035409201, guid: c53631e471b124d48a92b417f637e6a7, type: 3}
      propertyPath: m_SizeDelta.y
      value: 0
      objectReference: {fileID: 0}
    - target: {fileID: 7285497788035409201, guid: c53631e471b124d48a92b417f637e6a7, type: 3}
      propertyPath: m_AnchoredPosition.x
      value: 0
      objectReference: {fileID: 0}
    - target: {fileID: 7285497788035409201, guid: c53631e471b124d48a92b417f637e6a7, type: 3}
      propertyPath: m_AnchoredPosition.y
      value: 0
      objectReference: {fileID: 0}
    - target: {fileID: 7285497788338845024, guid: c53631e471b124d48a92b417f637e6a7, type: 3}
      propertyPath: m_Name
      value: Badge Variant 3
      objectReference: {fileID: 0}
    - target: {fileID: 7285497788338845038, guid: c53631e471b124d48a92b417f637e6a7, type: 3}
      propertyPath: m_ChildScaleWidth
      value: 1
      objectReference: {fileID: 0}
    - target: {fileID: 7285497788338845038, guid: c53631e471b124d48a92b417f637e6a7, type: 3}
      propertyPath: m_ChildScaleHeight
      value: 1
      objectReference: {fileID: 0}
    - target: {fileID: 7285497788338845038, guid: c53631e471b124d48a92b417f637e6a7, type: 3}
      propertyPath: m_ChildControlWidth
      value: 1
      objectReference: {fileID: 0}
    - target: {fileID: 7285497788338845038, guid: c53631e471b124d48a92b417f637e6a7, type: 3}
      propertyPath: m_ChildControlHeight
      value: 1
      objectReference: {fileID: 0}
    - target: {fileID: 7285497788338845038, guid: c53631e471b124d48a92b417f637e6a7, type: 3}
      propertyPath: m_ChildForceExpandWidth
      value: 1
      objectReference: {fileID: 0}
    - target: {fileID: 7285497788338845038, guid: c53631e471b124d48a92b417f637e6a7, type: 3}
      propertyPath: m_ChildForceExpandHeight
      value: 1
      objectReference: {fileID: 0}
    - target: {fileID: 7285497788338845039, guid: c53631e471b124d48a92b417f637e6a7, type: 3}
      propertyPath: m_Pivot.x
      value: 0.5
      objectReference: {fileID: 0}
    - target: {fileID: 7285497788338845039, guid: c53631e471b124d48a92b417f637e6a7, type: 3}
      propertyPath: m_Pivot.y
      value: 0.5
      objectReference: {fileID: 0}
    - target: {fileID: 7285497788338845039, guid: c53631e471b124d48a92b417f637e6a7, type: 3}
      propertyPath: m_RootOrder
      value: 0
      objectReference: {fileID: 0}
    - target: {fileID: 7285497788338845039, guid: c53631e471b124d48a92b417f637e6a7, type: 3}
      propertyPath: m_AnchorMax.x
      value: 0
      objectReference: {fileID: 0}
    - target: {fileID: 7285497788338845039, guid: c53631e471b124d48a92b417f637e6a7, type: 3}
      propertyPath: m_AnchorMax.y
      value: 0
      objectReference: {fileID: 0}
    - target: {fileID: 7285497788338845039, guid: c53631e471b124d48a92b417f637e6a7, type: 3}
      propertyPath: m_AnchorMin.x
      value: 0
      objectReference: {fileID: 0}
    - target: {fileID: 7285497788338845039, guid: c53631e471b124d48a92b417f637e6a7, type: 3}
      propertyPath: m_AnchorMin.y
      value: 0
      objectReference: {fileID: 0}
    - target: {fileID: 7285497788338845039, guid: c53631e471b124d48a92b417f637e6a7, type: 3}
      propertyPath: m_SizeDelta.x
      value: 0
      objectReference: {fileID: 0}
    - target: {fileID: 7285497788338845039, guid: c53631e471b124d48a92b417f637e6a7, type: 3}
      propertyPath: m_SizeDelta.y
      value: 0
      objectReference: {fileID: 0}
    - target: {fileID: 7285497788338845039, guid: c53631e471b124d48a92b417f637e6a7, type: 3}
      propertyPath: m_LocalPosition.x
      value: 0
      objectReference: {fileID: 0}
    - target: {fileID: 7285497788338845039, guid: c53631e471b124d48a92b417f637e6a7, type: 3}
      propertyPath: m_LocalPosition.y
      value: 0
      objectReference: {fileID: 0}
    - target: {fileID: 7285497788338845039, guid: c53631e471b124d48a92b417f637e6a7, type: 3}
      propertyPath: m_LocalPosition.z
      value: 0
      objectReference: {fileID: 0}
    - target: {fileID: 7285497788338845039, guid: c53631e471b124d48a92b417f637e6a7, type: 3}
      propertyPath: m_LocalRotation.w
      value: 1
      objectReference: {fileID: 0}
    - target: {fileID: 7285497788338845039, guid: c53631e471b124d48a92b417f637e6a7, type: 3}
      propertyPath: m_LocalRotation.x
      value: 0
      objectReference: {fileID: 0}
    - target: {fileID: 7285497788338845039, guid: c53631e471b124d48a92b417f637e6a7, type: 3}
      propertyPath: m_LocalRotation.y
      value: 0
      objectReference: {fileID: 0}
    - target: {fileID: 7285497788338845039, guid: c53631e471b124d48a92b417f637e6a7, type: 3}
      propertyPath: m_LocalRotation.z
      value: 0
      objectReference: {fileID: 0}
    - target: {fileID: 7285497788338845039, guid: c53631e471b124d48a92b417f637e6a7, type: 3}
      propertyPath: m_AnchoredPosition.x
      value: 0
      objectReference: {fileID: 0}
    - target: {fileID: 7285497788338845039, guid: c53631e471b124d48a92b417f637e6a7, type: 3}
      propertyPath: m_AnchoredPosition.y
      value: 0
      objectReference: {fileID: 0}
    - target: {fileID: 7285497788338845039, guid: c53631e471b124d48a92b417f637e6a7, type: 3}
      propertyPath: m_LocalEulerAnglesHint.x
      value: 0
      objectReference: {fileID: 0}
    - target: {fileID: 7285497788338845039, guid: c53631e471b124d48a92b417f637e6a7, type: 3}
      propertyPath: m_LocalEulerAnglesHint.y
      value: 0
      objectReference: {fileID: 0}
    - target: {fileID: 7285497788338845039, guid: c53631e471b124d48a92b417f637e6a7, type: 3}
      propertyPath: m_LocalEulerAnglesHint.z
      value: 0
      objectReference: {fileID: 0}
    - target: {fileID: 7285497788359723434, guid: c53631e471b124d48a92b417f637e6a7, type: 3}
      propertyPath: m_AnchorMax.y
      value: 0
      objectReference: {fileID: 0}
    - target: {fileID: 7285497788359723434, guid: c53631e471b124d48a92b417f637e6a7, type: 3}
      propertyPath: m_AnchorMin.y
      value: 0
      objectReference: {fileID: 0}
    - target: {fileID: 7285497788359723434, guid: c53631e471b124d48a92b417f637e6a7, type: 3}
      propertyPath: m_SizeDelta.x
      value: 0
      objectReference: {fileID: 0}
    - target: {fileID: 7285497788359723434, guid: c53631e471b124d48a92b417f637e6a7, type: 3}
      propertyPath: m_SizeDelta.y
      value: 0
      objectReference: {fileID: 0}
    - target: {fileID: 7285497788359723434, guid: c53631e471b124d48a92b417f637e6a7, type: 3}
      propertyPath: m_AnchoredPosition.x
      value: 0
      objectReference: {fileID: 0}
    - target: {fileID: 7285497788359723434, guid: c53631e471b124d48a92b417f637e6a7, type: 3}
      propertyPath: m_AnchoredPosition.y
      value: 0
      objectReference: {fileID: 0}
    m_RemovedComponents: []
  m_SourcePrefab: {fileID: 100100000, guid: c53631e471b124d48a92b417f637e6a7, type: 3}
