%YAML 1.1
%TAG !u! tag:unity3d.com,2011:
--- !u!114 &11400000
MonoBehaviour:
  m_ObjectHideFlags: 0
  m_CorrespondingSourceObject: {fileID: 0}
  m_PrefabInstance: {fileID: 0}
  m_PrefabAsset: {fileID: 0}
  m_GameObject: {fileID: 0}
  m_Enabled: 1
  m_EditorHideFlags: 0
  m_Script: {fileID: 11500000, guid: 5b11a58205ec3474ca216360e9fa74a8, type: 3}
  m_Name: UI_Text Shared Data
  m_EditorClassIdentifier: 
  m_TableCollectionName: UI_Text
  m_TableCollectionNameGuidString: f5ecc7f7da68718468bdaefd4279ed4a
  m_Entries:
  - m_Id: 395008387334144
    m_Key: "Credits_Thanks\t"
    m_Metadata:
      m_Items: []
  - m_Id: 393949308796928
    m_Key: "Credits_Title\t"
    m_Metadata:
      m_Items: []
  - m_Id: 394501413421056
    m_Key: Credits_Titlegroup_Dev
    m_Metadata:
      m_Items: []
  - m_Id: 395263572983808
    m_Key: Credits_Titlegroup_Medic
    m_Metadata:
      m_Items: []
  - m_Id: 150144152256512
    m_Key: Disclaimer
    m_Metadata:
      m_Items: []
  - m_Id: 23777834188800
    m_Key: "Id_langage\t"
    m_Metadata:
      m_Items: []
  - m_Id: 377819928215552
    m_Key: Menu_Credits
    m_Metadata:
      m_Items: []
  - m_Id: 377346080915456
    m_Key: Menu_Play
    m_Metadata:
      m_Items: []
  - m_Id: 377509604245504
    m_Key: Menu_Tips
    m_Metadata:
      m_Items: []
  - m_Id: 377082842202112
    m_Key: Menu_Title
    m_Metadata:
      m_Items: []
  - m_Id: 377680023011328
    m_Key: Menu_Tuto
    m_Metadata:
      m_Items: []
  - m_Id: 382190996963328
    m_Key: Param_AmbientSound
    m_Metadata:
      m_Items: []
  - m_Id: 384863624249344
    m_Key: Param_Cancel
    m_Metadata:
      m_Items: []
  - m_Id: 384113095491584
    m_Key: "Param_EffectSound\t"
    m_Metadata:
      m_Items: []
  - m_Id: 384449256374272
    m_Key: Param_Language
    m_Metadata:
      m_Items: []
  - m_Id: 385160551612416
    m_Key: Param_ProfilEpi
    m_Metadata:
      m_Items: []
  - m_Id: 384589723615232
    m_Key: Param_Reset
    m_Metadata:
      m_Items: []
  - m_Id: 449660478468096
    m_Key: "Param_resume\t"
    m_Metadata:
      m_Items: []
  - m_Id: 384978762088448
    m_Key: "Param_Save\t"
    m_Metadata:
      m_Items: []
  - m_Id: 518986724556800
    m_Key: Recommandation_Distance
    m_Metadata:
      m_Items: []
  - m_Id: 519310369636352
    m_Key: Recommandation_Light
    m_Metadata:
      m_Items: []
  - m_Id: 519605694775296
    m_Key: Recommandation_Time
    m_Metadata:
      m_Items: []
  - m_Id: 512927200985088
    m_Key: Recommandation_Title
    m_Metadata:
      m_Items: []
  - m_Id: 181724266496
    m_Key: TestText
    m_Metadata:
      m_Items: []
  - m_Id: 1613242671316992
    m_Key: Menu_Quit
    m_Metadata:
      m_Items: []
  m_Metadata:
    m_Items: []
  m_KeyGenerator:
    id: 0
  references:
    version: 1
    00000000:
      type: {class: DistributedUIDGenerator, ns: UnityEngine.Localization.Tables,
        asm: Unity.Localization}
      data:
        m_CustomEpoch: 1619778162509
