%YAML 1.1
%TAG !u! tag:unity3d.com,2011:
--- !u!114 &11400000
MonoBehaviour:
  m_ObjectHideFlags: 0
  m_CorrespondingSourceObject: {fileID: 0}
  m_PrefabInstance: {fileID: 0}
  m_PrefabAsset: {fileID: 0}
  m_GameObject: {fileID: 0}
  m_Enabled: 1
  m_EditorHideFlags: 0
  m_Script: {fileID: 11500000, guid: 23d8ad323870db748b7fa1d4616db077, type: 3}
  m_Name: Quest_08
  m_EditorClassIdentifier: 
  id: 8
  title: De l'argent de poche ?
  description: Regarde votre tire-lire !
  award: 1
