%YAML 1.1
%TAG !u! tag:unity3d.com,2011:
--- !u!114 &11400000
MonoBehaviour:
  m_ObjectHideFlags: 0
  m_CorrespondingSourceObject: {fileID: 0}
  m_PrefabInstance: {fileID: 0}
  m_PrefabAsset: {fileID: 0}
  m_GameObject: {fileID: 0}
  m_Enabled: 1
  m_EditorHideFlags: 0
  m_Script: {fileID: 11500000, guid: 23d8ad323870db748b7fa1d4616db077, type: 3}
  m_Name: Quest_03
  m_EditorClassIdentifier: 
  id: 3
  title: TV Time !
  description: "C'est l'heure de ma s\xE9rie ! Ne pas faire de crise !"
  award: 2
