%YAML 1.1
%TAG !u! tag:unity3d.com,2011:
--- !u!114 &11400000
MonoBehaviour:
  m_ObjectHideFlags: 0
  m_CorrespondingSourceObject: {fileID: 0}
  m_PrefabInstance: {fileID: 0}
  m_PrefabAsset: {fileID: 0}
  m_GameObject: {fileID: 0}
  m_Enabled: 1
  m_EditorHideFlags: 0
  m_Script: {fileID: 11500000, guid: 525672d918c136b4c93beeb759a8ad14, type: 3}
  m_Name: Google Pixel 4a (4G)
  m_EditorClassIdentifier: 
  m_Resolution:
    m_Active: 1
    m_Width: 2340
    m_Height: 1080
    m_Scale: 1
    m_Orientation: 0
    m_ResolutionName: Google Pixel 4a (4G)
    m_Category: Devices/Google
    m_Platform: Android
    m_PPI: 443
    m_ForcedUnityPPI: 0
    m_DeviceCanvas: {fileID: 22359418, guid: 71bd5fd00aafc4140b5b1ebbc2981c16, type: 3}
    m_Ratio: 2:1~
    m_FileName: 
    m_IgnoreOrientation: 0
    m_HasNotche: 0
    m_SafeAreaPortrait:
      serializedVersion: 2
      x: 0
      y: 0
      width: 1080
      height: 2204
    m_SafeAreaLandscapeLeft:
      serializedVersion: 2
      x: 136
      y: 0
      width: 2204
      height: 1080
