%YAML 1.1
%TAG !u! tag:unity3d.com,2011:
--- !u!114 &11400000
MonoBehaviour:
  m_ObjectHideFlags: 0
  m_CorrespondingSourceObject: {fileID: 0}
  m_PrefabInstance: {fileID: 0}
  m_PrefabAsset: {fileID: 0}
  m_GameObject: {fileID: 0}
  m_Enabled: 1
  m_EditorHideFlags: 0
  m_Script: {fileID: 11500000, guid: 64c7eb974d6586a4ab7c2d44d2eb3ccd, type: 3}
  m_Name: TV_launcher_activity
  m_EditorClassIdentifier: 
  id: 1
  logo: {fileID: 21300000, guid: c145aea4cefd0e949ba0ae67cf73c3c7, type: 3}
  title: Lancement de la TV
  description: "Vous avez allum\xE9 la TV sans pour autant faire de crise, preuve
    que vous avez su vous arr\xEAter \xE0 temps."
  earn: 1
  award: 100
  level: 0
  unlock: 0
