%YAML 1.1
%TAG !u! tag:unity3d.com,2011:
--- !u!114 &11400000
MonoBehaviour:
  m_ObjectHideFlags: 0
  m_CorrespondingSourceObject: {fileID: 0}
  m_PrefabInstance: {fileID: 0}
  m_PrefabAsset: {fileID: 0}
  m_GameObject: {fileID: 0}
  m_Enabled: 1
  m_EditorHideFlags: 0
  m_Script: {fileID: 11500000, guid: e9620f8c34305754d8cc9a7e49e852d9, type: 3}
  m_Name: CustomProfil_Text_fr
  m_EditorClassIdentifier: 
  m_LocaleId:
    m_Code: fr
  m_SharedData: {fileID: 11400000, guid: 51edc336070e981418a10b8c255e8424, type: 2}
  m_Metadata:
    m_Items: []
  m_TableData:
  - m_Id: 29311647744
    m_Localized: Toi
    m_Metadata:
      m_Items: []
  - m_Id: 186744848384
    m_Localized: Ton Epilepsie
    m_Metadata:
      m_Items: []
  - m_Id: 365132791808
    m_Localized: Nom
    m_Metadata:
      m_Items: []
  - m_Id: 426688397312
    m_Localized: Ecrit ton nom
    m_Metadata:
      m_Items: []
  - m_Id: 630598680576
    m_Localized: Genre
    m_Metadata:
      m_Items: []
  - m_Id: 709543870464
    m_Localized: "Orientation\t"
    m_Metadata:
      m_Items: []
  - m_Id: 786052169728
    m_Localized: Age
    m_Metadata:
      m_Items: []
  - m_Id: 902708346880
    m_Localized: "Erreur v\xE9rifie ton \xE2ge"
    m_Metadata:
      m_Items: []
  - m_Id: 1175392632832
    m_Localized: Passion
    m_Metadata:
      m_Items: []
  - m_Id: 1265146544128
    m_Localized: Suivant
    m_Metadata:
      m_Items: []
  - m_Id: 1361951080448
    m_Localized: "Crise focalis\xE9e"
    m_Metadata:
      m_Items: []
  - m_Id: 1628775923712
    m_Localized: Conscient
    m_Metadata:
      m_Items: []
  - m_Id: 1740835143680
    m_Localized: Inconscient
    m_Metadata:
      m_Items: []
  - m_Id: 1822225612800
    m_Localized: "Crise g\xE9n\xE9ralis\xE9e"
    m_Metadata:
      m_Items: []
  - m_Id: 2019928326144
    m_Localized: Absence
    m_Metadata:
      m_Items: []
  - m_Id: 2159057584128
    m_Localized: Convulsion
    m_Metadata:
      m_Items: []
  - m_Id: 2220546080768
    m_Localized: Traitement
    m_Metadata:
      m_Items: []
  - m_Id: 2309209473024
    m_Localized: Facteurs de risque
    m_Metadata:
      m_Items: []
  - m_Id: 2510473150464
    m_Localized: Stress
    m_Metadata:
      m_Items: []
  - m_Id: 2588604645376
    m_Localized: Manque de Sommeil
    m_Metadata:
      m_Items: []
  - m_Id: 2726546915328
    m_Localized: "Photosensibilit\xE9"
    m_Metadata:
      m_Items: []
  - m_Id: 2881849409536
    m_Localized: Chaleur
    m_Metadata:
      m_Items: []
  - m_Id: 3044030562304
    m_Localized: "Repas Irr\xE9guliers"
    m_Metadata:
      m_Items: []
  - m_Id: 3165954785280
    m_Localized: "Oubli du m\xE9dicament"
    m_Metadata:
      m_Items: []
  - m_Id: 3365570101248
    m_Localized: Alcool
    m_Metadata:
      m_Items: []
  - m_Id: 3451582693376
    m_Localized: Drogue
    m_Metadata:
      m_Items: []
  - m_Id: 14600550236160
    m_Localized: "Pr\xE9c\xE9dent"
    m_Metadata:
      m_Items: []
  - m_Id: 15019397627904
    m_Localized: Menu
    m_Metadata:
      m_Items: []
  references:
    version: 1
