%YAML 1.1
%TAG !u! tag:unity3d.com,2011:
--- !u!114 &11400000
MonoBehaviour:
  m_ObjectHideFlags: 0
  m_CorrespondingSourceObject: {fileID: 0}
  m_PrefabInstance: {fileID: 0}
  m_PrefabAsset: {fileID: 0}
  m_GameObject: {fileID: 0}
  m_Enabled: 1
  m_EditorHideFlags: 0
  m_Script: {fileID: 11500000, guid: 4b58b53299abc0f4db92e23f2b79b2d2, type: 3}
  m_Name: activity_3_Sleep
  m_EditorClassIdentifier: 
  id: 102
  color: {r: 0.6594496, g: 1, b: 0.3254717, a: 1}
  title: "L'activit\xE9 \"Dormir\""
  description: "Le sommeil permettra de r\xE9cup\xE9rer sa barre de sensibilit\xE9.
    Par ailleurs, il influencera en bien ou en mal la jauge de fun/bonheur, en fonction
    d'un doux r\xEAve ou d'un cauchemar."
