%YAML 1.1
%TAG !u! tag:unity3d.com,2011:
--- !u!1001 &1889322176171292847
PrefabInstance:
  m_ObjectHideFlags: 0
  serializedVersion: 2
  m_Modification:
    m_TransformParent: {fileID: 0}
    m_Modifications:
    - target: {fileID: -9011891669155955912, guid: 60bbf9721b9257240b047d8dd9f00e1d, type: 3}
      propertyPath: isUnlocked
      value: 1
      objectReference: {fileID: 0}
    - target: {fileID: -9011891669155955912, guid: 60bbf9721b9257240b047d8dd9f00e1d, type: 3}
      propertyPath: neurloNewsProfil
      value: 
      objectReference: {fileID: 11400000, guid: 329ecb9d13f2e3545b5f9badecacc0a8, type: 2}
    - target: {fileID: 6484510986495854290, guid: 60bbf9721b9257240b047d8dd9f00e1d, type: 3}
      propertyPath: m_Name
      value: NeurolonewsPop Variant 1
      objectReference: {fileID: 0}
    - target: {fileID: 6484510986495854291, guid: 60bbf9721b9257240b047d8dd9f00e1d, type: 3}
      propertyPath: m_Pivot.x
      value: 0.5
      objectReference: {fileID: 0}
    - target: {fileID: 6484510986495854291, guid: 60bbf9721b9257240b047d8dd9f00e1d, type: 3}
      propertyPath: m_Pivot.y
      value: 0.5
      objectReference: {fileID: 0}
    - target: {fileID: 6484510986495854291, guid: 60bbf9721b9257240b047d8dd9f00e1d, type: 3}
      propertyPath: m_RootOrder
      value: 0
      objectReference: {fileID: 0}
    - target: {fileID: 6484510986495854291, guid: 60bbf9721b9257240b047d8dd9f00e1d, type: 3}
      propertyPath: m_AnchorMax.x
      value: 0
      objectReference: {fileID: 0}
    - target: {fileID: 6484510986495854291, guid: 60bbf9721b9257240b047d8dd9f00e1d, type: 3}
      propertyPath: m_AnchorMax.y
      value: 0
      objectReference: {fileID: 0}
    - target: {fileID: 6484510986495854291, guid: 60bbf9721b9257240b047d8dd9f00e1d, type: 3}
      propertyPath: m_AnchorMin.x
      value: 0
      objectReference: {fileID: 0}
    - target: {fileID: 6484510986495854291, guid: 60bbf9721b9257240b047d8dd9f00e1d, type: 3}
      propertyPath: m_AnchorMin.y
      value: 0
      objectReference: {fileID: 0}
    - target: {fileID: 6484510986495854291, guid: 60bbf9721b9257240b047d8dd9f00e1d, type: 3}
      propertyPath: m_SizeDelta.x
      value: 553.272
      objectReference: {fileID: 0}
    - target: {fileID: 6484510986495854291, guid: 60bbf9721b9257240b047d8dd9f00e1d, type: 3}
      propertyPath: m_SizeDelta.y
      value: 100
      objectReference: {fileID: 0}
    - target: {fileID: 6484510986495854291, guid: 60bbf9721b9257240b047d8dd9f00e1d, type: 3}
      propertyPath: m_LocalPosition.x
      value: 0
      objectReference: {fileID: 0}
    - target: {fileID: 6484510986495854291, guid: 60bbf9721b9257240b047d8dd9f00e1d, type: 3}
      propertyPath: m_LocalPosition.y
      value: 0
      objectReference: {fileID: 0}
    - target: {fileID: 6484510986495854291, guid: 60bbf9721b9257240b047d8dd9f00e1d, type: 3}
      propertyPath: m_LocalPosition.z
      value: 0
      objectReference: {fileID: 0}
    - target: {fileID: 6484510986495854291, guid: 60bbf9721b9257240b047d8dd9f00e1d, type: 3}
      propertyPath: m_LocalRotation.w
      value: 1
      objectReference: {fileID: 0}
    - target: {fileID: 6484510986495854291, guid: 60bbf9721b9257240b047d8dd9f00e1d, type: 3}
      propertyPath: m_LocalRotation.x
      value: 0
      objectReference: {fileID: 0}
    - target: {fileID: 6484510986495854291, guid: 60bbf9721b9257240b047d8dd9f00e1d, type: 3}
      propertyPath: m_LocalRotation.y
      value: 0
      objectReference: {fileID: 0}
    - target: {fileID: 6484510986495854291, guid: 60bbf9721b9257240b047d8dd9f00e1d, type: 3}
      propertyPath: m_LocalRotation.z
      value: 0
      objectReference: {fileID: 0}
    - target: {fileID: 6484510986495854291, guid: 60bbf9721b9257240b047d8dd9f00e1d, type: 3}
      propertyPath: m_AnchoredPosition.x
      value: 0
      objectReference: {fileID: 0}
    - target: {fileID: 6484510986495854291, guid: 60bbf9721b9257240b047d8dd9f00e1d, type: 3}
      propertyPath: m_AnchoredPosition.y
      value: 0
      objectReference: {fileID: 0}
    - target: {fileID: 6484510986495854291, guid: 60bbf9721b9257240b047d8dd9f00e1d, type: 3}
      propertyPath: m_LocalEulerAnglesHint.x
      value: 0
      objectReference: {fileID: 0}
    - target: {fileID: 6484510986495854291, guid: 60bbf9721b9257240b047d8dd9f00e1d, type: 3}
      propertyPath: m_LocalEulerAnglesHint.y
      value: 0
      objectReference: {fileID: 0}
    - target: {fileID: 6484510986495854291, guid: 60bbf9721b9257240b047d8dd9f00e1d, type: 3}
      propertyPath: m_LocalEulerAnglesHint.z
      value: 0
      objectReference: {fileID: 0}
    m_RemovedComponents: []
  m_SourcePrefab: {fileID: 100100000, guid: 60bbf9721b9257240b047d8dd9f00e1d, type: 3}
