%YAML 1.1
%TAG !u! tag:unity3d.com,2011:
--- !u!1001 &9195734359318136733
PrefabInstance:
  m_ObjectHideFlags: 0
  serializedVersion: 2
  m_Modification:
    m_TransformParent: {fileID: 0}
    m_Modifications:
    - target: {fileID: 1660296933346235308, guid: d5729d56a017884418d0223f78cf895a, type: 3}
      propertyPath: m_AnchorMax.y
      value: 0
      objectReference: {fileID: 0}
    - target: {fileID: 1660296933346235308, guid: d5729d56a017884418d0223f78cf895a, type: 3}
      propertyPath: m_AnchorMin.y
      value: 0
      objectReference: {fileID: 0}
    - target: {fileID: 1660296933346235308, guid: d5729d56a017884418d0223f78cf895a, type: 3}
      propertyPath: m_AnchoredPosition.x
      value: 0
      objectReference: {fileID: 0}
    - target: {fileID: 1660296933346235308, guid: d5729d56a017884418d0223f78cf895a, type: 3}
      propertyPath: m_AnchoredPosition.y
      value: 0
      objectReference: {fileID: 0}
    - target: {fileID: 5583249109998526182, guid: d5729d56a017884418d0223f78cf895a, type: 3}
      propertyPath: tips
      value: 
      objectReference: {fileID: 11400000, guid: a4ee1c3fce08e824c9378c6161f37878, type: 2}
    - target: {fileID: 8497500788834197996, guid: d5729d56a017884418d0223f78cf895a, type: 3}
      propertyPath: m_AnchorMax.y
      value: 0
      objectReference: {fileID: 0}
    - target: {fileID: 8497500788834197996, guid: d5729d56a017884418d0223f78cf895a, type: 3}
      propertyPath: m_AnchorMin.y
      value: 0
      objectReference: {fileID: 0}
    - target: {fileID: 8497500788834197996, guid: d5729d56a017884418d0223f78cf895a, type: 3}
      propertyPath: m_AnchoredPosition.x
      value: 0
      objectReference: {fileID: 0}
    - target: {fileID: 8497500788834197996, guid: d5729d56a017884418d0223f78cf895a, type: 3}
      propertyPath: m_AnchoredPosition.y
      value: 0
      objectReference: {fileID: 0}
    - target: {fileID: 8497500788880809254, guid: d5729d56a017884418d0223f78cf895a, type: 3}
      propertyPath: m_Name
      value: Activity_1_TV 5
      objectReference: {fileID: 0}
    - target: {fileID: 8497500788880809257, guid: d5729d56a017884418d0223f78cf895a, type: 3}
      propertyPath: m_Pivot.x
      value: 0.5
      objectReference: {fileID: 0}
    - target: {fileID: 8497500788880809257, guid: d5729d56a017884418d0223f78cf895a, type: 3}
      propertyPath: m_Pivot.y
      value: 0.5
      objectReference: {fileID: 0}
    - target: {fileID: 8497500788880809257, guid: d5729d56a017884418d0223f78cf895a, type: 3}
      propertyPath: m_RootOrder
      value: 0
      objectReference: {fileID: 0}
    - target: {fileID: 8497500788880809257, guid: d5729d56a017884418d0223f78cf895a, type: 3}
      propertyPath: m_AnchorMax.x
      value: 0
      objectReference: {fileID: 0}
    - target: {fileID: 8497500788880809257, guid: d5729d56a017884418d0223f78cf895a, type: 3}
      propertyPath: m_AnchorMax.y
      value: 0
      objectReference: {fileID: 0}
    - target: {fileID: 8497500788880809257, guid: d5729d56a017884418d0223f78cf895a, type: 3}
      propertyPath: m_AnchorMin.x
      value: 0
      objectReference: {fileID: 0}
    - target: {fileID: 8497500788880809257, guid: d5729d56a017884418d0223f78cf895a, type: 3}
      propertyPath: m_AnchorMin.y
      value: 0
      objectReference: {fileID: 0}
    - target: {fileID: 8497500788880809257, guid: d5729d56a017884418d0223f78cf895a, type: 3}
      propertyPath: m_SizeDelta.x
      value: 540.9333
      objectReference: {fileID: 0}
    - target: {fileID: 8497500788880809257, guid: d5729d56a017884418d0223f78cf895a, type: 3}
      propertyPath: m_SizeDelta.y
      value: 100
      objectReference: {fileID: 0}
    - target: {fileID: 8497500788880809257, guid: d5729d56a017884418d0223f78cf895a, type: 3}
      propertyPath: m_LocalPosition.x
      value: 0
      objectReference: {fileID: 0}
    - target: {fileID: 8497500788880809257, guid: d5729d56a017884418d0223f78cf895a, type: 3}
      propertyPath: m_LocalPosition.y
      value: 0
      objectReference: {fileID: 0}
    - target: {fileID: 8497500788880809257, guid: d5729d56a017884418d0223f78cf895a, type: 3}
      propertyPath: m_LocalPosition.z
      value: 0
      objectReference: {fileID: 0}
    - target: {fileID: 8497500788880809257, guid: d5729d56a017884418d0223f78cf895a, type: 3}
      propertyPath: m_LocalRotation.w
      value: 1
      objectReference: {fileID: 0}
    - target: {fileID: 8497500788880809257, guid: d5729d56a017884418d0223f78cf895a, type: 3}
      propertyPath: m_LocalRotation.x
      value: 0
      objectReference: {fileID: 0}
    - target: {fileID: 8497500788880809257, guid: d5729d56a017884418d0223f78cf895a, type: 3}
      propertyPath: m_LocalRotation.y
      value: 0
      objectReference: {fileID: 0}
    - target: {fileID: 8497500788880809257, guid: d5729d56a017884418d0223f78cf895a, type: 3}
      propertyPath: m_LocalRotation.z
      value: 0
      objectReference: {fileID: 0}
    - target: {fileID: 8497500788880809257, guid: d5729d56a017884418d0223f78cf895a, type: 3}
      propertyPath: m_AnchoredPosition.x
      value: 0
      objectReference: {fileID: 0}
    - target: {fileID: 8497500788880809257, guid: d5729d56a017884418d0223f78cf895a, type: 3}
      propertyPath: m_AnchoredPosition.y
      value: 0
      objectReference: {fileID: 0}
    - target: {fileID: 8497500788880809257, guid: d5729d56a017884418d0223f78cf895a, type: 3}
      propertyPath: m_LocalEulerAnglesHint.x
      value: 0
      objectReference: {fileID: 0}
    - target: {fileID: 8497500788880809257, guid: d5729d56a017884418d0223f78cf895a, type: 3}
      propertyPath: m_LocalEulerAnglesHint.y
      value: 0
      objectReference: {fileID: 0}
    - target: {fileID: 8497500788880809257, guid: d5729d56a017884418d0223f78cf895a, type: 3}
      propertyPath: m_LocalEulerAnglesHint.z
      value: 0
      objectReference: {fileID: 0}
    - target: {fileID: 8497500789046873463, guid: d5729d56a017884418d0223f78cf895a, type: 3}
      propertyPath: m_AnchorMax.y
      value: 0
      objectReference: {fileID: 0}
    - target: {fileID: 8497500789046873463, guid: d5729d56a017884418d0223f78cf895a, type: 3}
      propertyPath: m_AnchorMin.y
      value: 0
      objectReference: {fileID: 0}
    - target: {fileID: 8497500789046873463, guid: d5729d56a017884418d0223f78cf895a, type: 3}
      propertyPath: m_AnchoredPosition.x
      value: 0
      objectReference: {fileID: 0}
    - target: {fileID: 8497500789046873463, guid: d5729d56a017884418d0223f78cf895a, type: 3}
      propertyPath: m_AnchoredPosition.y
      value: 0
      objectReference: {fileID: 0}
    - target: {fileID: 8497500790169658667, guid: d5729d56a017884418d0223f78cf895a, type: 3}
      propertyPath: m_AnchorMax.y
      value: 0
      objectReference: {fileID: 0}
    - target: {fileID: 8497500790169658667, guid: d5729d56a017884418d0223f78cf895a, type: 3}
      propertyPath: m_AnchorMin.y
      value: 0
      objectReference: {fileID: 0}
    - target: {fileID: 8497500790169658667, guid: d5729d56a017884418d0223f78cf895a, type: 3}
      propertyPath: m_AnchoredPosition.x
      value: 0
      objectReference: {fileID: 0}
    - target: {fileID: 8497500790169658667, guid: d5729d56a017884418d0223f78cf895a, type: 3}
      propertyPath: m_AnchoredPosition.y
      value: 0
      objectReference: {fileID: 0}
    m_RemovedComponents: []
  m_SourcePrefab: {fileID: 100100000, guid: d5729d56a017884418d0223f78cf895a, type: 3}
