%YAML 1.1
%TAG !u! tag:unity3d.com,2011:
--- !u!114 &11400000
MonoBehaviour:
  m_ObjectHideFlags: 0
  m_CorrespondingSourceObject: {fileID: 0}
  m_PrefabInstance: {fileID: 0}
  m_PrefabAsset: {fileID: 0}
  m_GameObject: {fileID: 0}
  m_Enabled: 1
  m_EditorHideFlags: 0
  m_Script: {fileID: 11500000, guid: 69532c0356e44254ea84251cdc17d814, type: 3}
  m_Name: 001_ 2
  m_EditorClassIdentifier: 
  id: 2
  title: Animaux
  description: "Les animaux aussi peuvent effectuer des crises d'\xE9pilepsie."
  isUnlocked: 1
  date: 0
  heure: 0
