{
  "fsa_lights_per100g": {
    "fat": "orange",
    "salt": "orange",
    "saturates": "green",
    "sugars": "green"
  },
  "id": "2e1a699bfb",
  "ingredients": [
    {
      "text": "wheat flours, bread, unenriched"
    },
    {
      "text": "sugars, granulated"
    },
    {
      "text": "oil, olive, salad or cooking"
    },
    {
      "text": "salt, table"
    },
    {
      "text": "leavening agents, yeast, baker's, active dry"
    },
    {
      "text": "water, bottled, generic"
    }
  ],
  "instructions": [
    {
      "text": "in a bowl put flour, sugar, olive oils and salt."
    },
    {
      "text": "Make a hole in the middle to put the yeast."
    },
    {
      "text": "pour the warm water on top of the yeast."
    },
    {
      "text": "mix it with a spoon and then use your hands to kneel it really well (about 5 minutes of work)."
    },
    {
      "text": "Divide the dough in 2 equal parts."
    },
    {
      "text": "Fold the dough 5 times and form 2 balls."
    },
    {
      "text": "spread olive oil around them and arrange them on a plate."
    },
    {
      "text": "Cover the plate with cling leave it overnight inside the fridge."
    },
    {
      "text": "Next day or at least 3 hours you can use it."
    },
    {
      "text": "Open it on a perforated pizza pan."
    },
    {
      "text": "sauce and toppings as you wish."
    },
    {
      "text": "Bake it at 450 degrees F for 10 minutes."
    }
  ],
  "nutr_per_ingredient": [
    {
      "fat": 6.8100000000000005,
      "nrg": 1485.0,
      "pro": 49.230000000000004,
      "sat": 1.002,
      "sod": 9.0,
      "sug": 1.26
    },
    {
      "fat": 0.0,
      "nrg": 144.0,
      "pro": 0.0,
      "sat": 0.0,
      "sod": 0.0,
      "sug": 37.71
    },
    {
      "fat": 40.5,
      "nrg": 357.0,
      "pro": 0.0,
      "sat": 5.5920000000000005,
      "sod": 0.0,
      "sug": 0.0
    },
    {
      "fat": 0.0,
      "nrg": 0.0,
      "pro": 0.0,
      "sat": 0.0,
      "sod": 2325.0,
      "sug": 0.0
    },
    {
      "fat": 30.2035573,
      "nrg": 1289.9022499999999,
      "pro": 160.50352919999997,
      "sat": 3.972898929999999,
      "sod": 202.41543,
      "sug": 0.0
    },
    {
      "fat": 0.0,
      "nrg": 0.0,
      "pro": 0.0,
      "sat": 0.0,
      "sod": 8.0,
      "sug": 0.0
    }
  ],
  "nutr_values_per100g": {
    "energy": 290.16143147034575,
    "fat": 6.8657252347888793,
    "protein": 18.577044250938666,
    "salt": 0.56342586490793134,
    "saturates": 0.93595787839251443,
    "sugars": 3.4517485936582424
  },
  "partition": "train",
  "quantity": [
    {
      "text": "3"
    },
    {
      "text": "3"
    },
    {
      "text": "3"
    },
    {
      "text": "1"
    },
    {
      "text": "14"
    },
    {
      "text": "1"
    }
  ],
  "title": "pizza",
  "unit": [
    {
      "text": "cup"
    },
    {
      "text": "tablespoon"
    },
    {
      "text": "tablespoon"
    },
    {
      "text": "teaspoon"
    },
    {
      "text": "ounce"
    },
    {
      "text": "cup"
    }
  ],
  "url": "http://www.food.com/recipe/pizza-462982",
  "weight_per_ingr": [
    411.0,
    37.800000000000004,
    40.5,
    6.0,
    396.893,
    236.8
  ]
}