{
  "ingredients": [
    {
      "text": "olive oil"
    },
    {
      "text": "onions"
    },
    {
      "text": "carrots"
    },
    {
      "text": "garlic cloves"
    },
    {
      "text": "rosemary leaves"
    },
    {
      "text": "beef mince"
    },
    {
      "text": "plum tomatoes"
    },
    {
      "text": "basil"
    },
    {
      "text": "dried oregano"
    },
    {
      "text": "bay leaves"
    },
    {
      "text": "tomato purée"
    },
    {
      "text": "stock cube"
    },
    {
      "text": "red chilli"
    },
    {
      "text": "red wine"
    },
    {
      "text": "cherry tomatoes"
    },
    {
      "text": "parmessan"
    },
    {
      "text": "spaghetti"
    },
    {
      "text": "bread"
    }
  ],
  "instructions": [
    {
      "text": "Put a large saucepan on a medium heat and add 1 tbsp olive oil."
    },{
      "text": "Add 4 finely chopped bacon rashers and fry for 10 mins until golden and crisp."
    },{
      "text": "Reduce the heat and add the 2 onions, 2 carrots, 2 celery sticks, 2 garlic cloves and the leaves from 2-3 sprigs rosemary, all finely chopped, then fry for 10 mins. Stir the veg often until it softens."
    },{
      "text": "Increase the heat to medium-high, add 500g beef mince and cook stirring for 3-4 mins until the meat is browned all over."
    },{
      "text": "Add 2 tins plum tomatoes, the finely chopped leaves from ¾ small pack basil, 1 tsp dried oregano, 2 bay leaves, 2 tbsp tomato purée, 1 beef stock cube, 1 deseeded and finely chopped red chilli (if using), 125ml red wine and 6 halved cherry tomatoes. Stir with a wooden spoon, breaking up the plum tomatoes."
    },{
      "text": "Bring to the boil, reduce to a gentle simmer and cover with a lid. Cook for 1 hr 15 mins stirring occasionally, until you have a rich, thick sauce."
    },{
      "text": "Add the 75g grated parmesan, check the seasoning and stir."
    },{
      "text": "When the bolognese is nearly finished, cook 400g spaghetti following the pack instructions."
    },{
      "text": "Drain the spaghetti and stir into the bolognese sauce. Serve with more grated parmesan, the remaining basil leaves and crusty bread, if you like."
    }
  ],
  "quantity": [
    {
      "text": "1"
    },
    {
      "text": "2"
    },
    {
      "text": "4"
    },
    {
      "text": "2"
    },
    {
      "text": "2"
    },
    {
      "text": "500"
    },
    {
      "text": "800"
    },
    {
      "text": "1"
    },
    {
      "text": "1"
    },
    {
      "text": "2"
    },
    {
      "text": "2"
    },
    {
      "text": "1"
    },
    {
      "text": "1"
    },
    {
      "text": "125"
    },
    {
      "text": "6"
    },
    {
      "text": "75"
    },
    {
      "text": "400"
    },
    {
      "text": "1"
    }
  ],
  "title": "spaghetti_bolognese",
  "unit": [
    {
      "text": "tablespoon"
    },
    {
      "text": "rashers"
    },
    {
      "text": "pc"
    },
    {
      "text": "pc"
    },
    {
      "text": "pc"
    },
    {
      "text": "pc"
    },
    {
      "text": "sprigs"
    },
    {
      "text": "g"
    },
    {
      "text": "g"
    },
    {
      "text": "small pack"
    },
    {
      "text": "tablespoon"
    },
    {
      "text": "pc"
    },
    {
      "text": "tablespoon"
    },
    {
      "text": "pc"
    },
    {
      "text": "pc"
    },
    {
      "text": "ml"
    },
    {
      "text": "pc"
    },
    {
      "text": "g"
    },
    {
      "text": "g"
    },
    {
      "text": "pc"
    }
  ]
}