{
  "ingredients": [
    {
      "text": "large onion"
    },
    {
      "text": "all-purpose flour"
    },
    {
      "text": "baking powder"
    },
    {
      "text": "salt"
    },
    {
      "text": "egg"
    },
    {
      "text": "milk"
    },
    {
      "text": "dry bread crumbs"
    },
    {
      "text": "salt"
    },
    {
      "text": "oil"
    }
  ],
  "instructions": [
    {
      "text": "Heat the oil in a deep-fryer to 365 degrees F (185 degrees C)."
    },
    {
      "text": "Separate the onion slices into rings, and set aside."
    },
    {
      "text": "Dip the onion slices into the flour mixture until they are all coated; set aside. Whisk the egg and milk into the flour mixture using a fork."
    },
    {
      "text": "Dip the floured rings into the batter to coat, then place on a wire rack to drain until the batter stops dripping."
    },
    {
      "text": "The wire rack may be placed over a sheet of aluminum foil for easier clean up."
    },
    {
      "text": "Spread the bread crumbs out on a plate or shallow dish. Place rings one at a time into the crumbs, and scoop the crumbs up over the ring to coat. "
    },
    {
      "text": "Give it a hard tap as you remove it from the crumbs."
    },
    {
      "text": "Repeat with remaining rings. "
    },
    {
      "text": "Deep fry the rings a few at a time for 2 to 3 minutes, or until golden brown."
    },
    {
      "text": "Remove to paper towels to drain."
    },
    {
      "text": "Season with seasoning salt, and serve. "
    }
  ],
  "quantity": [
    {
      "text": "1"
    },
    {
      "text": "1 1/4"
    },
    {
      "text": "1"
    },
    {
      "text": "1"
    },
    {
      "text": "1"
    },
    {
      "text": "1"
    },
    {
      "text": "3/4"
    },
    {
      "text": "1"
    },
    {
      "text": "1"
    }
  ],
  "title": "onion_rings",
  "unit": [
    {
      "text": "pc"
    },
    {
      "text": "cups"
    },
    {
      "text": "teaspoon"
    },
    {
      "text": "teaspoon"
    },
    {
      "text": "pc"
    },
    {
      "text": "cup"
    },
    {
      "text": "cup"
    },
    {
      "text": "pinch"
    },
    {
      "text": "quart"
    }
  ]
}