    {
        "fsa_lights_per100g":{
            "fat":"green",
            "salt":"orange",
            "saturates":"green",
            "sugars":"orange"
        },
        "id":"eeb4ca8450",
        "ingredients":[
            {
                "text":"bacon, meatless"
            },
            {
                "text":"cheese, cottage, creamed, large or small curd"
            },
            {
                "text":"milk, fluid, 1% fat, without added vitamin a and vitamin d"
            },
            {
                "text":"egg substitute, powder"
            },
            {
                "text":"salt, table"
            },
            {
                "text":"kashi, steam meal, chicken fettuccine, frozen entree"
            },
            {
                "text":"cheese, parmesan, hard"
            }
        ],
        "instructions":[
            {
                "text":"Slice bacon into 1 inch long and 1/4inch thick strips."
            },
            {
                "text":"In a medium skillet, cook the bacon over medium heat, stirring occasionally, until light brown."
            },
            {
                "text":"Transfer to a plate and set aside."
            },
            {
                "text":"In a blender process the cottage cheese, milk, egg substitute and salt until smooth."
            },
            {
                "text":"In a large pot of salted boiling water, cook the pasta until just barely tender."
            },
            {
                "text":"Drain well and return to the pot."
            },
            {
                "text":"Add the cheese mixture, bacon and pepper to the pasta and cook over med-low heat, stirring continually until sauce is heated through--do not boil--about 1 minute."
            },
            {
                "text":"Transfer to a warmed serving bowl, and serve immediately, sprinkling with the parmesan cheese."
            }
        ],
        "nutr_per_ingredient":[
            {
                "fat":33.475089600000004,
                "nrg":350.39982,
                "pro":13.256226199999999,
                "sat":5.24125556,
                "sod":1661.2807,
                "sug":0.0
            },
            {
                "fat":13.544999999999998,
                "nrg":309.0,
                "pro":35.025000000000006,
                "sat":5.412,
                "sod":1146.0,
                "sug":8.415000000000001
            },
            {
                "fat":80.58,
                "nrg":3468.0,
                "pro":279.48,
                "sat":52.53,
                "sod":3638.0,
                "sug":431.46
            },
            {
                "fat":132.6,
                "nrg":4528.8,
                "pro":566.1,
                "sat":38.413199999999996,
                "sod":8160.0,
                "sug":222.35999999999999
            },
            {
                "fat":0.0,
                "nrg":0.0,
                "pro":0.0,
                "sat":0.0,
                "sod":32549.999999999996,
                "sug":0.0
            },
            {
                "fat":12.246984000000001,
                "nrg":449.05608,
                "pro":28.122704,
                "sat":4.082328,
                "sod":752.96272,
                "sug":5.896696
            },
            {
                "fat":14.401399859378815,
                "nrg":216.56240390043328,
                "pro":19.923741158839864,
                "sat":9.149761564793307,
                "sod":768.7965338465382,
                "sug":0.43312480780086654
            }
        ],
        "nutr_values_per100g":{
            "energy":90.172561326021309,
            "fat":2.7747656863756562,
            "protein":9.1113369184118049,
            "salt":1.1771666286852087,
            "saturates":1.1107687030233955,
            "sugars":6.4672149080064081
        },
        "partition":"test",
        "quantity":[
            {
                "text":"4"
            },
            {
                "text":"1 1/2"
            },
            {
                "text":"34"
            },
            {
                "text":"12"
            },
            {
                "text":"14"
            },
            {
                "text":"1"
            },
            {
                "text":"6"
            }
        ],
        "title":"spaghetti_carbonara",
        "unit":[
            {
                "text":"ounce"
            },
            {
                "text":"cup"
            },
            {
                "text":"cup"
            },
            {
                "text":"cup"
            },
            {
                "text":"teaspoon"
            },
            {
                "text":"pound"
            },
            {
                "text":"tablespoon"
            }
        ],
        "url":"http://www.food.com/recipe/light-fettuccine-carbonara-150064",
        "weight_per_ingr":[
            113.398,
            315.0,
            8296.0,
            1020.0,
            83.99999999999999,
            453.592,
            55.76481900436157
        ]
    }