    {
        "fsa_lights_per100g":{
            "fat":"green",
            "salt":"red",
            "saturates":"green",
            "sugars":"green"
        },
        "id":"5922dcd98d",
        "ingredients":[
            {
                "text":"sauce, fish, ready-to-serve"
            },
            {
                "text":"alcoholic beverage, beer, regular, all"
            },
            {
                "text":"wheat flour, white, all-purpose, unenriched"
            },
            {
                "text":"leavening agents, baking powder, double-acting, sodium aluminum sulfate"
            },
            {
                "text":"salt, table"
            },
            {
                "text":"spices, pepper, black"
            }
        ],
        "instructions":[
            {
                "text":"Combine all batter ingredients in a mixing bowl."
            },
            {
                "text":"Cut the fillets into desired sized pieces."
            },
            {
                "text":"Dust fillets with flour."
            },
            {
                "text":"Dip the fillets in the batter."
            },
            {
                "text":"Fry fillets in deep fryer at 375 degrees with at least 2 inches of vegetable oil until golden brown."
            },
            {
                "text":"Don't crowd the fillets while frying."
            },
            {
                "text":"Drain fillets on paper towels or brown paper bags from the grocery store."
            },
            {
                "text":"Serve with french fries, tarter sauce, cocktail sauce, malt vinegar and cole slaw or cucumber salad (see Zaar recipe 211355)."
            }
        ],
        "nutr_per_ingredient":[
            {
                "fat":0.5443104,
                "nrg":1905.0863999999997,
                "pro":275.4210624,
                "sat":0.16329311999999999,
                "sod":427338.09504,
                "sug":198.1289856
            },
            {
                "fat":0.0,
                "nrg":104.0,
                "pro":1.12,
                "sat":0.0,
                "sod":8.0,
                "sug":0.0
            },
            {
                "fat":1.23,
                "nrg":455.0,
                "pro":12.91,
                "sat":0.194,
                "sod":2.0,
                "sug":0.34
            },
            {
                "fat":0.0,
                "nrg":24.0,
                "pro":0.0,
                "sat":0.0,
                "sod":5856.0,
                "sug":0.0
            },
            {
                "fat":0.0,
                "nrg":0.0,
                "pro":0.0,
                "sat":0.0,
                "sod":145.08,
                "sug":0.0
            },
            {
                "fat":0.004368,
                "nrg":0.3744,
                "pro":0.014976,
                "sat":0.0019968000000000004,
                "sod":0.0,
                "sug":0.000624
            }
        ],
        "nutr_values_per100g":{
            "energy":42.454899748967399,
            "fat":0.030345510428636747,
            "protein":4.9384951697863793,
            "salt":18.483107894065409,
            "saturates":0.0061297399317740992,
            "sugars":3.3860317907297146
        },
        "partition":"train",
        "quantity":[
            {
                "text":"12"
            },
            {
                "text":"1"
            },
            {
                "text":"1"
            },
            {
                "text":"12"
            },
            {
                "text":"1"
            },
            {
                "text":"1"
            }
        ],
        "title":"fish_and_chips",
        "unit":[
            {
                "text":"pound"
            },
            {
                "text":"cup"
            },
            {
                "text":"cup"
            },
            {
                "text":"teaspoon"
            },
            {
                "text":"pinch"
            },
            {
                "text":"pinch"
            }
        ],
        "url":"http://www.food.com/recipe/fish-and-chips-211432",
        "weight_per_ingr":[
            5443.103999999999,
            237.6,
            125.0,
            55.199999999999996,
            0.37439999999999996,
            0.14351999999999998
        ]
    }