absl-py==0.9.0
asn1crypto==1.3.0
astor==0.8.0
blinker==1.4
cachetools==3.1.1
certifi==2020.4.5.1
cffi==1.14.0
chardet==3.0.4
click==7.1.1
colorama==0.4.3
cryptography==2.8
cycler==0.10.0
Flask==1.1.1
future==0.18.2
gast==0.2.2
google-auth==1.11.2
google-auth-oauthlib==0.4.1
google-pasta==0.2.0
grpcio==1.27.2
h5py==2.10.0
idna==2.9
itsdangerous==1.1.0
Jinja2==2.11.1
joblib==0.14.1
Keras-Applications==1.0.8
Keras-Preprocessing==1.1.0
keras-tuner==1.0.1
kiwisolver==1.1.0
Markdown==3.1.1
MarkupSafe==1.1.1
matplotlib==3.1.3
mkl-fft==1.0.15
mkl-random==1.1.0
mkl-service==2.3.0
numpy==1.18.1
oauthlib==3.1.0
olefile==0.46
opt-einsum==3.1.0
pandas==1.0.3
Pillow==7.0.0
protobuf==3.11.4
pyasn1==0.4.8
pyasn1-modules==0.2.7
pycparser==2.20
PyJWT==1.7.1
pymongo==3.9.0
pyOpenSSL==19.1.0
pyparsing==2.4.6
pyreadline==2.1
PySocks==1.7.1
python-dateutil==2.8.1
pytz==2019.3
requests==2.23.0
requests-oauthlib==1.3.0
rsa==4.0
scikit-learn==0.22.1
scipy==1.4.1
six==1.14.0
tabulate==0.8.6
tensorboard==2.1.0
tensorflow==2.1.0
tensorflow-estimator==2.1.0
termcolor==1.1.0
terminaltables==3.1.0
tornado==6.0.4
tqdm==4.43.0
urllib3==1.25.8
Werkzeug==0.16.1
win-inet-pton==1.1.0
wincertstore==0.2
wrapt==1.12.1
