<svg width="24" height="24" viewBox="0 0 24 24" fill="none" xmlns="http://www.w3.org/2000/svg">
<mask id="mask0" mask-type="alpha" maskUnits="userSpaceOnUse" x="0" y="0" width="24" height="24">
<rect width="24" height="24" rx="4" fill="#C4C4C4"/>
</mask>
<g mask="url(#mask0)">
<rect x="43.4399" y="-0.23999" width="24.3491" height="51.84" transform="rotate(90 43.4399 -0.23999)" fill="white"/>
<path d="M12.7288 3.49094L-8.59633 26.0404L-8.59633 -19.0585L12.7288 3.49094Z" fill="#0D8BFF"/>
<path d="M27.2403 24.24L5.10469 -0.24001L49.3759 -0.240006L27.2403 24.24Z" fill="#FC3F74"/>
<path d="M10.1064 5.28003L29.4588 26.6051H-9.24593L10.1064 5.28003Z" fill="#EDCB61"/>
</g>
</svg>
