{
  "rel": {
    "catalog": "pg_catalog",
    "schema": "pg_catalog",
    "name": "pg_description"
  },
  "columns": [
    {
      "name": "tableoid",
      "not_null": true,
      "length": 4,
      "table": {
        "catalog": "pg_catalog",
        "schema": "pg_catalog",
        "name": "pg_description"
      },
      "type": {
        "name": "oid"
      }
    },
    {
      "name": "cmax",
      "not_null": true,
      "length": 4,
      "table": {
        "catalog": "pg_catalog",
        "schema": "pg_catalog",
        "name": "pg_description"
      },
      "type": {
        "name": "cid"
      }
    },
    {
      "name": "xmax",
      "not_null": true,
      "length": 4,
      "table": {
        "catalog": "pg_catalog",
        "schema": "pg_catalog",
        "name": "pg_description"
      },
      "type": {
        "name": "xid"
      }
    },
    {
      "name": "cmin",
      "not_null": true,
      "length": 4,
      "table": {
        "catalog": "pg_catalog",
        "schema": "pg_catalog",
        "name": "pg_description"
      },
      "type": {
        "name": "cid"
      }
    },
    {
      "name": "xmin",
      "not_null": true,
      "length": 4,
      "table": {
        "catalog": "pg_catalog",
        "schema": "pg_catalog",
        "name": "pg_description"
      },
      "type": {
        "name": "xid"
      }
    },
    {
      "name": "ctid",
      "not_null": true,
      "length": 6,
      "table": {
        "catalog": "pg_catalog",
        "schema": "pg_catalog",
        "name": "pg_description"
      },
      "type": {
        "name": "tid"
      }
    },
    {
      "name": "objoid",
      "not_null": true,
      "length": 4,
      "table": {
        "catalog": "pg_catalog",
        "schema": "pg_catalog",
        "name": "pg_description"
      },
      "type": {
        "name": "oid"
      }
    },
    {
      "name": "classoid",
      "not_null": true,
      "length": 4,
      "table": {
        "catalog": "pg_catalog",
        "schema": "pg_catalog",
        "name": "pg_description"
      },
      "type": {
        "name": "oid"
      }
    },
    {
      "name": "objsubid",
      "not_null": true,
      "length": 4,
      "table": {
        "catalog": "pg_catalog",
        "schema": "pg_catalog",
        "name": "pg_description"
      },
      "type": {
        "name": "int4"
      }
    },
    {
      "name": "description",
      "not_null": true,
      "length": -1,
      "table": {
        "catalog": "pg_catalog",
        "schema": "pg_catalog",
        "name": "pg_description"
      },
      "type": {
        "name": "text"
      }
    }
  ]
}
