{
  "rel": {
    "catalog": "pg_catalog",
    "schema": "pg_catalog",
    "name": "pg_shmem_allocations"
  },
  "columns": [
    {
      "name": "name",
      "length": -1,
      "table": {
        "catalog": "pg_catalog",
        "schema": "pg_catalog",
        "name": "pg_shmem_allocations"
      },
      "type": {
        "name": "text"
      }
    },
    {
      "name": "off",
      "length": 8,
      "table": {
        "catalog": "pg_catalog",
        "schema": "pg_catalog",
        "name": "pg_shmem_allocations"
      },
      "type": {
        "name": "int8"
      }
    },
    {
      "name": "size",
      "length": 8,
      "table": {
        "catalog": "pg_catalog",
        "schema": "pg_catalog",
        "name": "pg_shmem_allocations"
      },
      "type": {
        "name": "int8"
      }
    },
    {
      "name": "allocated_size",
      "length": 8,
      "table": {
        "catalog": "pg_catalog",
        "schema": "pg_catalog",
        "name": "pg_shmem_allocations"
      },
      "type": {
        "name": "int8"
      }
    }
  ]
}
