{
  "rel": {
    "catalog": "pg_catalog",
    "schema": "information_schema",
    "name": "information_schema_catalog_name"
  },
  "columns": [
    {
      "name": "catalog_name",
      "length": 64,
      "table": {
        "catalog": "pg_catalog",
        "schema": "information_schema",
        "name": "information_schema_catalog_name"
      },
      "type": {
        "name": "sql_identifier"
      }
    }
  ]
}
