{
  "rel": {
    "catalog": "pg_catalog",
    "schema": "pg_catalog",
    "name": "pg_stat_replication"
  },
  "columns": [
    {
      "name": "pid",
      "length": 4,
      "table": {
        "catalog": "pg_catalog",
        "schema": "pg_catalog",
        "name": "pg_stat_replication"
      },
      "type": {
        "name": "int4"
      }
    },
    {
      "name": "usesysid",
      "length": 4,
      "table": {
        "catalog": "pg_catalog",
        "schema": "pg_catalog",
        "name": "pg_stat_replication"
      },
      "type": {
        "name": "oid"
      }
    },
    {
      "name": "usename",
      "length": 64,
      "table": {
        "catalog": "pg_catalog",
        "schema": "pg_catalog",
        "name": "pg_stat_replication"
      },
      "type": {
        "name": "name"
      }
    },
    {
      "name": "application_name",
      "length": -1,
      "table": {
        "catalog": "pg_catalog",
        "schema": "pg_catalog",
        "name": "pg_stat_replication"
      },
      "type": {
        "name": "text"
      }
    },
    {
      "name": "client_addr",
      "length": -1,
      "table": {
        "catalog": "pg_catalog",
        "schema": "pg_catalog",
        "name": "pg_stat_replication"
      },
      "type": {
        "name": "inet"
      }
    },
    {
      "name": "client_hostname",
      "length": -1,
      "table": {
        "catalog": "pg_catalog",
        "schema": "pg_catalog",
        "name": "pg_stat_replication"
      },
      "type": {
        "name": "text"
      }
    },
    {
      "name": "client_port",
      "length": 4,
      "table": {
        "catalog": "pg_catalog",
        "schema": "pg_catalog",
        "name": "pg_stat_replication"
      },
      "type": {
        "name": "int4"
      }
    },
    {
      "name": "backend_start",
      "length": 8,
      "table": {
        "catalog": "pg_catalog",
        "schema": "pg_catalog",
        "name": "pg_stat_replication"
      },
      "type": {
        "name": "timestamptz"
      }
    },
    {
      "name": "backend_xmin",
      "length": 4,
      "table": {
        "catalog": "pg_catalog",
        "schema": "pg_catalog",
        "name": "pg_stat_replication"
      },
      "type": {
        "name": "xid"
      }
    },
    {
      "name": "state",
      "length": -1,
      "table": {
        "catalog": "pg_catalog",
        "schema": "pg_catalog",
        "name": "pg_stat_replication"
      },
      "type": {
        "name": "text"
      }
    },
    {
      "name": "sent_lsn",
      "length": 8,
      "table": {
        "catalog": "pg_catalog",
        "schema": "pg_catalog",
        "name": "pg_stat_replication"
      },
      "type": {
        "name": "pg_lsn"
      }
    },
    {
      "name": "write_lsn",
      "length": 8,
      "table": {
        "catalog": "pg_catalog",
        "schema": "pg_catalog",
        "name": "pg_stat_replication"
      },
      "type": {
        "name": "pg_lsn"
      }
    },
    {
      "name": "flush_lsn",
      "length": 8,
      "table": {
        "catalog": "pg_catalog",
        "schema": "pg_catalog",
        "name": "pg_stat_replication"
      },
      "type": {
        "name": "pg_lsn"
      }
    },
    {
      "name": "replay_lsn",
      "length": 8,
      "table": {
        "catalog": "pg_catalog",
        "schema": "pg_catalog",
        "name": "pg_stat_replication"
      },
      "type": {
        "name": "pg_lsn"
      }
    },
    {
      "name": "write_lag",
      "length": 16,
      "table": {
        "catalog": "pg_catalog",
        "schema": "pg_catalog",
        "name": "pg_stat_replication"
      },
      "type": {
        "name": "interval"
      }
    },
    {
      "name": "flush_lag",
      "length": 16,
      "table": {
        "catalog": "pg_catalog",
        "schema": "pg_catalog",
        "name": "pg_stat_replication"
      },
      "type": {
        "name": "interval"
      }
    },
    {
      "name": "replay_lag",
      "length": 16,
      "table": {
        "catalog": "pg_catalog",
        "schema": "pg_catalog",
        "name": "pg_stat_replication"
      },
      "type": {
        "name": "interval"
      }
    },
    {
      "name": "sync_priority",
      "length": 4,
      "table": {
        "catalog": "pg_catalog",
        "schema": "pg_catalog",
        "name": "pg_stat_replication"
      },
      "type": {
        "name": "int4"
      }
    },
    {
      "name": "sync_state",
      "length": -1,
      "table": {
        "catalog": "pg_catalog",
        "schema": "pg_catalog",
        "name": "pg_stat_replication"
      },
      "type": {
        "name": "text"
      }
    },
    {
      "name": "reply_time",
      "length": 8,
      "table": {
        "catalog": "pg_catalog",
        "schema": "pg_catalog",
        "name": "pg_stat_replication"
      },
      "type": {
        "name": "timestamptz"
      }
    }
  ]
}
