{
  "rel": {
    "catalog": "pg_catalog",
    "schema": "pg_catalog",
    "name": "pg_language"
  },
  "columns": [
    {
      "name": "tableoid",
      "not_null": true,
      "length": 4,
      "table": {
        "catalog": "pg_catalog",
        "schema": "pg_catalog",
        "name": "pg_language"
      },
      "type": {
        "name": "oid"
      }
    },
    {
      "name": "cmax",
      "not_null": true,
      "length": 4,
      "table": {
        "catalog": "pg_catalog",
        "schema": "pg_catalog",
        "name": "pg_language"
      },
      "type": {
        "name": "cid"
      }
    },
    {
      "name": "xmax",
      "not_null": true,
      "length": 4,
      "table": {
        "catalog": "pg_catalog",
        "schema": "pg_catalog",
        "name": "pg_language"
      },
      "type": {
        "name": "xid"
      }
    },
    {
      "name": "cmin",
      "not_null": true,
      "length": 4,
      "table": {
        "catalog": "pg_catalog",
        "schema": "pg_catalog",
        "name": "pg_language"
      },
      "type": {
        "name": "cid"
      }
    },
    {
      "name": "xmin",
      "not_null": true,
      "length": 4,
      "table": {
        "catalog": "pg_catalog",
        "schema": "pg_catalog",
        "name": "pg_language"
      },
      "type": {
        "name": "xid"
      }
    },
    {
      "name": "ctid",
      "not_null": true,
      "length": 6,
      "table": {
        "catalog": "pg_catalog",
        "schema": "pg_catalog",
        "name": "pg_language"
      },
      "type": {
        "name": "tid"
      }
    },
    {
      "name": "oid",
      "not_null": true,
      "length": 4,
      "table": {
        "catalog": "pg_catalog",
        "schema": "pg_catalog",
        "name": "pg_language"
      },
      "type": {
        "name": "oid"
      }
    },
    {
      "name": "lanname",
      "not_null": true,
      "length": 64,
      "table": {
        "catalog": "pg_catalog",
        "schema": "pg_catalog",
        "name": "pg_language"
      },
      "type": {
        "name": "name"
      }
    },
    {
      "name": "lanowner",
      "not_null": true,
      "length": 4,
      "table": {
        "catalog": "pg_catalog",
        "schema": "pg_catalog",
        "name": "pg_language"
      },
      "type": {
        "name": "oid"
      }
    },
    {
      "name": "lanispl",
      "not_null": true,
      "length": 1,
      "table": {
        "catalog": "pg_catalog",
        "schema": "pg_catalog",
        "name": "pg_language"
      },
      "type": {
        "name": "bool"
      }
    },
    {
      "name": "lanpltrusted",
      "not_null": true,
      "length": 1,
      "table": {
        "catalog": "pg_catalog",
        "schema": "pg_catalog",
        "name": "pg_language"
      },
      "type": {
        "name": "bool"
      }
    },
    {
      "name": "lanplcallfoid",
      "not_null": true,
      "length": 4,
      "table": {
        "catalog": "pg_catalog",
        "schema": "pg_catalog",
        "name": "pg_language"
      },
      "type": {
        "name": "oid"
      }
    },
    {
      "name": "laninline",
      "not_null": true,
      "length": 4,
      "table": {
        "catalog": "pg_catalog",
        "schema": "pg_catalog",
        "name": "pg_language"
      },
      "type": {
        "name": "oid"
      }
    },
    {
      "name": "lanvalidator",
      "not_null": true,
      "length": 4,
      "table": {
        "catalog": "pg_catalog",
        "schema": "pg_catalog",
        "name": "pg_language"
      },
      "type": {
        "name": "oid"
      }
    },
    {
      "name": "lanacl",
      "is_array": true,
      "length": -1,
      "table": {
        "catalog": "pg_catalog",
        "schema": "pg_catalog",
        "name": "pg_language"
      },
      "type": {
        "name": "_aclitem"
      }
    }
  ]
}
