{
  "rel": {
    "catalog": "pg_catalog",
    "schema": "pg_catalog",
    "name": "pg_views"
  },
  "columns": [
    {
      "name": "schemaname",
      "length": 64,
      "table": {
        "catalog": "pg_catalog",
        "schema": "pg_catalog",
        "name": "pg_views"
      },
      "type": {
        "name": "name"
      }
    },
    {
      "name": "viewname",
      "length": 64,
      "table": {
        "catalog": "pg_catalog",
        "schema": "pg_catalog",
        "name": "pg_views"
      },
      "type": {
        "name": "name"
      }
    },
    {
      "name": "viewowner",
      "length": 64,
      "table": {
        "catalog": "pg_catalog",
        "schema": "pg_catalog",
        "name": "pg_views"
      },
      "type": {
        "name": "name"
      }
    },
    {
      "name": "definition",
      "length": -1,
      "table": {
        "catalog": "pg_catalog",
        "schema": "pg_catalog",
        "name": "pg_views"
      },
      "type": {
        "name": "text"
      }
    }
  ]
}
