{
  "rel": {
    "catalog": "pg_catalog",
    "schema": "pg_catalog",
    "name": "pg_index"
  },
  "columns": [
    {
      "name": "tableoid",
      "not_null": true,
      "length": 4,
      "table": {
        "catalog": "pg_catalog",
        "schema": "pg_catalog",
        "name": "pg_index"
      },
      "type": {
        "name": "oid"
      }
    },
    {
      "name": "cmax",
      "not_null": true,
      "length": 4,
      "table": {
        "catalog": "pg_catalog",
        "schema": "pg_catalog",
        "name": "pg_index"
      },
      "type": {
        "name": "cid"
      }
    },
    {
      "name": "xmax",
      "not_null": true,
      "length": 4,
      "table": {
        "catalog": "pg_catalog",
        "schema": "pg_catalog",
        "name": "pg_index"
      },
      "type": {
        "name": "xid"
      }
    },
    {
      "name": "cmin",
      "not_null": true,
      "length": 4,
      "table": {
        "catalog": "pg_catalog",
        "schema": "pg_catalog",
        "name": "pg_index"
      },
      "type": {
        "name": "cid"
      }
    },
    {
      "name": "xmin",
      "not_null": true,
      "length": 4,
      "table": {
        "catalog": "pg_catalog",
        "schema": "pg_catalog",
        "name": "pg_index"
      },
      "type": {
        "name": "xid"
      }
    },
    {
      "name": "ctid",
      "not_null": true,
      "length": 6,
      "table": {
        "catalog": "pg_catalog",
        "schema": "pg_catalog",
        "name": "pg_index"
      },
      "type": {
        "name": "tid"
      }
    },
    {
      "name": "indexrelid",
      "not_null": true,
      "length": 4,
      "table": {
        "catalog": "pg_catalog",
        "schema": "pg_catalog",
        "name": "pg_index"
      },
      "type": {
        "name": "oid"
      }
    },
    {
      "name": "indrelid",
      "not_null": true,
      "length": 4,
      "table": {
        "catalog": "pg_catalog",
        "schema": "pg_catalog",
        "name": "pg_index"
      },
      "type": {
        "name": "oid"
      }
    },
    {
      "name": "indnatts",
      "not_null": true,
      "length": 2,
      "table": {
        "catalog": "pg_catalog",
        "schema": "pg_catalog",
        "name": "pg_index"
      },
      "type": {
        "name": "int2"
      }
    },
    {
      "name": "indnkeyatts",
      "not_null": true,
      "length": 2,
      "table": {
        "catalog": "pg_catalog",
        "schema": "pg_catalog",
        "name": "pg_index"
      },
      "type": {
        "name": "int2"
      }
    },
    {
      "name": "indisunique",
      "not_null": true,
      "length": 1,
      "table": {
        "catalog": "pg_catalog",
        "schema": "pg_catalog",
        "name": "pg_index"
      },
      "type": {
        "name": "bool"
      }
    },
    {
      "name": "indisprimary",
      "not_null": true,
      "length": 1,
      "table": {
        "catalog": "pg_catalog",
        "schema": "pg_catalog",
        "name": "pg_index"
      },
      "type": {
        "name": "bool"
      }
    },
    {
      "name": "indisexclusion",
      "not_null": true,
      "length": 1,
      "table": {
        "catalog": "pg_catalog",
        "schema": "pg_catalog",
        "name": "pg_index"
      },
      "type": {
        "name": "bool"
      }
    },
    {
      "name": "indimmediate",
      "not_null": true,
      "length": 1,
      "table": {
        "catalog": "pg_catalog",
        "schema": "pg_catalog",
        "name": "pg_index"
      },
      "type": {
        "name": "bool"
      }
    },
    {
      "name": "indisclustered",
      "not_null": true,
      "length": 1,
      "table": {
        "catalog": "pg_catalog",
        "schema": "pg_catalog",
        "name": "pg_index"
      },
      "type": {
        "name": "bool"
      }
    },
    {
      "name": "indisvalid",
      "not_null": true,
      "length": 1,
      "table": {
        "catalog": "pg_catalog",
        "schema": "pg_catalog",
        "name": "pg_index"
      },
      "type": {
        "name": "bool"
      }
    },
    {
      "name": "indcheckxmin",
      "not_null": true,
      "length": 1,
      "table": {
        "catalog": "pg_catalog",
        "schema": "pg_catalog",
        "name": "pg_index"
      },
      "type": {
        "name": "bool"
      }
    },
    {
      "name": "indisready",
      "not_null": true,
      "length": 1,
      "table": {
        "catalog": "pg_catalog",
        "schema": "pg_catalog",
        "name": "pg_index"
      },
      "type": {
        "name": "bool"
      }
    },
    {
      "name": "indislive",
      "not_null": true,
      "length": 1,
      "table": {
        "catalog": "pg_catalog",
        "schema": "pg_catalog",
        "name": "pg_index"
      },
      "type": {
        "name": "bool"
      }
    },
    {
      "name": "indisreplident",
      "not_null": true,
      "length": 1,
      "table": {
        "catalog": "pg_catalog",
        "schema": "pg_catalog",
        "name": "pg_index"
      },
      "type": {
        "name": "bool"
      }
    },
    {
      "name": "indkey",
      "not_null": true,
      "is_array": true,
      "length": -1,
      "table": {
        "catalog": "pg_catalog",
        "schema": "pg_catalog",
        "name": "pg_index"
      },
      "type": {
        "name": "int2vector"
      }
    },
    {
      "name": "indcollation",
      "not_null": true,
      "is_array": true,
      "length": -1,
      "table": {
        "catalog": "pg_catalog",
        "schema": "pg_catalog",
        "name": "pg_index"
      },
      "type": {
        "name": "oidvector"
      }
    },
    {
      "name": "indclass",
      "not_null": true,
      "is_array": true,
      "length": -1,
      "table": {
        "catalog": "pg_catalog",
        "schema": "pg_catalog",
        "name": "pg_index"
      },
      "type": {
        "name": "oidvector"
      }
    },
    {
      "name": "indoption",
      "not_null": true,
      "is_array": true,
      "length": -1,
      "table": {
        "catalog": "pg_catalog",
        "schema": "pg_catalog",
        "name": "pg_index"
      },
      "type": {
        "name": "int2vector"
      }
    },
    {
      "name": "indexprs",
      "length": -1,
      "table": {
        "catalog": "pg_catalog",
        "schema": "pg_catalog",
        "name": "pg_index"
      },
      "type": {
        "name": "pg_node_tree"
      }
    },
    {
      "name": "indpred",
      "length": -1,
      "table": {
        "catalog": "pg_catalog",
        "schema": "pg_catalog",
        "name": "pg_index"
      },
      "type": {
        "name": "pg_node_tree"
      }
    }
  ]
}
