{
  "rel": {
    "catalog": "pg_catalog",
    "schema": "pg_catalog",
    "name": "pg_tables"
  },
  "columns": [
    {
      "name": "schemaname",
      "length": 64,
      "table": {
        "catalog": "pg_catalog",
        "schema": "pg_catalog",
        "name": "pg_tables"
      },
      "type": {
        "name": "name"
      }
    },
    {
      "name": "tablename",
      "length": 64,
      "table": {
        "catalog": "pg_catalog",
        "schema": "pg_catalog",
        "name": "pg_tables"
      },
      "type": {
        "name": "name"
      }
    },
    {
      "name": "tableowner",
      "length": 64,
      "table": {
        "catalog": "pg_catalog",
        "schema": "pg_catalog",
        "name": "pg_tables"
      },
      "type": {
        "name": "name"
      }
    },
    {
      "name": "tablespace",
      "length": 64,
      "table": {
        "catalog": "pg_catalog",
        "schema": "pg_catalog",
        "name": "pg_tables"
      },
      "type": {
        "name": "name"
      }
    },
    {
      "name": "hasindexes",
      "length": 1,
      "table": {
        "catalog": "pg_catalog",
        "schema": "pg_catalog",
        "name": "pg_tables"
      },
      "type": {
        "name": "bool"
      }
    },
    {
      "name": "hasrules",
      "length": 1,
      "table": {
        "catalog": "pg_catalog",
        "schema": "pg_catalog",
        "name": "pg_tables"
      },
      "type": {
        "name": "bool"
      }
    },
    {
      "name": "hastriggers",
      "length": 1,
      "table": {
        "catalog": "pg_catalog",
        "schema": "pg_catalog",
        "name": "pg_tables"
      },
      "type": {
        "name": "bool"
      }
    },
    {
      "name": "rowsecurity",
      "length": 1,
      "table": {
        "catalog": "pg_catalog",
        "schema": "pg_catalog",
        "name": "pg_tables"
      },
      "type": {
        "name": "bool"
      }
    }
  ]
}
