{
  "rel": {
    "catalog": "pg_catalog",
    "schema": "information_schema",
    "name": "column_privileges"
  },
  "columns": [
    {
      "name": "grantor",
      "length": 64,
      "table": {
        "catalog": "pg_catalog",
        "schema": "information_schema",
        "name": "column_privileges"
      },
      "type": {
        "name": "sql_identifier"
      }
    },
    {
      "name": "grantee",
      "length": 64,
      "table": {
        "catalog": "pg_catalog",
        "schema": "information_schema",
        "name": "column_privileges"
      },
      "type": {
        "name": "sql_identifier"
      }
    },
    {
      "name": "table_catalog",
      "length": 64,
      "table": {
        "catalog": "pg_catalog",
        "schema": "information_schema",
        "name": "column_privileges"
      },
      "type": {
        "name": "sql_identifier"
      }
    },
    {
      "name": "table_schema",
      "length": 64,
      "table": {
        "catalog": "pg_catalog",
        "schema": "information_schema",
        "name": "column_privileges"
      },
      "type": {
        "name": "sql_identifier"
      }
    },
    {
      "name": "table_name",
      "length": 64,
      "table": {
        "catalog": "pg_catalog",
        "schema": "information_schema",
        "name": "column_privileges"
      },
      "type": {
        "name": "sql_identifier"
      }
    },
    {
      "name": "column_name",
      "length": 64,
      "table": {
        "catalog": "pg_catalog",
        "schema": "information_schema",
        "name": "column_privileges"
      },
      "type": {
        "name": "sql_identifier"
      }
    },
    {
      "name": "privilege_type",
      "length": -1,
      "table": {
        "catalog": "pg_catalog",
        "schema": "information_schema",
        "name": "column_privileges"
      },
      "type": {
        "name": "character_data"
      }
    },
    {
      "name": "is_grantable",
      "length": -1,
      "table": {
        "catalog": "pg_catalog",
        "schema": "information_schema",
        "name": "column_privileges"
      },
      "type": {
        "name": "yes_or_no"
      }
    }
  ]
}
