{
  "rel": {
    "catalog": "pg_catalog",
    "schema": "pg_catalog",
    "name": "pg_stat_progress_cluster"
  },
  "columns": [
    {
      "name": "pid",
      "length": 4,
      "table": {
        "catalog": "pg_catalog",
        "schema": "pg_catalog",
        "name": "pg_stat_progress_cluster"
      },
      "type": {
        "name": "int4"
      }
    },
    {
      "name": "datid",
      "length": 4,
      "table": {
        "catalog": "pg_catalog",
        "schema": "pg_catalog",
        "name": "pg_stat_progress_cluster"
      },
      "type": {
        "name": "oid"
      }
    },
    {
      "name": "datname",
      "length": 64,
      "table": {
        "catalog": "pg_catalog",
        "schema": "pg_catalog",
        "name": "pg_stat_progress_cluster"
      },
      "type": {
        "name": "name"
      }
    },
    {
      "name": "relid",
      "length": 4,
      "table": {
        "catalog": "pg_catalog",
        "schema": "pg_catalog",
        "name": "pg_stat_progress_cluster"
      },
      "type": {
        "name": "oid"
      }
    },
    {
      "name": "command",
      "length": -1,
      "table": {
        "catalog": "pg_catalog",
        "schema": "pg_catalog",
        "name": "pg_stat_progress_cluster"
      },
      "type": {
        "name": "text"
      }
    },
    {
      "name": "phase",
      "length": -1,
      "table": {
        "catalog": "pg_catalog",
        "schema": "pg_catalog",
        "name": "pg_stat_progress_cluster"
      },
      "type": {
        "name": "text"
      }
    },
    {
      "name": "cluster_index_relid",
      "length": 4,
      "table": {
        "catalog": "pg_catalog",
        "schema": "pg_catalog",
        "name": "pg_stat_progress_cluster"
      },
      "type": {
        "name": "oid"
      }
    },
    {
      "name": "heap_tuples_scanned",
      "length": 8,
      "table": {
        "catalog": "pg_catalog",
        "schema": "pg_catalog",
        "name": "pg_stat_progress_cluster"
      },
      "type": {
        "name": "int8"
      }
    },
    {
      "name": "heap_tuples_written",
      "length": 8,
      "table": {
        "catalog": "pg_catalog",
        "schema": "pg_catalog",
        "name": "pg_stat_progress_cluster"
      },
      "type": {
        "name": "int8"
      }
    },
    {
      "name": "heap_blks_total",
      "length": 8,
      "table": {
        "catalog": "pg_catalog",
        "schema": "pg_catalog",
        "name": "pg_stat_progress_cluster"
      },
      "type": {
        "name": "int8"
      }
    },
    {
      "name": "heap_blks_scanned",
      "length": 8,
      "table": {
        "catalog": "pg_catalog",
        "schema": "pg_catalog",
        "name": "pg_stat_progress_cluster"
      },
      "type": {
        "name": "int8"
      }
    },
    {
      "name": "index_rebuild_count",
      "length": 8,
      "table": {
        "catalog": "pg_catalog",
        "schema": "pg_catalog",
        "name": "pg_stat_progress_cluster"
      },
      "type": {
        "name": "int8"
      }
    }
  ]
}
