{
  "rel": {
    "catalog": "pg_catalog",
    "schema": "pg_catalog",
    "name": "pg_stat_all_tables"
  },
  "columns": [
    {
      "name": "relid",
      "length": 4,
      "table": {
        "catalog": "pg_catalog",
        "schema": "pg_catalog",
        "name": "pg_stat_all_tables"
      },
      "type": {
        "name": "oid"
      }
    },
    {
      "name": "schemaname",
      "length": 64,
      "table": {
        "catalog": "pg_catalog",
        "schema": "pg_catalog",
        "name": "pg_stat_all_tables"
      },
      "type": {
        "name": "name"
      }
    },
    {
      "name": "relname",
      "length": 64,
      "table": {
        "catalog": "pg_catalog",
        "schema": "pg_catalog",
        "name": "pg_stat_all_tables"
      },
      "type": {
        "name": "name"
      }
    },
    {
      "name": "seq_scan",
      "length": 8,
      "table": {
        "catalog": "pg_catalog",
        "schema": "pg_catalog",
        "name": "pg_stat_all_tables"
      },
      "type": {
        "name": "int8"
      }
    },
    {
      "name": "seq_tup_read",
      "length": 8,
      "table": {
        "catalog": "pg_catalog",
        "schema": "pg_catalog",
        "name": "pg_stat_all_tables"
      },
      "type": {
        "name": "int8"
      }
    },
    {
      "name": "idx_scan",
      "length": 8,
      "table": {
        "catalog": "pg_catalog",
        "schema": "pg_catalog",
        "name": "pg_stat_all_tables"
      },
      "type": {
        "name": "int8"
      }
    },
    {
      "name": "idx_tup_fetch",
      "length": 8,
      "table": {
        "catalog": "pg_catalog",
        "schema": "pg_catalog",
        "name": "pg_stat_all_tables"
      },
      "type": {
        "name": "int8"
      }
    },
    {
      "name": "n_tup_ins",
      "length": 8,
      "table": {
        "catalog": "pg_catalog",
        "schema": "pg_catalog",
        "name": "pg_stat_all_tables"
      },
      "type": {
        "name": "int8"
      }
    },
    {
      "name": "n_tup_upd",
      "length": 8,
      "table": {
        "catalog": "pg_catalog",
        "schema": "pg_catalog",
        "name": "pg_stat_all_tables"
      },
      "type": {
        "name": "int8"
      }
    },
    {
      "name": "n_tup_del",
      "length": 8,
      "table": {
        "catalog": "pg_catalog",
        "schema": "pg_catalog",
        "name": "pg_stat_all_tables"
      },
      "type": {
        "name": "int8"
      }
    },
    {
      "name": "n_tup_hot_upd",
      "length": 8,
      "table": {
        "catalog": "pg_catalog",
        "schema": "pg_catalog",
        "name": "pg_stat_all_tables"
      },
      "type": {
        "name": "int8"
      }
    },
    {
      "name": "n_live_tup",
      "length": 8,
      "table": {
        "catalog": "pg_catalog",
        "schema": "pg_catalog",
        "name": "pg_stat_all_tables"
      },
      "type": {
        "name": "int8"
      }
    },
    {
      "name": "n_dead_tup",
      "length": 8,
      "table": {
        "catalog": "pg_catalog",
        "schema": "pg_catalog",
        "name": "pg_stat_all_tables"
      },
      "type": {
        "name": "int8"
      }
    },
    {
      "name": "n_mod_since_analyze",
      "length": 8,
      "table": {
        "catalog": "pg_catalog",
        "schema": "pg_catalog",
        "name": "pg_stat_all_tables"
      },
      "type": {
        "name": "int8"
      }
    },
    {
      "name": "n_ins_since_vacuum",
      "length": 8,
      "table": {
        "catalog": "pg_catalog",
        "schema": "pg_catalog",
        "name": "pg_stat_all_tables"
      },
      "type": {
        "name": "int8"
      }
    },
    {
      "name": "last_vacuum",
      "length": 8,
      "table": {
        "catalog": "pg_catalog",
        "schema": "pg_catalog",
        "name": "pg_stat_all_tables"
      },
      "type": {
        "name": "timestamptz"
      }
    },
    {
      "name": "last_autovacuum",
      "length": 8,
      "table": {
        "catalog": "pg_catalog",
        "schema": "pg_catalog",
        "name": "pg_stat_all_tables"
      },
      "type": {
        "name": "timestamptz"
      }
    },
    {
      "name": "last_analyze",
      "length": 8,
      "table": {
        "catalog": "pg_catalog",
        "schema": "pg_catalog",
        "name": "pg_stat_all_tables"
      },
      "type": {
        "name": "timestamptz"
      }
    },
    {
      "name": "last_autoanalyze",
      "length": 8,
      "table": {
        "catalog": "pg_catalog",
        "schema": "pg_catalog",
        "name": "pg_stat_all_tables"
      },
      "type": {
        "name": "timestamptz"
      }
    },
    {
      "name": "vacuum_count",
      "length": 8,
      "table": {
        "catalog": "pg_catalog",
        "schema": "pg_catalog",
        "name": "pg_stat_all_tables"
      },
      "type": {
        "name": "int8"
      }
    },
    {
      "name": "autovacuum_count",
      "length": 8,
      "table": {
        "catalog": "pg_catalog",
        "schema": "pg_catalog",
        "name": "pg_stat_all_tables"
      },
      "type": {
        "name": "int8"
      }
    },
    {
      "name": "analyze_count",
      "length": 8,
      "table": {
        "catalog": "pg_catalog",
        "schema": "pg_catalog",
        "name": "pg_stat_all_tables"
      },
      "type": {
        "name": "int8"
      }
    },
    {
      "name": "autoanalyze_count",
      "length": 8,
      "table": {
        "catalog": "pg_catalog",
        "schema": "pg_catalog",
        "name": "pg_stat_all_tables"
      },
      "type": {
        "name": "int8"
      }
    }
  ]
}
