{
  "rel": {
    "catalog": "pg_catalog",
    "schema": "information_schema",
    "name": "attributes"
  },
  "columns": [
    {
      "name": "udt_catalog",
      "length": 64,
      "table": {
        "catalog": "pg_catalog",
        "schema": "information_schema",
        "name": "attributes"
      },
      "type": {
        "name": "sql_identifier"
      }
    },
    {
      "name": "udt_schema",
      "length": 64,
      "table": {
        "catalog": "pg_catalog",
        "schema": "information_schema",
        "name": "attributes"
      },
      "type": {
        "name": "sql_identifier"
      }
    },
    {
      "name": "udt_name",
      "length": 64,
      "table": {
        "catalog": "pg_catalog",
        "schema": "information_schema",
        "name": "attributes"
      },
      "type": {
        "name": "sql_identifier"
      }
    },
    {
      "name": "attribute_name",
      "length": 64,
      "table": {
        "catalog": "pg_catalog",
        "schema": "information_schema",
        "name": "attributes"
      },
      "type": {
        "name": "sql_identifier"
      }
    },
    {
      "name": "ordinal_position",
      "length": 4,
      "table": {
        "catalog": "pg_catalog",
        "schema": "information_schema",
        "name": "attributes"
      },
      "type": {
        "name": "cardinal_number"
      }
    },
    {
      "name": "attribute_default",
      "length": -1,
      "table": {
        "catalog": "pg_catalog",
        "schema": "information_schema",
        "name": "attributes"
      },
      "type": {
        "name": "character_data"
      }
    },
    {
      "name": "is_nullable",
      "length": -1,
      "table": {
        "catalog": "pg_catalog",
        "schema": "information_schema",
        "name": "attributes"
      },
      "type": {
        "name": "yes_or_no"
      }
    },
    {
      "name": "data_type",
      "length": -1,
      "table": {
        "catalog": "pg_catalog",
        "schema": "information_schema",
        "name": "attributes"
      },
      "type": {
        "name": "character_data"
      }
    },
    {
      "name": "character_maximum_length",
      "length": 4,
      "table": {
        "catalog": "pg_catalog",
        "schema": "information_schema",
        "name": "attributes"
      },
      "type": {
        "name": "cardinal_number"
      }
    },
    {
      "name": "character_octet_length",
      "length": 4,
      "table": {
        "catalog": "pg_catalog",
        "schema": "information_schema",
        "name": "attributes"
      },
      "type": {
        "name": "cardinal_number"
      }
    },
    {
      "name": "character_set_catalog",
      "length": 64,
      "table": {
        "catalog": "pg_catalog",
        "schema": "information_schema",
        "name": "attributes"
      },
      "type": {
        "name": "sql_identifier"
      }
    },
    {
      "name": "character_set_schema",
      "length": 64,
      "table": {
        "catalog": "pg_catalog",
        "schema": "information_schema",
        "name": "attributes"
      },
      "type": {
        "name": "sql_identifier"
      }
    },
    {
      "name": "character_set_name",
      "length": 64,
      "table": {
        "catalog": "pg_catalog",
        "schema": "information_schema",
        "name": "attributes"
      },
      "type": {
        "name": "sql_identifier"
      }
    },
    {
      "name": "collation_catalog",
      "length": 64,
      "table": {
        "catalog": "pg_catalog",
        "schema": "information_schema",
        "name": "attributes"
      },
      "type": {
        "name": "sql_identifier"
      }
    },
    {
      "name": "collation_schema",
      "length": 64,
      "table": {
        "catalog": "pg_catalog",
        "schema": "information_schema",
        "name": "attributes"
      },
      "type": {
        "name": "sql_identifier"
      }
    },
    {
      "name": "collation_name",
      "length": 64,
      "table": {
        "catalog": "pg_catalog",
        "schema": "information_schema",
        "name": "attributes"
      },
      "type": {
        "name": "sql_identifier"
      }
    },
    {
      "name": "numeric_precision",
      "length": 4,
      "table": {
        "catalog": "pg_catalog",
        "schema": "information_schema",
        "name": "attributes"
      },
      "type": {
        "name": "cardinal_number"
      }
    },
    {
      "name": "numeric_precision_radix",
      "length": 4,
      "table": {
        "catalog": "pg_catalog",
        "schema": "information_schema",
        "name": "attributes"
      },
      "type": {
        "name": "cardinal_number"
      }
    },
    {
      "name": "numeric_scale",
      "length": 4,
      "table": {
        "catalog": "pg_catalog",
        "schema": "information_schema",
        "name": "attributes"
      },
      "type": {
        "name": "cardinal_number"
      }
    },
    {
      "name": "datetime_precision",
      "length": 4,
      "table": {
        "catalog": "pg_catalog",
        "schema": "information_schema",
        "name": "attributes"
      },
      "type": {
        "name": "cardinal_number"
      }
    },
    {
      "name": "interval_type",
      "length": -1,
      "table": {
        "catalog": "pg_catalog",
        "schema": "information_schema",
        "name": "attributes"
      },
      "type": {
        "name": "character_data"
      }
    },
    {
      "name": "interval_precision",
      "length": 4,
      "table": {
        "catalog": "pg_catalog",
        "schema": "information_schema",
        "name": "attributes"
      },
      "type": {
        "name": "cardinal_number"
      }
    },
    {
      "name": "attribute_udt_catalog",
      "length": 64,
      "table": {
        "catalog": "pg_catalog",
        "schema": "information_schema",
        "name": "attributes"
      },
      "type": {
        "name": "sql_identifier"
      }
    },
    {
      "name": "attribute_udt_schema",
      "length": 64,
      "table": {
        "catalog": "pg_catalog",
        "schema": "information_schema",
        "name": "attributes"
      },
      "type": {
        "name": "sql_identifier"
      }
    },
    {
      "name": "attribute_udt_name",
      "length": 64,
      "table": {
        "catalog": "pg_catalog",
        "schema": "information_schema",
        "name": "attributes"
      },
      "type": {
        "name": "sql_identifier"
      }
    },
    {
      "name": "scope_catalog",
      "length": 64,
      "table": {
        "catalog": "pg_catalog",
        "schema": "information_schema",
        "name": "attributes"
      },
      "type": {
        "name": "sql_identifier"
      }
    },
    {
      "name": "scope_schema",
      "length": 64,
      "table": {
        "catalog": "pg_catalog",
        "schema": "information_schema",
        "name": "attributes"
      },
      "type": {
        "name": "sql_identifier"
      }
    },
    {
      "name": "scope_name",
      "length": 64,
      "table": {
        "catalog": "pg_catalog",
        "schema": "information_schema",
        "name": "attributes"
      },
      "type": {
        "name": "sql_identifier"
      }
    },
    {
      "name": "maximum_cardinality",
      "length": 4,
      "table": {
        "catalog": "pg_catalog",
        "schema": "information_schema",
        "name": "attributes"
      },
      "type": {
        "name": "cardinal_number"
      }
    },
    {
      "name": "dtd_identifier",
      "length": 64,
      "table": {
        "catalog": "pg_catalog",
        "schema": "information_schema",
        "name": "attributes"
      },
      "type": {
        "name": "sql_identifier"
      }
    },
    {
      "name": "is_derived_reference_attribute",
      "length": -1,
      "table": {
        "catalog": "pg_catalog",
        "schema": "information_schema",
        "name": "attributes"
      },
      "type": {
        "name": "yes_or_no"
      }
    }
  ]
}
