{
  "rel": {
    "catalog": "pg_catalog",
    "schema": "pg_catalog",
    "name": "pg_user"
  },
  "columns": [
    {
      "name": "usename",
      "length": 64,
      "table": {
        "catalog": "pg_catalog",
        "schema": "pg_catalog",
        "name": "pg_user"
      },
      "type": {
        "name": "name"
      }
    },
    {
      "name": "usesysid",
      "length": 4,
      "table": {
        "catalog": "pg_catalog",
        "schema": "pg_catalog",
        "name": "pg_user"
      },
      "type": {
        "name": "oid"
      }
    },
    {
      "name": "usecreatedb",
      "length": 1,
      "table": {
        "catalog": "pg_catalog",
        "schema": "pg_catalog",
        "name": "pg_user"
      },
      "type": {
        "name": "bool"
      }
    },
    {
      "name": "usesuper",
      "length": 1,
      "table": {
        "catalog": "pg_catalog",
        "schema": "pg_catalog",
        "name": "pg_user"
      },
      "type": {
        "name": "bool"
      }
    },
    {
      "name": "userepl",
      "length": 1,
      "table": {
        "catalog": "pg_catalog",
        "schema": "pg_catalog",
        "name": "pg_user"
      },
      "type": {
        "name": "bool"
      }
    },
    {
      "name": "usebypassrls",
      "length": 1,
      "table": {
        "catalog": "pg_catalog",
        "schema": "pg_catalog",
        "name": "pg_user"
      },
      "type": {
        "name": "bool"
      }
    },
    {
      "name": "passwd",
      "length": -1,
      "table": {
        "catalog": "pg_catalog",
        "schema": "pg_catalog",
        "name": "pg_user"
      },
      "type": {
        "name": "text"
      }
    },
    {
      "name": "valuntil",
      "length": 8,
      "table": {
        "catalog": "pg_catalog",
        "schema": "pg_catalog",
        "name": "pg_user"
      },
      "type": {
        "name": "timestamptz"
      }
    },
    {
      "name": "useconfig",
      "is_array": true,
      "length": -1,
      "table": {
        "catalog": "pg_catalog",
        "schema": "pg_catalog",
        "name": "pg_user"
      },
      "type": {
        "name": "_text"
      }
    }
  ]
}
