{
  "rel": {
    "catalog": "pg_catalog",
    "schema": "pg_catalog",
    "name": "pg_stat_archiver"
  },
  "columns": [
    {
      "name": "archived_count",
      "length": 8,
      "table": {
        "catalog": "pg_catalog",
        "schema": "pg_catalog",
        "name": "pg_stat_archiver"
      },
      "type": {
        "name": "int8"
      }
    },
    {
      "name": "last_archived_wal",
      "length": -1,
      "table": {
        "catalog": "pg_catalog",
        "schema": "pg_catalog",
        "name": "pg_stat_archiver"
      },
      "type": {
        "name": "text"
      }
    },
    {
      "name": "last_archived_time",
      "length": 8,
      "table": {
        "catalog": "pg_catalog",
        "schema": "pg_catalog",
        "name": "pg_stat_archiver"
      },
      "type": {
        "name": "timestamptz"
      }
    },
    {
      "name": "failed_count",
      "length": 8,
      "table": {
        "catalog": "pg_catalog",
        "schema": "pg_catalog",
        "name": "pg_stat_archiver"
      },
      "type": {
        "name": "int8"
      }
    },
    {
      "name": "last_failed_wal",
      "length": -1,
      "table": {
        "catalog": "pg_catalog",
        "schema": "pg_catalog",
        "name": "pg_stat_archiver"
      },
      "type": {
        "name": "text"
      }
    },
    {
      "name": "last_failed_time",
      "length": 8,
      "table": {
        "catalog": "pg_catalog",
        "schema": "pg_catalog",
        "name": "pg_stat_archiver"
      },
      "type": {
        "name": "timestamptz"
      }
    },
    {
      "name": "stats_reset",
      "length": 8,
      "table": {
        "catalog": "pg_catalog",
        "schema": "pg_catalog",
        "name": "pg_stat_archiver"
      },
      "type": {
        "name": "timestamptz"
      }
    }
  ]
}
