{
  "rel": {
    "catalog": "pg_catalog",
    "schema": "pg_catalog",
    "name": "pg_group"
  },
  "columns": [
    {
      "name": "groname",
      "length": 64,
      "table": {
        "catalog": "pg_catalog",
        "schema": "pg_catalog",
        "name": "pg_group"
      },
      "type": {
        "name": "name"
      }
    },
    {
      "name": "grosysid",
      "length": 4,
      "table": {
        "catalog": "pg_catalog",
        "schema": "pg_catalog",
        "name": "pg_group"
      },
      "type": {
        "name": "oid"
      }
    },
    {
      "name": "grolist",
      "is_array": true,
      "length": -1,
      "table": {
        "catalog": "pg_catalog",
        "schema": "pg_catalog",
        "name": "pg_group"
      },
      "type": {
        "name": "_oid"
      }
    }
  ]
}
