{
  "rel": {
    "catalog": "pg_catalog",
    "schema": "information_schema",
    "name": "collations"
  },
  "columns": [
    {
      "name": "collation_catalog",
      "length": 64,
      "table": {
        "catalog": "pg_catalog",
        "schema": "information_schema",
        "name": "collations"
      },
      "type": {
        "name": "sql_identifier"
      }
    },
    {
      "name": "collation_schema",
      "length": 64,
      "table": {
        "catalog": "pg_catalog",
        "schema": "information_schema",
        "name": "collations"
      },
      "type": {
        "name": "sql_identifier"
      }
    },
    {
      "name": "collation_name",
      "length": 64,
      "table": {
        "catalog": "pg_catalog",
        "schema": "information_schema",
        "name": "collations"
      },
      "type": {
        "name": "sql_identifier"
      }
    },
    {
      "name": "pad_attribute",
      "length": -1,
      "table": {
        "catalog": "pg_catalog",
        "schema": "information_schema",
        "name": "collations"
      },
      "type": {
        "name": "character_data"
      }
    }
  ]
}
