{
  "rel": {
    "catalog": "pg_catalog",
    "schema": "information_schema",
    "name": "foreign_server_options"
  },
  "columns": [
    {
      "name": "foreign_server_catalog",
      "length": 64,
      "table": {
        "catalog": "pg_catalog",
        "schema": "information_schema",
        "name": "foreign_server_options"
      },
      "type": {
        "name": "sql_identifier"
      }
    },
    {
      "name": "foreign_server_name",
      "length": 64,
      "table": {
        "catalog": "pg_catalog",
        "schema": "information_schema",
        "name": "foreign_server_options"
      },
      "type": {
        "name": "sql_identifier"
      }
    },
    {
      "name": "option_name",
      "length": 64,
      "table": {
        "catalog": "pg_catalog",
        "schema": "information_schema",
        "name": "foreign_server_options"
      },
      "type": {
        "name": "sql_identifier"
      }
    },
    {
      "name": "option_value",
      "length": -1,
      "table": {
        "catalog": "pg_catalog",
        "schema": "information_schema",
        "name": "foreign_server_options"
      },
      "type": {
        "name": "character_data"
      }
    }
  ]
}
