{
  "rel": {
    "catalog": "pg_catalog",
    "schema": "pg_catalog",
    "name": "pg_stat_subscription"
  },
  "columns": [
    {
      "name": "subid",
      "length": 4,
      "table": {
        "catalog": "pg_catalog",
        "schema": "pg_catalog",
        "name": "pg_stat_subscription"
      },
      "type": {
        "name": "oid"
      }
    },
    {
      "name": "subname",
      "length": 64,
      "table": {
        "catalog": "pg_catalog",
        "schema": "pg_catalog",
        "name": "pg_stat_subscription"
      },
      "type": {
        "name": "name"
      }
    },
    {
      "name": "pid",
      "length": 4,
      "table": {
        "catalog": "pg_catalog",
        "schema": "pg_catalog",
        "name": "pg_stat_subscription"
      },
      "type": {
        "name": "int4"
      }
    },
    {
      "name": "relid",
      "length": 4,
      "table": {
        "catalog": "pg_catalog",
        "schema": "pg_catalog",
        "name": "pg_stat_subscription"
      },
      "type": {
        "name": "oid"
      }
    },
    {
      "name": "received_lsn",
      "length": 8,
      "table": {
        "catalog": "pg_catalog",
        "schema": "pg_catalog",
        "name": "pg_stat_subscription"
      },
      "type": {
        "name": "pg_lsn"
      }
    },
    {
      "name": "last_msg_send_time",
      "length": 8,
      "table": {
        "catalog": "pg_catalog",
        "schema": "pg_catalog",
        "name": "pg_stat_subscription"
      },
      "type": {
        "name": "timestamptz"
      }
    },
    {
      "name": "last_msg_receipt_time",
      "length": 8,
      "table": {
        "catalog": "pg_catalog",
        "schema": "pg_catalog",
        "name": "pg_stat_subscription"
      },
      "type": {
        "name": "timestamptz"
      }
    },
    {
      "name": "latest_end_lsn",
      "length": 8,
      "table": {
        "catalog": "pg_catalog",
        "schema": "pg_catalog",
        "name": "pg_stat_subscription"
      },
      "type": {
        "name": "pg_lsn"
      }
    },
    {
      "name": "latest_end_time",
      "length": 8,
      "table": {
        "catalog": "pg_catalog",
        "schema": "pg_catalog",
        "name": "pg_stat_subscription"
      },
      "type": {
        "name": "timestamptz"
      }
    }
  ]
}
