{
  "rel": {
    "catalog": "pg_catalog",
    "schema": "information_schema",
    "name": "constraint_column_usage"
  },
  "columns": [
    {
      "name": "table_catalog",
      "length": 64,
      "table": {
        "catalog": "pg_catalog",
        "schema": "information_schema",
        "name": "constraint_column_usage"
      },
      "type": {
        "name": "sql_identifier"
      }
    },
    {
      "name": "table_schema",
      "length": 64,
      "table": {
        "catalog": "pg_catalog",
        "schema": "information_schema",
        "name": "constraint_column_usage"
      },
      "type": {
        "name": "sql_identifier"
      }
    },
    {
      "name": "table_name",
      "length": 64,
      "table": {
        "catalog": "pg_catalog",
        "schema": "information_schema",
        "name": "constraint_column_usage"
      },
      "type": {
        "name": "sql_identifier"
      }
    },
    {
      "name": "column_name",
      "length": 64,
      "table": {
        "catalog": "pg_catalog",
        "schema": "information_schema",
        "name": "constraint_column_usage"
      },
      "type": {
        "name": "sql_identifier"
      }
    },
    {
      "name": "constraint_catalog",
      "length": 64,
      "table": {
        "catalog": "pg_catalog",
        "schema": "information_schema",
        "name": "constraint_column_usage"
      },
      "type": {
        "name": "sql_identifier"
      }
    },
    {
      "name": "constraint_schema",
      "length": 64,
      "table": {
        "catalog": "pg_catalog",
        "schema": "information_schema",
        "name": "constraint_column_usage"
      },
      "type": {
        "name": "sql_identifier"
      }
    },
    {
      "name": "constraint_name",
      "length": 64,
      "table": {
        "catalog": "pg_catalog",
        "schema": "information_schema",
        "name": "constraint_column_usage"
      },
      "type": {
        "name": "sql_identifier"
      }
    }
  ]
}
