{
  "rel": {
    "catalog": "pg_catalog",
    "schema": "information_schema",
    "name": "sql_features"
  },
  "columns": [
    {
      "name": "tableoid",
      "not_null": true,
      "length": 4,
      "table": {
        "catalog": "pg_catalog",
        "schema": "information_schema",
        "name": "sql_features"
      },
      "type": {
        "name": "oid"
      }
    },
    {
      "name": "cmax",
      "not_null": true,
      "length": 4,
      "table": {
        "catalog": "pg_catalog",
        "schema": "information_schema",
        "name": "sql_features"
      },
      "type": {
        "name": "cid"
      }
    },
    {
      "name": "xmax",
      "not_null": true,
      "length": 4,
      "table": {
        "catalog": "pg_catalog",
        "schema": "information_schema",
        "name": "sql_features"
      },
      "type": {
        "name": "xid"
      }
    },
    {
      "name": "cmin",
      "not_null": true,
      "length": 4,
      "table": {
        "catalog": "pg_catalog",
        "schema": "information_schema",
        "name": "sql_features"
      },
      "type": {
        "name": "cid"
      }
    },
    {
      "name": "xmin",
      "not_null": true,
      "length": 4,
      "table": {
        "catalog": "pg_catalog",
        "schema": "information_schema",
        "name": "sql_features"
      },
      "type": {
        "name": "xid"
      }
    },
    {
      "name": "ctid",
      "not_null": true,
      "length": 6,
      "table": {
        "catalog": "pg_catalog",
        "schema": "information_schema",
        "name": "sql_features"
      },
      "type": {
        "name": "tid"
      }
    },
    {
      "name": "feature_id",
      "length": -1,
      "table": {
        "catalog": "pg_catalog",
        "schema": "information_schema",
        "name": "sql_features"
      },
      "type": {
        "name": "character_data"
      }
    },
    {
      "name": "feature_name",
      "length": -1,
      "table": {
        "catalog": "pg_catalog",
        "schema": "information_schema",
        "name": "sql_features"
      },
      "type": {
        "name": "character_data"
      }
    },
    {
      "name": "sub_feature_id",
      "length": -1,
      "table": {
        "catalog": "pg_catalog",
        "schema": "information_schema",
        "name": "sql_features"
      },
      "type": {
        "name": "character_data"
      }
    },
    {
      "name": "sub_feature_name",
      "length": -1,
      "table": {
        "catalog": "pg_catalog",
        "schema": "information_schema",
        "name": "sql_features"
      },
      "type": {
        "name": "character_data"
      }
    },
    {
      "name": "is_supported",
      "length": -1,
      "table": {
        "catalog": "pg_catalog",
        "schema": "information_schema",
        "name": "sql_features"
      },
      "type": {
        "name": "yes_or_no"
      }
    },
    {
      "name": "is_verified_by",
      "length": -1,
      "table": {
        "catalog": "pg_catalog",
        "schema": "information_schema",
        "name": "sql_features"
      },
      "type": {
        "name": "character_data"
      }
    },
    {
      "name": "comments",
      "length": -1,
      "table": {
        "catalog": "pg_catalog",
        "schema": "information_schema",
        "name": "sql_features"
      },
      "type": {
        "name": "character_data"
      }
    }
  ]
}
