{
  "rel": {
    "catalog": "pg_catalog",
    "schema": "information_schema",
    "name": "applicable_roles"
  },
  "columns": [
    {
      "name": "grantee",
      "length": 64,
      "table": {
        "catalog": "pg_catalog",
        "schema": "information_schema",
        "name": "applicable_roles"
      },
      "type": {
        "name": "sql_identifier"
      }
    },
    {
      "name": "role_name",
      "length": 64,
      "table": {
        "catalog": "pg_catalog",
        "schema": "information_schema",
        "name": "applicable_roles"
      },
      "type": {
        "name": "sql_identifier"
      }
    },
    {
      "name": "is_grantable",
      "length": -1,
      "table": {
        "catalog": "pg_catalog",
        "schema": "information_schema",
        "name": "applicable_roles"
      },
      "type": {
        "name": "yes_or_no"
      }
    }
  ]
}
