{
  "rel": {
    "catalog": "pg_catalog",
    "schema": "pg_catalog",
    "name": "pg_cursors"
  },
  "columns": [
    {
      "name": "name",
      "length": -1,
      "table": {
        "catalog": "pg_catalog",
        "schema": "pg_catalog",
        "name": "pg_cursors"
      },
      "type": {
        "name": "text"
      }
    },
    {
      "name": "statement",
      "length": -1,
      "table": {
        "catalog": "pg_catalog",
        "schema": "pg_catalog",
        "name": "pg_cursors"
      },
      "type": {
        "name": "text"
      }
    },
    {
      "name": "is_holdable",
      "length": 1,
      "table": {
        "catalog": "pg_catalog",
        "schema": "pg_catalog",
        "name": "pg_cursors"
      },
      "type": {
        "name": "bool"
      }
    },
    {
      "name": "is_binary",
      "length": 1,
      "table": {
        "catalog": "pg_catalog",
        "schema": "pg_catalog",
        "name": "pg_cursors"
      },
      "type": {
        "name": "bool"
      }
    },
    {
      "name": "is_scrollable",
      "length": 1,
      "table": {
        "catalog": "pg_catalog",
        "schema": "pg_catalog",
        "name": "pg_cursors"
      },
      "type": {
        "name": "bool"
      }
    },
    {
      "name": "creation_time",
      "length": 8,
      "table": {
        "catalog": "pg_catalog",
        "schema": "pg_catalog",
        "name": "pg_cursors"
      },
      "type": {
        "name": "timestamptz"
      }
    }
  ]
}
