{
  "rel": {
    "catalog": "pg_catalog",
    "schema": "pg_catalog",
    "name": "pg_aggregate"
  },
  "columns": [
    {
      "name": "tableoid",
      "not_null": true,
      "length": 4,
      "table": {
        "catalog": "pg_catalog",
        "schema": "pg_catalog",
        "name": "pg_aggregate"
      },
      "type": {
        "name": "oid"
      }
    },
    {
      "name": "cmax",
      "not_null": true,
      "length": 4,
      "table": {
        "catalog": "pg_catalog",
        "schema": "pg_catalog",
        "name": "pg_aggregate"
      },
      "type": {
        "name": "cid"
      }
    },
    {
      "name": "xmax",
      "not_null": true,
      "length": 4,
      "table": {
        "catalog": "pg_catalog",
        "schema": "pg_catalog",
        "name": "pg_aggregate"
      },
      "type": {
        "name": "xid"
      }
    },
    {
      "name": "cmin",
      "not_null": true,
      "length": 4,
      "table": {
        "catalog": "pg_catalog",
        "schema": "pg_catalog",
        "name": "pg_aggregate"
      },
      "type": {
        "name": "cid"
      }
    },
    {
      "name": "xmin",
      "not_null": true,
      "length": 4,
      "table": {
        "catalog": "pg_catalog",
        "schema": "pg_catalog",
        "name": "pg_aggregate"
      },
      "type": {
        "name": "xid"
      }
    },
    {
      "name": "ctid",
      "not_null": true,
      "length": 6,
      "table": {
        "catalog": "pg_catalog",
        "schema": "pg_catalog",
        "name": "pg_aggregate"
      },
      "type": {
        "name": "tid"
      }
    },
    {
      "name": "aggfnoid",
      "not_null": true,
      "length": 4,
      "table": {
        "catalog": "pg_catalog",
        "schema": "pg_catalog",
        "name": "pg_aggregate"
      },
      "type": {
        "name": "regproc"
      }
    },
    {
      "name": "aggkind",
      "not_null": true,
      "length": 1,
      "table": {
        "catalog": "pg_catalog",
        "schema": "pg_catalog",
        "name": "pg_aggregate"
      },
      "type": {
        "name": "char"
      }
    },
    {
      "name": "aggnumdirectargs",
      "not_null": true,
      "length": 2,
      "table": {
        "catalog": "pg_catalog",
        "schema": "pg_catalog",
        "name": "pg_aggregate"
      },
      "type": {
        "name": "int2"
      }
    },
    {
      "name": "aggtransfn",
      "not_null": true,
      "length": 4,
      "table": {
        "catalog": "pg_catalog",
        "schema": "pg_catalog",
        "name": "pg_aggregate"
      },
      "type": {
        "name": "regproc"
      }
    },
    {
      "name": "aggfinalfn",
      "not_null": true,
      "length": 4,
      "table": {
        "catalog": "pg_catalog",
        "schema": "pg_catalog",
        "name": "pg_aggregate"
      },
      "type": {
        "name": "regproc"
      }
    },
    {
      "name": "aggcombinefn",
      "not_null": true,
      "length": 4,
      "table": {
        "catalog": "pg_catalog",
        "schema": "pg_catalog",
        "name": "pg_aggregate"
      },
      "type": {
        "name": "regproc"
      }
    },
    {
      "name": "aggserialfn",
      "not_null": true,
      "length": 4,
      "table": {
        "catalog": "pg_catalog",
        "schema": "pg_catalog",
        "name": "pg_aggregate"
      },
      "type": {
        "name": "regproc"
      }
    },
    {
      "name": "aggdeserialfn",
      "not_null": true,
      "length": 4,
      "table": {
        "catalog": "pg_catalog",
        "schema": "pg_catalog",
        "name": "pg_aggregate"
      },
      "type": {
        "name": "regproc"
      }
    },
    {
      "name": "aggmtransfn",
      "not_null": true,
      "length": 4,
      "table": {
        "catalog": "pg_catalog",
        "schema": "pg_catalog",
        "name": "pg_aggregate"
      },
      "type": {
        "name": "regproc"
      }
    },
    {
      "name": "aggminvtransfn",
      "not_null": true,
      "length": 4,
      "table": {
        "catalog": "pg_catalog",
        "schema": "pg_catalog",
        "name": "pg_aggregate"
      },
      "type": {
        "name": "regproc"
      }
    },
    {
      "name": "aggmfinalfn",
      "not_null": true,
      "length": 4,
      "table": {
        "catalog": "pg_catalog",
        "schema": "pg_catalog",
        "name": "pg_aggregate"
      },
      "type": {
        "name": "regproc"
      }
    },
    {
      "name": "aggfinalextra",
      "not_null": true,
      "length": 1,
      "table": {
        "catalog": "pg_catalog",
        "schema": "pg_catalog",
        "name": "pg_aggregate"
      },
      "type": {
        "name": "bool"
      }
    },
    {
      "name": "aggmfinalextra",
      "not_null": true,
      "length": 1,
      "table": {
        "catalog": "pg_catalog",
        "schema": "pg_catalog",
        "name": "pg_aggregate"
      },
      "type": {
        "name": "bool"
      }
    },
    {
      "name": "aggfinalmodify",
      "not_null": true,
      "length": 1,
      "table": {
        "catalog": "pg_catalog",
        "schema": "pg_catalog",
        "name": "pg_aggregate"
      },
      "type": {
        "name": "char"
      }
    },
    {
      "name": "aggmfinalmodify",
      "not_null": true,
      "length": 1,
      "table": {
        "catalog": "pg_catalog",
        "schema": "pg_catalog",
        "name": "pg_aggregate"
      },
      "type": {
        "name": "char"
      }
    },
    {
      "name": "aggsortop",
      "not_null": true,
      "length": 4,
      "table": {
        "catalog": "pg_catalog",
        "schema": "pg_catalog",
        "name": "pg_aggregate"
      },
      "type": {
        "name": "oid"
      }
    },
    {
      "name": "aggtranstype",
      "not_null": true,
      "length": 4,
      "table": {
        "catalog": "pg_catalog",
        "schema": "pg_catalog",
        "name": "pg_aggregate"
      },
      "type": {
        "name": "oid"
      }
    },
    {
      "name": "aggtransspace",
      "not_null": true,
      "length": 4,
      "table": {
        "catalog": "pg_catalog",
        "schema": "pg_catalog",
        "name": "pg_aggregate"
      },
      "type": {
        "name": "int4"
      }
    },
    {
      "name": "aggmtranstype",
      "not_null": true,
      "length": 4,
      "table": {
        "catalog": "pg_catalog",
        "schema": "pg_catalog",
        "name": "pg_aggregate"
      },
      "type": {
        "name": "oid"
      }
    },
    {
      "name": "aggmtransspace",
      "not_null": true,
      "length": 4,
      "table": {
        "catalog": "pg_catalog",
        "schema": "pg_catalog",
        "name": "pg_aggregate"
      },
      "type": {
        "name": "int4"
      }
    },
    {
      "name": "agginitval",
      "length": -1,
      "table": {
        "catalog": "pg_catalog",
        "schema": "pg_catalog",
        "name": "pg_aggregate"
      },
      "type": {
        "name": "text"
      }
    },
    {
      "name": "aggminitval",
      "length": -1,
      "table": {
        "catalog": "pg_catalog",
        "schema": "pg_catalog",
        "name": "pg_aggregate"
      },
      "type": {
        "name": "text"
      }
    }
  ]
}
