module _ // Auto generated by https://github.com/bwplotka/bingo. DO NOT EDIT

go 1.15

replace github.com/mattn/go-shellwords => github.com/caarlos0/go-shellwords v1.0.11

require github.com/goreleaser/goreleaser v0.155.0
