<svg width="48" height="48" viewBox="0 0 48 48" fill="none" xmlns="http://www.w3.org/2000/svg">
<path d="M24 4.53003C16.26 4.53003 10 10.79 10 18.53C10 26.87 18.84 38.37 22.48 42.75C23.28 43.71 24.74 43.71 25.54 42.75C29.16 38.37 38 26.87 38 18.53C38 10.79 31.74 4.53003 24 4.53003Z" fill="#8DEBD2"/>
<path d="M24 23.5301C21.24 23.5301 19 21.2901 19 18.5301C19 15.7701 21.24 13.5301 24 13.5301C26.76 13.5301 29 15.7701 29 18.5301C29 21.2901 26.76 23.5301 24 23.5301Z" fill="#1D1C29"/>
</svg>
