<svg width="40" height="47" viewBox="0 0 40 47" fill="none" xmlns="http://www.w3.org/2000/svg">
<g filter="url(#filter0_d)">
<path fill-rule="evenodd" clip-rule="evenodd" d="M8.31093 18.7972L11.8631 11.9912C12.5165 10.7393 13.7582 10 15.2073 10H24.9178C26.3668 10 27.6087 10.7398 28.2619 11.9912L31.8141 18.7972C32.6453 20.3898 32.6453 22.1102 31.8141 23.7027L28.2619 30.5088C27.6088 31.7602 26.3664 32.5 24.9178 32.5H15.2073C13.7587 32.5 12.5165 31.7606 11.8631 30.5088L8.31093 23.7027C7.47971 22.11 7.47967 20.39 8.31093 18.7973V18.7972Z" fill="#8DEBD2"/>
</g>
<path d="M14.4375 16.75C14.4375 16.1287 14.9412 15.625 15.5625 15.625C16.1838 15.625 16.6875 16.1287 16.6875 16.75V25.75C16.6875 26.3713 16.1838 26.875 15.5625 26.875C14.9412 26.875 14.4375 26.3713 14.4375 25.75V16.75Z" fill="#55AB94"/>
<path d="M23.4375 16.75C23.4375 16.1287 23.9412 15.625 24.5625 15.625C25.1838 15.625 25.6875 16.1287 25.6875 16.75V25.75C25.6875 26.3713 25.1838 26.875 24.5625 26.875C23.9412 26.875 23.4375 26.3713 23.4375 25.75V16.75Z" fill="#55AB94"/>
<path d="M18.9375 16.75C18.9375 16.1287 19.4412 15.625 20.0625 15.625C20.6838 15.625 21.1875 16.1287 21.1875 16.75V25.75C21.1875 26.3713 20.6838 26.875 20.0625 26.875C19.4412 26.875 18.9375 26.3713 18.9375 25.75V16.75Z" fill="#55AB94"/>
<defs>
<filter id="filter0_d" x="-4.3125" y="0" width="48.75" height="46.5" filterUnits="userSpaceOnUse" color-interpolation-filters="sRGB">
<feFlood flood-opacity="0" result="BackgroundImageFix"/>
<feColorMatrix in="SourceAlpha" type="matrix" values="0 0 0 0 0 0 0 0 0 0 0 0 0 0 0 0 0 0 127 0"/>
<feOffset dy="2"/>
<feGaussianBlur stdDeviation="6"/>
<feColorMatrix type="matrix" values="0 0 0 0 0 0 0 0 0 0 0 0 0 0 0 0 0 0 0.25 0"/>
<feBlend mode="normal" in2="BackgroundImageFix" result="effect1_dropShadow"/>
<feBlend mode="normal" in="SourceGraphic" in2="effect1_dropShadow" result="shape"/>
</filter>
</defs>
</svg>
