{
  "id": 217423487234628,
  "username": "Mary Ann",
  "bio": "sdkjflksjdflsjf;sajdf ksdjflaskjdflsakdjf sdklfj lkjdflaksjf lsadkfj ljldadsjflsdj flsj lsfkjmlasfj",
  "pic": "http://example.com",
  "city": "Moscow",
  "skills": [
    {
      "id": 1,
      "tag": "Backend",
      "verified": 3,
      "liked": true
    },
    {
      "id": 17,
      "tag": "Product-manager",
      "verified": 4,
      "liked": false
    }
  ],
  "stat": {
    "hackTotal": 15,
    "hackWin": 7,
    "xp": 250,
    "coins": 127.23
  }
}