{
  "id": 6,
  "title": "Blockchain Serial Hacking",
  "city": "Worldwide | Moscow, Russia",
  "dateStart": "2019-04-20T15:00:00.000Z",
  "submissionDue": "2019-04-22T15:00:00.000Z",
  "dateEnd": "2019-04-22T15:00:00.000Z",
  "description": "Long description about the hack formatted with markdown",
  "link": "my-event.tilda.com",
  "preview": "file.com/example.jpg",
  "eventType": "12h",
  "schedule": [
    {
      "time": "9:30-10:30",
      "description": "Registration"
    }, {
      "time": "10:30-24:00",
      "description": "code code code"
    }, {
      "description": "After party (title)"
    }, {
      "time": "00:00-2:00",
      "description": "food & networking"
    }
  ],
  "status": "open",
  "organization": {
    "id": 5,
    "title": "ai-community",
    "logoUrl": "file.com/example.jpg",
    "website": null
  },
  "participants": 100,
  "challenges": [
    {
      "id": 1234,
      "title": "HackBudapes Challenge",
      "description": "markdown",
      "participants": 20,
      "owners": [
        {
          "title": "it-park",
          "logoUrl": "file.com/example.jpg",
          "link": "it-park.com"
        }
      ]
    }
  ],
  "gallery": [
    {
      "url": "file.com/example.jpg",
      "title": "celebration"
    }
  ],
  "prizes": [
    {
      "type": "cash",
      "value": "$5000"
    },
    {
      "type": "Opportunities",
      "value": "Final in HongKong"
    }
  ],
  "skills": [
    {
      "id": 1,
      "tag": "blockchain"
    }
  ],
  "organizers": [
    {
      "title": "it-park",
      "logoUrl": "file.com/example.jpg",
      "link": "it-park.com"
    }
  ],
  "parthners": [
    {
      "title": "it-park",
      "logoUrl": "file.com/example.jpg",
      "link": "it-park.com",
      "type": "info"
    }
  ],
  "isSearchable": true,
  "judgingEnabled": true,
  "p2pEnabled": true,
  "judgingLink": "http://hackathons.space/voting/1234"
}