{
  "$schema": "http://json-schema.org/draft-04/schema",
  "type": "object",
  "properties": {
    "code": {
      "type": "string"
    },
    "password": {
      "type": "string"
    }
  },
  "required": [
    "code",
    "password"
  ]
}