{
	"$schema": "http://json-schema.org/draft-04/schema",
	"type": "object",
	"properties": {
		"username": {
			"type": "string"
		},
		"email": {
			"type": "string"
		},
		"phone": {
			"type":  "string"
		},
		"challengeId": {
			"type": "number"
		}
	},
	"required": [
		"username",
		"email"
	]
}