{
  "$schema": "http://json-schema.org/draft-04/schema",
  "type": "object",
  "properties": {
    "email": {
      "type": "string"
    },
    "pwd": {
      "type": "string"
    }
  },
  "required": [
    "email",
    "pwd"
  ]
}