{
  "$schema": "http://json-schema.org/draft-04/schema",
  "type": "object",
  "properties": {
    "id": {
      "type": "string"
    },
    "title": {
      "type": "string"
    },
    "dateStart": {
      "type": "string"
    },
    "dateEnd": {
      "type": "string"
    },
    "city": {
      "type": "string"
    },
    "description": {
      "type": "string"
    },
    "link": {
      "type": "string"
    },
    "preview": {
      "type": "string"
    },
    "eventType": {
      "type": "string"
    },
    "checkInLocation": {
      "type": "object",
      "properties": {
        "lng": {
          "type": "number"
        },
        "lat": {
          "type": "number"
        }
      }
    },
    "autoconfirmation": {
      "type": "boolean"
    },
    "isDraft": {
      "type": "boolean"
    },
    "enteringWord": {
      "type": "string"
    },
    "schedule": {
      "type": "string"
    },
    "participants": {
      "type": "number"
    }
  }
}