{
  "$schema": "http://json-schema.org/draft-04/schema",
  "type": "object",
  "properties": {
    "team": {
      "type": "object",
      "properties": {
        "id": {
          "type": "number"
        },
        "name": {
          "type": "string"
        },
        "order": {
          "type": "number"
        }
      }
    },
    "criterias": {
      "type": "array",
      "items": {
        "type": "object",
        "properties": {
          "id": {
            "type": "number"
          },
          "name": {
            "type": "string"
          },
          "sum": {
            "type": "number"
          },
          "average": {
            "type": "number"
          }
        }
      }
    },
    "summary": {
      "type": "object",
      "properties": {
        "sum": {
          "type": "number"
        },
        "average": {
          "type": "number"
        }
      }
    }
  }
}