{
  "$schema": "http://json-schema.org/draft-04/schema",
  "type": "object",
  "properties": {
    "id": {
      "type": ["number", "string"]
    },
    "name": {
      "type": "string"
    },
    "eventId": {
      "type": [
        "string",
        "number"
      ]
    },
    "order": {
      "description": "order of speech. Teams with same order number will be sorted by name alphabetically",
      "type": "number",
      "default": 1000
    }
  },
  "required": [
    "id",
    "name",
    "eventId",
    "order"
  ]
}