{
  "$schema": "http://json-schema.org/draft-04/schema",
  "type": "object",
  "properties": {
    "judgeId": {
      "type": "number"
    },
    "judgeName": {
      "type": "string"
    },
    "eventId": {
      "type": "string"
    },
    "eventName": {
      "type": "number"
    },
    "started": {
      "type": "boolean"
    },
    "starIconType": {
      "type": "string"
    },
    "logo": {
      "type": "string"
    },
    "helloMessage": {
      "type": "string"
    },
    "colors": {
      "type": "object"
    },
    "commentsEnabled": {
      "type": "boolean"
    }
  }
}