[
  {
    "team": {
      "id": 1,
      "name": "Facepalm",
      "order": 1
    },
    "criterias": [
      {
        "id": 1,
        "name": "creativity",
        "sum": 8,
        "average": 4
      },
      {
        "id": 1,
        "name": "creativity",
        "sum": 6,
        "average": 3
      }
    ],
    "summary": {
      "sum": 14,
      "averageWeighted": 3.1452,
      "averagePeers": 4.162,
      "averageJury": 2.732
    }
  }
]