{
  "$schema": "http://json-schema.org/draft-04/schema",
  "type": "array",
  "items": {
    "type": "object",
    "properties": {
      "id": {
        "type": "number"
      },
      "email": {
        "type": "string"
      },
      "username": {
        "type": "string"
      },
      "role": {
        "type": "string",
        "enum": [
          "basic",
          "admin"
        ]
      }
    }
  }
}