{
  "$schema": "http://json-schema.org/draft-04/schema",
  "type": "array",
  "items": {
    "type": "object",
    "properties": {
      "id": {
        "type": "number"
      },
      "username": {
        "type": "string"
      },
      "pic": {
        "type": [
          "string",
          "null"
        ]
      },
      "contactPhone": {
        "type": [
          "string",
          "null"
        ]
      },
      "email": {
        "type": [
          "string",
          "null"
        ]
      },
      "skills": {
        "type": "array",
        "items": {
          "type": "string"
        }
      },
      "tgProfileLink": {
        "type": [
          "string",
          "null"
        ]
      },
      "xp": {
        "type": "number"
      },
      "status": {
        "type": "string",
        "enum": [
          "applied",
          "confirmed",
          "declined",
          "activated",
          "participated",
          "won"
        ]
      },
      "statusOnHold": {
        "type": ["string", "null"],
        "enum": [
          "confirmed",
          "declined",
          null
        ]
      },
      "isVerified": {
        "type": "boolean",
        "description": "True if a user has confirmed his intention to participate"
      }
    }
  }
}