{
  "$schema": "http://json-schema.org/draft-04/schema",
  "type": "object",
  "additionalProperties": false,
  "properties": {
    "title": {
      "type": "string"
    },
    "dateStart": {
      "type": "string"
    },
    "dateEnd": {
      "type": "string"
    },
    "city": {
      "type": "string"
    },
    "description": {
      "type": "string"
    },
    "link": {
      "type": "string"
    },
    "preview": {
      "type": "string"
    },
    "eventType": {
      "type": "string"
    },
    "checkInLocation": {
      "type": "object",
      "properties": {
        "lng": {
          "type": [
            "string",
            "number"
          ]
        },
        "lat": {
          "type": [
            "string",
            "number"
          ]
        }
      }
    },
    "autoconfirmation": {
      "type": "boolean"
    },
    "isDraft": {
      "type": "boolean",
      "default": true
    },
    "enteringWord": {
      "type": "string"
    },
    "schedule": {
      "type": "string"
    },
    "participants": {
      "type": [
        "string",
        "number",
        "null"
      ]
    }
  },
  "required": [
    "title"
  ]
}