{
  "project_info": {
    "project_number": "945676587778",
    "firebase_url": "https://todolist-db7bf.firebaseio.com",
    "project_id": "todolist-db7bf",
    "storage_bucket": "todolist-db7bf.appspot.com"
  },
  "client": [
    {
      "client_info": {
        "mobilesdk_app_id": "1:945676587778:android:46496f217b7efff01e281b",
        "android_client_info": {
          "package_name": "com.todo.list"
        }
      },
      "oauth_client": [
        {
          "client_id": "945676587778-hkgn0ceo5mg41ggia4l2bv4f2mifi89v.apps.googleusercontent.com",
          "client_type": 3
        }
      ],
      "api_key": [
        {
          "current_key": "AIzaSyCppoyALHJPzRScGKvz81IYIqj8_d9cOKM"
        }
      ],
      "services": {
        "appinvite_service": {
          "other_platform_oauth_client": [
            {
              "client_id": "945676587778-hkgn0ceo5mg41ggia4l2bv4f2mifi89v.apps.googleusercontent.com",
              "client_type": 3
            }
          ]
        }
      }
    }
  ],
  "configuration_version": "1"
}