<?xml version="1.0" encoding="UTF-8"?>
<Project>
   <description></description>
   <name>webautomationgroup2</name>
   <tag></tag>
   <UUID>fbeeebb0-38a1-4c00-9c86-8c73582cfaa3</UUID>
   <createdEdition>FREE</createdEdition>
   <createdVersion>9.4.0</createdVersion>
   <freeLicense>true</freeLicense>
   <migratedVersion>5.9.0</migratedVersion>
   <modifiedEdition>FREE</modifiedEdition>
   <modifiedVersion>9.4.0</modifiedVersion>
   <pageLoadTimeout>0</pageLoadTimeout>
   <projectFileLocation>C:\Users\Rian\Documents\data explore\exam last chapter\webautomationgroup2\webautomationgroup2.prj</projectFileLocation>
   <sourceContent>
      <sourceFolderList>
         <sourceFolderConfiguration>
            <url>Include/scripts/groovy</url>
         </sourceFolderConfiguration>
      </sourceFolderList>
      <systemFolderList>
         <systemFolderConfiguration>
            <url>Include/scripts/groovy</url>
         </systemFolderConfiguration>
         <systemFolderConfiguration>
            <url>Include/features</url>
         </systemFolderConfiguration>
         <systemFolderConfiguration>
            <url>Include/config</url>
         </systemFolderConfiguration>
      </systemFolderList>
   </sourceContent>
   <timeStampInProperties>false</timeStampInProperties>
   <type>GENERIC</type>
</Project>
