2020-01-03 22:54:17,193,193,process data summary  INFO number of crawled news in day :28269
2020-01-03 22:54:17,194,194,process data summary  INFO number of crawled news processed :5
2020-01-03 22:54:17,194,194,process data summary  INFO number of cleaned news processed :0
