timestamp,x,y,z,qw,qx,qy,qz
0,511.389,348.077,653.031,-0.403176,0.67137,-0.550653,-0.28895
0.0132582,511.389,348.077,653.031,-0.403176,0.67137,-0.550653,-0.28895
0.0265164,517.658,352.851,659.678,-0.40998,0.673829,-0.542661,-0.288774
0.0397746,517.658,352.852,659.678,-0.40998,0.673829,-0.542661,-0.288774
0.0530328,525.969,359.47,668.888,-0.419308,0.676526,-0.532246,-0.288457
0.066291,529.683,362.223,672.934,-0.423327,0.677732,-0.52768,-0.288144
0.0795492,533.28,365.106,677.269,-0.427532,0.678728,-0.523065,-0.288006
0.0928074,536.694,367.873,681.417,-0.431531,0.679743,-0.518605,-0.287714
0.106066,543.21,373.688,690.13,-0.439369,0.681674,-0.509471,-0.287601
0.119324,546.307,376.776,694.758,-0.443327,0.68261,-0.504738,-0.287654
0.132582,549.487,379.824,699.453,-0.447343,0.68357,-0.499896,-0.287613
0.14584,552.679,382.964,704.318,-0.451435,0.684487,-0.494982,-0.287536
0.159098,559.162,389.25,714.319,-0.459849,0.686136,-0.485072,-0.28716
0.172357,562.48,392.491,719.501,-0.464135,0.686872,-0.480065,-0.28692
0.185615,565.687,395.776,724.848,-0.468322,0.687731,-0.47482,-0.286787
0.198873,571.449,402.42,735.684,-0.476325,0.689519,-0.464033,-0.286968
0.212131,574.206,405.75,741.151,-0.480187,0.690408,-0.458671,-0.287016
0.225389,577.204,409.435,747.293,-0.484465,0.691429,-0.45258,-0.28704
0.238648,579.911,412.733,752.808,-0.488238,0.692324,-0.447162,-0.286981
0.251906,585.477,419.444,764.242,-0.495874,0.694101,-0.436068,-0.286666
0.265164,588.24,422.899,770.14,-0.499797,0.694877,-0.430437,-0.286484
0.278422,590.812,426.298,776.012,-0.503584,0.69568,-0.424797,-0.286322
0.29168,593.25,429.665,781.853,-0.507255,0.696559,-0.41904,-0.286188
0.304939,595.536,433.016,787.611,-0.510817,0.697425,-0.413318,-0.286065
0.318197,600.427,439.61,799.328,-0.518034,0.699161,-0.401747,-0.285332
0.331455,602.682,442.846,805.141,-0.521575,0.699979,-0.395956,-0.284969
0.344713,605.021,446.337,811.411,-0.525286,0.700905,-0.389676,-0.284533
0.357971,608.451,451.583,820.815,-0.530825,0.70218,-0.380251,-0.283861
0.37123,612.212,457.293,831.205,-0.536795,0.703727,-0.369562,-0.28292
0.384488,613.937,460.327,836.67,-0.539732,0.704806,-0.363571,-0.282409
0.397746,615.597,463.383,842.183,-0.542703,0.705869,-0.35746,-0.281858
0.411004,618.967,469.39,852.999,-0.548302,0.708119,-0.345293,-0.280544
0.424262,620.461,472.396,858.417,-0.551008,0.70922,-0.33917,-0.27993
0.437521,621.862,475.298,863.591,-0.553487,0.71042,-0.333087,-0.2793
0.450779,624.791,481.341,874.537,-0.558641,0.713037,-0.320003,-0.277663
0.464037,626.161,484.021,879.55,-0.560863,0.714399,-0.313787,-0.276774
0.477295,627.356,486.734,884.506,-0.563062,0.715654,-0.307688,-0.275912
0.490553,628.592,489.368,889.4,-0.565202,0.716919,-0.301626,-0.274947
0.503812,630.921,494.675,899.133,-0.569314,0.719446,-0.289425,-0.27297
0.51707,632.123,497.266,904.033,-0.571416,0.720559,-0.283445,-0.271916
0.530328,633.424,499.818,908.962,-0.573565,0.721639,-0.277477,-0.270679
0.543586,635.632,504.806,918.531,-0.577487,0.723876,-0.265567,-0.268304
0.556844,636.67,507.267,923.249,-0.579288,0.725042,-0.25961,-0.267098
0.570103,637.874,509.768,928.044,-0.581106,0.726114,-0.253779,-0.26584
0.583361,640.138,514.709,937.521,-0.584747,0.727953,-0.242551,-0.263296
0.596619,641.014,517.152,942.143,-0.58637,0.728945,-0.236855,-0.262123
0.609877,641.764,519.597,946.685,-0.587899,0.729892,-0.231295,-0.261027
0.623135,643.98,524.841,956.78,-0.591839,0.731203,-0.219938,-0.258257
0.636394,645.07,527.266,961.468,-0.593687,0.731775,-0.214695,-0.256802
0.649652,646.039,529.725,966.143,-0.595472,0.732314,-0.209482,-0.255434
0.66291,648.057,534.589,975.677,-0.599224,0.733054,-0.199312,-0.25266
0.676168,649.071,536.999,980.45,-0.601133,0.733266,-0.194453,-0.251294
0.689426,650.073,539.381,985.241,-0.603137,0.73334,-0.189691,-0.24991
0.702685,651.003,541.797,990.023,-0.605062,0.733419,-0.184965,-0.248564
0.715943,652.91,546.536,999.783,-0.608988,0.733377,-0.175563,-0.245906
0.729201,653.897,548.941,1004.64,-0.611015,0.733235,-0.171057,-0.244473
0.742459,655.575,553.757,1014.49,-0.615065,0.732822,-0.161795,-0.241845
0.755717,656.324,556.094,1019.43,-0.617098,0.7325,-0.157215,-0.240662
0.768976,657.05,558.695,1024.92,-0.619344,0.732142,-0.151986,-0.239334
0.782234,657.467,561.102,1029.82,-0.621262,0.731825,-0.147255,-0.238291
0.795492,658.35,565.876,1040.01,-0.62531,0.730901,-0.137676,-0.236257
0.80875,658.506,568.169,1044.94,-0.627162,0.730468,-0.132892,-0.235426
0.822008,658.583,570.597,1050.09,-0.629136,0.72989,-0.127953,-0.234682
0.835267,658.25,575.467,1060.9,-0.633329,0.728299,-0.117628,-0.233749
0.848525,657.88,577.908,1066.36,-0.635385,0.72745,-0.112284,-0.233441
0.861783,657.35,580.333,1071.59,-0.637286,0.726662,-0.107109,-0.233146
0.875041,656.315,585.289,1082.53,-0.641509,0.724569,-0.0967531,-0.232604
0.888299,655.701,587.662,1087.97,-0.643559,0.723476,-0.0915813,-0.23244
0.901558,654.848,589.982,1093.34,-0.645563,0.72232,-0.0862451,-0.232518
0.914816,652.772,594.91,1105.1,-0.649811,0.719642,-0.0746905,-0.232985
0.928074,651.664,597.233,1110.57,-0.651715,0.71838,-0.0692447,-0.233245
0.941332,649.181,601.927,1121.65,-0.655638,0.715576,-0.0582674,-0.233868
0.95459,647.794,604.209,1127.35,-0.657657,0.713959,-0.0525061,-0.234504
0.967849,646.261,606.377,1133.02,-0.659622,0.712332,-0.0466322,-0.235178
0.981107,644.636,608.49,1138.57,-0.661523,0.710679,-0.0409142,-0.235899
0.994365,641.202,612.914,1150.11,-0.665472,0.707029,-0.0293706,-0.237477
1.00762,639.268,615.033,1155.76,-0.667324,0.705212,-0.0236546,-0.238317
1.02088,637.41,617.188,1161.3,-0.669146,0.703398,-0.0181713,-0.239048
1.03414,633.135,621.432,1172.81,-0.672773,0.699422,-0.00634757,-0.241134
1.0474,630.564,623.641,1179,-0.674672,0.697174,7.13063e-05,-0.242417
1.06066,628.255,625.714,1184.56,-0.6764,0.695098,0.00571583,-0.243492
1.07391,625.765,627.857,1190.4,-0.678158,0.692909,0.0116514,-0.244627
1.08717,620.879,632.152,1201.41,-0.681385,0.688802,0.0227434,-0.246474
1.10043,618.429,634.376,1206.99,-0.683022,0.686676,0.0282653,-0.247301
1.11369,615.987,636.503,1212.63,-0.684622,0.684505,0.0339078,-0.248185
1.12695,613.428,638.549,1217.97,-0.686091,0.682366,0.0394414,-0.2492
1.14021,608.378,642.615,1228.8,-0.689106,0.678037,0.0501297,-0.25077
1.15346,605.713,644.757,1234.68,-0.690715,0.675662,0.0558927,-0.251535
1.16672,600.69,648.91,1245.76,-0.693712,0.671192,0.066551,-0.252658
1.17998,598.443,650.897,1251.07,-0.695141,0.669085,0.0714579,-0.252978
1.19324,596.101,652.838,1256.15,-0.696498,0.666994,0.0762217,-0.253378
1.2065,591.427,656.656,1266.61,-0.69933,0.662578,0.0857556,-0.254112
1.21975,588.915,658.528,1271.64,-0.700551,0.660493,0.0905565,-0.254515
1.23301,586.328,660.455,1276.62,-0.701784,0.658366,0.0951189,-0.254962
1.24627,583.84,662.484,1281.7,-0.703048,0.656273,0.0994826,-0.255211
1.25953,578.35,666.862,1292.63,-0.705704,0.651758,0.108847,-0.255628
1.27279,575.903,668.794,1297.52,-0.706907,0.649686,0.112899,-0.255823
1.28605,573.486,670.628,1302.38,-0.708092,0.647604,0.116856,-0.256047
1.2993,570.936,672.41,1307.17,-0.709198,0.645536,0.120937,-0.256311
1.31256,565.91,675.86,1316.61,-0.711316,0.6415,0.128613,-0.25684
1.32582,563.448,677.505,1321.39,-0.712419,0.639421,0.132327,-0.257078
1.33908,560.983,679.139,1326.13,-0.713514,0.637353,0.13594,-0.257292
1.35234,555.918,682.587,1335.89,-0.715772,0.633091,0.143007,-0.257711
1.36559,553.54,684.191,1340.46,-0.71686,0.631051,0.146189,-0.257906
1.37885,551.15,685.759,1345.01,-0.717969,0.628979,0.149281,-0.258109
1.39211,546.316,688.734,1354.25,-0.720143,0.624809,0.155437,-0.25855
1.40537,543.935,690.154,1358.88,-0.721313,0.622653,0.158359,-0.258716
1.41863,541.598,691.527,1363.54,-0.722558,0.620417,0.161141,-0.258894
1.43189,539.32,692.901,1368.27,-0.723877,0.61809,0.163869,-0.259062
1.44514,534.938,695.355,1377.3,-0.726401,0.613538,0.168806,-0.259649
1.4584,532.724,696.539,1381.81,-0.727689,0.611202,0.171146,-0.260021
1.47166,528.131,698.882,1390.96,-0.73023,0.606493,0.175859,-0.260777
1.48492,525.823,699.98,1395.37,-0.731503,0.604102,0.178029,-0.261287
1.49818,523.242,701.182,1400.34,-0.732943,0.601382,0.180462,-0.261853
1.51143,520.959,702.254,1404.94,-0.734301,0.598883,0.182648,-0.262261
1.52469,516.365,704.263,1413.58,-0.736819,0.594008,0.186817,-0.263348
1.53795,514.104,705.137,1417.83,-0.738048,0.591574,0.188831,-0.263948
1.55121,509.57,706.619,1427.01,-0.740902,0.586038,0.192766,-0.265453
1.56447,507.367,707.291,1431.27,-0.742227,0.583411,0.194623,-0.266182
1.57773,503.1,708.464,1439.92,-0.744973,0.578025,0.198304,-0.267542
1.59098,500.981,708.892,1444.19,-0.746407,0.575164,0.200151,-0.268331
1.60424,498.845,709.28,1448.49,-0.747901,0.572192,0.202016,-0.269128
1.6175,494.114,709.903,1457.61,-0.750896,0.565845,0.206402,-0.270874
1.63076,491.815,710.149,1461.83,-0.752232,0.562877,0.208469,-0.271766
1.64402,489.468,710.325,1465.91,-0.753485,0.559913,0.210525,-0.272831
1.65727,484.82,710.692,1473.8,-0.75583,0.554145,0.214571,-0.274962
1.67053,482.506,710.814,1477.56,-0.756936,0.551282,0.216515,-0.276147
1.68379,480.218,710.891,1481.21,-0.75798,0.548472,0.218476,-0.277332
1.69705,475.593,710.831,1488.64,-0.760101,0.542675,0.222602,-0.279642
1.71031,473.324,710.649,1492.44,-0.761204,0.539655,0.224739,-0.280773
1.72357,471.155,710.463,1496.19,-0.762356,0.536591,0.226763,-0.28189
1.73682,466.578,709.776,1503.46,-0.764341,0.530441,0.231371,-0.2844
1.75008,464.306,709.249,1507.06,-0.765229,0.527356,0.233792,-0.285765
1.76334,461.812,708.604,1510.82,-0.766121,0.524016,0.236433,-0.287342
1.7766,457.159,707.743,1517.34,-0.767469,0.518469,0.241149,-0.289877
1.78986,454.823,707.238,1520.69,-0.768143,0.515667,0.243533,-0.291093
1.80312,452.575,706.781,1523.92,-0.768786,0.512953,0.245807,-0.292279
1.81637,450.137,706.257,1527.08,-0.769284,0.510178,0.248355,-0.293666
1.82963,445.097,705.236,1533.21,-0.770104,0.504772,0.253557,-0.296401
1.84289,442.601,704.71,1536.27,-0.77052,0.502056,0.256077,-0.297764
1.85615,440.192,704.192,1539.19,-0.77096,0.499415,0.258413,-0.299046
1.86941,435.32,703.27,1544.78,-0.771581,0.494422,0.26324,-0.30152
1.88266,432.935,702.669,1547.63,-0.771852,0.491921,0.265766,-0.302698
1.89592,430.296,702.004,1550.84,-0.772197,0.489109,0.268554,-0.303914
1.90918,427.871,701.389,1553.63,-0.77247,0.486567,0.271169,-0.304977
1.92244,423.232,700.248,1559,-0.77295,0.481929,0.276065,-0.306726
1.9357,420.979,699.736,1561.62,-0.773147,0.479762,0.278365,-0.307548
1.94896,416.611,698.875,1566.72,-0.773613,0.47556,0.282619,-0.309018
1.96221,414.369,698.506,1569.08,-0.773739,0.47362,0.284779,-0.309698
1.97547,412.079,698.15,1571.49,-0.773861,0.471743,0.286961,-0.310244
1.98873,409.738,697.828,1573.93,-0.773988,0.469895,0.289106,-0.310739
2.00199,405.249,697.457,1578.66,-0.774397,0.46635,0.292924,-0.311486
2.01525,403.078,697.386,1580.89,-0.774603,0.464742,0.294686,-0.311713
2.0285,400.946,697.375,1582.92,-0.774736,0.463288,0.296378,-0.311944
2.04176,396.842,697.18,1587.23,-0.775197,0.460187,0.299586,-0.312323
2.05502,394.641,697.058,1589.65,-0.775516,0.458476,0.301261,-0.312437
2.06828,392.69,696.984,1591.86,-0.775829,0.457009,0.30267,-0.312448
2.08154,388.752,697.05,1595.74,-0.776172,0.454626,0.30546,-0.312357
2.0948,386.863,697.073,1597.6,-0.776329,0.453506,0.306815,-0.312267
2.10805,385.036,697.084,1599.44,-0.77651,0.452387,0.308103,-0.312171
2.12131,381.242,697.119,1603.09,-0.776836,0.45023,0.310744,-0.311861
2.13457,379.321,697.232,1604.82,-0.776932,0.449342,0.312005,-0.311643
2.14783,379.321,697.231,1604.82,-0.776932,0.449342,0.312005,-0.311643
2.16109,372.737,698.005,1609.85,-0.777041,0.446798,0.31593,-0.311073
2.17434,370.807,698.359,1611.22,-0.777073,0.446165,0.316929,-0.310886
2.1876,368.916,698.71,1612.6,-0.777123,0.445559,0.317847,-0.310694
2.20086,365.057,699.436,1615.22,-0.777141,0.444455,0.319779,-0.310248
2.21412,363.071,699.793,1616.55,-0.777137,0.443909,0.320809,-0.309976
2.22738,360.99,700.082,1617.94,-0.777118,0.443256,0.321978,-0.309745
2.24064,359.062,700.267,1619.21,-0.777068,0.442614,0.32313,-0.309588
2.25389,355.425,700.609,1621.63,-0.777015,0.441363,0.325267,-0.309269
2.26715,353.642,700.818,1622.73,-0.776942,0.440855,0.326293,-0.309096
2.28041,351.791,701.008,1623.69,-0.776768,0.440437,0.327422,-0.308936
2.29367,349.994,701.184,1624.62,-0.776591,0.440034,0.328524,-0.308785
2.30693,346.476,701.666,1626.23,-0.77617,0.439473,0.330558,-0.308471
2.32018,344.823,701.957,1626.98,-0.77601,0.439208,0.331438,-0.308308
2.33344,343.271,702.229,1627.7,-0.775855,0.438956,0.332229,-0.308205
2.3467,340.117,702.744,1629.01,-0.775518,0.438395,0.333939,-0.308004
2.35996,338.563,703.029,1629.57,-0.77531,0.438194,0.334795,-0.307886
2.37322,335.202,703.423,1630.71,-0.77473,0.437689,0.336884,-0.307784
2.38648,333.668,703.585,1631.18,-0.774447,0.43745,0.337862,-0.307766
2.39973,332.205,703.705,1631.65,-0.774167,0.437196,0.33883,-0.307764
2.41299,330.863,703.876,1632.03,-0.773905,0.437021,0.33968,-0.307736
2.42625,328.282,704.082,1632.75,-0.773377,0.436619,0.341398,-0.307733
2.43951,327.04,704.176,1633.1,-0.773124,0.43643,0.342232,-0.30771
2.45277,325.378,704.272,1633.56,-0.772761,0.436175,0.343396,-0.307686
2.46603,324.231,704.383,1633.91,-0.772557,0.435985,0.344157,-0.307618
2.47928,321.945,704.546,1634.63,-0.772138,0.435555,0.345682,-0.30757
2.49254,320.892,704.614,1634.95,-0.771945,0.435329,0.346378,-0.307591
2.5058,319.947,704.682,1635.21,-0.77176,0.435161,0.347008,-0.307581
2.51906,318.967,704.765,1635.43,-0.771547,0.435006,0.347616,-0.307649
2.53232,317.593,705.003,1635.85,-0.771352,0.434792,0.348271,-0.3077
2.54557,316.958,705.117,1636.07,-0.771284,0.43466,0.348556,-0.307735
2.55883,316.431,705.211,1636.22,-0.771199,0.434546,0.348819,-0.307811
2.57209,315.384,705.349,1636.6,-0.771094,0.434206,0.349283,-0.308026
2.58535,314.9,705.467,1636.73,-0.771049,0.434063,0.349459,-0.30814
2.59861,314.483,705.558,1636.95,-0.771068,0.433884,0.349572,-0.308218
2.61187,313.765,705.767,1637.29,-0.771108,0.433574,0.349741,-0.308363
2.62512,313.392,705.875,1637.39,-0.771079,0.433461,0.349856,-0.308463
2.63838,312.981,705.965,1637.55,-0.771079,0.43326,0.35,-0.308583
2.65164,312.571,706.032,1637.66,-0.771028,0.433098,0.350168,-0.308748
