0,0.859825,1060.76,1091.1,0.7,-0.7,0,0
0.00371747,0.784397,1059.85,1092.03,0.7,-0.7,0,0
0.00743494,1.62852,1059.01,1093.13,0.7,-0.7,0,0
0.0111524,2.44645,1058.03,1094.37,0.7,-0.7,0,0
0.0148699,3.23703,1056.9,1095.78,0.7,-0.7,0,0
0.0185874,3.99995,1055.61,1097.35,0.7,-0.7,0,0
0.0223048,4.73595,1054.17,1099.07,0.7,-0.7,0,0
0.0260223,5.44686,1052.58,1100.95,0.7,-0.7,0,0
0.0297398,6.13553,1050.86,1102.96,0.7,-0.7,0,0
0.0334572,6.80554,1049.02,1105.1,0.7,-0.7,0,0
0.0371747,7.46048,1047.07,1107.33,0.7,-0.7,0,0
0.0408922,8.10411,1045.04,1109.64,0.7,-0.7,0,0
0.0446097,8.73928,1042.93,1112.03,0.7,-0.7,0,0
0.0483271,9.36768,1040.74,1114.47,0.7,-0.7,0,0
0.0520446,9.98966,1038.47,1116.98,0.7,-0.7,0,0
0.0557621,10.6043,1036.1,1119.57,0.7,-0.7,0,0
0.0594796,11.2096,1033.63,1122.24,0.7,-0.7,0,0
0.063197,11.8033,1031.03,1125.03,0.7,-0.7,0,0
0.0669145,12.3831,1028.27,1127.94,0.7,-0.7,0,0
0.070632,12.9475,1025.35,1131,0.7,-0.7,0,0
0.0743494,13.4966,1022.26,1134.21,0.7,-0.7,0,0
0.0780669,14.0323,1019.01,1137.55,0.7,-0.7,0,0
0.0817844,14.5586,1015.62,1141.03,0.7,-0.7,0,0
0.0855019,15.0814,1012.11,1144.59,0.7,-0.7,0,0
0.0892193,15.6084,1008.53,1148.22,0.7,-0.7,0,0
0.0929368,16.1481,1004.9,1151.88,0.7,-0.7,0,0
0.0966543,16.7089,1001.28,1155.53,0.7,-0.7,0,0
0.100372,17.2984,997.681,1159.13,0.7,-0.7,0,0
0.104089,17.9227,994.129,1162.67,0.7,-0.7,0,0
0.107807,18.5865,990.626,1166.15,0.7,-0.7,0,0
0.111524,19.2923,987.164,1169.58,0.7,-0.7,0,0
0.115242,20.041,983.722,1172.96,0.7,-0.7,0,0
0.118959,20.8321,980.275,1176.33,0.7,-0.7,0,0
0.122677,21.6643,976.796,1179.71,0.7,-0.7,0,0
0.126394,22.5356,973.263,1183.12,0.7,-0.7,0,0
0.130112,23.4439,969.662,1186.58,0.7,-0.7,0,0
0.133829,24.3874,965.991,1190.08,0.7,-0.7,0,0
0.137546,25.3643,962.263,1193.61,0.7,-0.7,0,0
0.141264,26.3736,958.499,1197.17,0.7,-0.7,0,0
0.144981,27.415,954.733,1200.71,0.7,-0.7,0,0
0.148699,28.49,950.998,1204.21,0.7,-0.7,0,0
0.152416,29.5989,947.327,1207.63,0.7,-0.7,0,0
0.156134,30.7437,943.746,1210.96,0.7,-0.7,0,0
0.159851,31.9273,940.27,1214.18,0.7,-0.7,0,0
0.163569,33.1528,936.901,1217.29,0.7,-0.7,0,0
0.167286,34.4239,933.627,1220.28,0.7,-0.7,0,0
0.171004,35.7439,930.431,1223.19,0.7,-0.7,0,0
0.174721,37.1161,927.286,1226.03,0.7,-0.7,0,0
0.178439,38.5425,924.167,1228.83,0.7,-0.7,0,0
0.182156,40.0241,921.05,1231.6,0.7,-0.7,0,0
0.185874,41.5599,917.921,1234.36,0.7,-0.7,0,0
0.189591,43.1472,914.775,1237.11,0.7,-0.7,0,0
0.193309,44.7815,911.62,1239.85,0.7,-0.7,0,0
0.197026,46.4567,908.471,1242.58,0.7,-0.7,0,0
0.200743,48.1675,905.353,1245.27,0.7,-0.7,0,0
0.204461,49.907,902.289,1247.9,0.7,-0.7,0,0
0.208178,51.6706,899.305,1250.46,0.7,-0.7,0,0
0.211896,53.4561,896.417,1252.94,0.7,-0.7,0,0
0.215613,55.2638,893.636,1255.32,0.7,-0.7,0,0
0.219331,57.0968,890.96,1257.61,0.7,-0.7,0,0
0.223048,58.9603,888.379,1259.81,0.7,-0.7,0,0
0.226766,60.8613,885.877,1261.95,0.7,-0.7,0,0
0.230483,62.8067,883.432,1264.03,0.7,-0.7,0,0
0.234201,64.8026,881.023,1266.08,0.7,-0.7,0,0
0.237918,66.8525,878.632,1268.1,0.7,-0.7,0,0
0.241636,68.9567,876.246,1270.12,0.7,-0.7,0,0
0.245353,71.1115,873.862,1272.12,0.7,-0.7,0,0
0.249071,73.3092,871.484,1274.12,0.7,-0.7,0,0
0.252788,75.5392,869.123,1276.11,0.7,-0.7,0,0
0.256506,77.7897,866.799,1278.06,0.7,-0.7,0,0
0.260223,80.0481,864.526,1279.97,0.7,-0.7,0,0
0.263941,82.304,862.321,1281.83,0.7,-0.7,0,0
0.267658,84.5504,860.197,1283.62,0.7,-0.7,0,0
0.271375,86.7845,858.157,1285.36,0.7,-0.7,0,0
0.275093,89.0083,856.201,1287.02,0.7,-0.7,0,0
0.27881,91.2274,854.319,1288.64,0.7,-0.7,0,0
0.282528,93.4502,852.498,1290.21,0.7,-0.7,0,0
0.286245,95.6862,850.722,1291.75,0.7,-0.7,0,0
0.289963,97.9443,848.976,1293.27,0.7,-0.7,0,0
0.29368,100.231,847.247,1294.78,0.7,-0.7,0,0
0.297398,102.549,845.529,1296.28,0.7,-0.7,0,0
0.301115,104.897,843.819,1297.79,0.7,-0.7,0,0
0.304833,107.27,842.125,1299.28,0.7,-0.7,0,0
0.30855,109.657,840.456,1300.77,0.7,-0.7,0,0
0.312268,112.05,838.828,1302.23,0.7,-0.7,0,0
0.315985,114.436,837.255,1303.65,0.7,-0.7,0,0
0.319703,116.807,835.751,1305.04,0.7,-0.7,0,0
0.32342,119.158,834.327,1306.37,0.7,-0.7,0,0
0.327138,121.488,832.987,1307.66,0.7,-0.7,0,0
0.330855,123.799,831.734,1308.89,0.7,-0.7,0,0
0.334572,126.101,830.562,1310.07,0.7,-0.7,0,0
0.33829,128.402,829.463,1311.22,0.7,-0.7,0,0
0.342007,130.713,828.43,1312.34,0.7,-0.7,0,0
0.345725,133.043,827.451,1313.43,0.7,-0.7,0,0
0.349442,135.399,826.519,1314.51,0.7,-0.7,0,0
0.35316,137.783,825.629,1315.58,0.7,-0.7,0,0
0.356877,140.192,824.78,1316.63,0.7,-0.7,0,0
0.360595,142.621,823.974,1317.66,0.7,-0.7,0,0
0.364312,145.057,823.217,1318.66,0.7,-0.7,0,0
0.36803,147.49,822.519,1319.63,0.7,-0.7,0,0
0.371747,149.909,821.886,1320.55,0.7,-0.7,0,0
0.375465,152.302,821.329,1321.42,0.7,-0.7,0,0
0.379182,154.666,820.856,1322.22,0.7,-0.7,0,0
0.3829,156.997,820.473,1322.95,0.7,-0.7,0,0
0.386617,159.301,820.183,1323.61,0.7,-0.7,0,0
0.390335,161.583,819.99,1324.19,0.7,-0.7,0,0
0.394052,163.853,819.891,1324.71,0.7,-0.7,0,0
0.39777,166.122,819.887,1325.16,0.7,-0.7,0,0
0.401487,168.396,819.972,1325.54,0.7,-0.7,0,0
0.405204,170.684,820.144,1325.87,0.7,-0.7,0,0
0.408922,172.985,820.396,1326.13,0.7,-0.7,0,0
0.412639,175.297,820.723,1326.35,0.7,-0.7,0,0
0.416357,177.613,821.12,1326.51,0.7,-0.7,0,0
0.420074,179.923,821.58,1326.62,0.7,-0.7,0,0
0.423792,182.213,822.103,1326.68,0.7,-0.7,0,0
0.427509,184.474,822.685,1326.68,0.7,-0.7,0,0
0.431227,186.694,823.325,1326.62,0.7,-0.7,0,0
0.434944,188.868,824.026,1326.5,0.7,-0.7,0,0
0.438662,190.994,824.792,1326.31,0.7,-0.7,0,0
0.442379,193.073,825.631,1326.04,0.7,-0.7,0,0
0.446097,195.111,826.548,1325.69,0.7,-0.7,0,0
0.449814,197.115,827.552,1325.26,0.7,-0.7,0,0
0.453532,199.093,828.649,1324.74,0.7,-0.7,0,0
0.457249,201.054,829.841,1324.12,0.7,-0.7,0,0
0.460967,203.003,831.129,1323.42,0.7,-0.7,0,0
0.464684,204.943,832.508,1322.64,0.7,-0.7,0,0
0.468401,206.875,833.969,1321.78,0.7,-0.7,0,0
0.472119,208.795,835.499,1320.86,0.7,-0.7,0,0
0.475836,210.699,837.085,1319.87,0.7,-0.7,0,0
0.479554,212.58,838.712,1318.85,0.7,-0.7,0,0
0.483271,214.434,840.368,1317.78,0.7,-0.7,0,0
0.486989,216.256,842.046,1316.69,0.7,-0.7,0,0
0.490706,218.043,843.742,1315.56,0.7,-0.7,0,0
0.494424,219.796,845.46,1314.4,0.7,-0.7,0,0
0.498141,221.516,847.21,1313.2,0.7,-0.7,0,0
0.501859,223.208,849.002,1311.94,0.7,-0.7,0,0
0.505576,224.878,850.852,1310.62,0.7,-0.7,0,0
0.509294,226.53,852.77,1309.23,0.7,-0.7,0,0
0.513011,228.171,854.768,1307.75,0.7,-0.7,0,0
0.516729,229.802,856.847,1306.19,0.7,-0.7,0,0
0.520446,231.425,859.006,1304.56,0.7,-0.7,0,0
0.524164,233.038,861.234,1302.85,0.7,-0.7,0,0
0.527881,234.639,863.515,1301.09,0.7,-0.7,0,0
0.531599,236.221,865.833,1299.28,0.7,-0.7,0,0
0.535316,237.78,868.166,1297.46,0.7,-0.7,0,0
0.539033,239.31,870.5,1295.61,0.7,-0.7,0,0
0.542751,240.807,872.823,1293.77,0.7,-0.7,0,0
0.546468,242.267,875.133,1291.93,0.7,-0.7,0,0
0.550186,243.689,877.433,1290.07,0.7,-0.7,0,0
0.553903,245.072,879.737,1288.2,0.7,-0.7,0,0
0.557621,246.419,882.059,1286.3,0.7,-0.7,0,0
0.561338,247.731,884.419,1284.35,0.7,-0.7,0,0
0.565056,249.011,886.832,1282.34,0.7,-0.7,0,0
0.568773,250.262,889.312,1280.25,0.7,-0.7,0,0
0.572491,251.487,891.864,1278.07,0.7,-0.7,0,0
0.576208,252.687,894.485,1275.83,0.7,-0.7,0,0
0.579926,253.864,897.166,1273.51,0.7,-0.7,0,0
0.583643,255.017,899.889,1271.14,0.7,-0.7,0,0
0.587361,256.145,902.633,1268.74,0.7,-0.7,0,0
0.591078,257.248,905.377,1266.32,0.7,-0.7,0,0
0.594796,258.325,908.106,1263.91,0.7,-0.7,0,0
0.598513,259.372,910.807,1261.5,0.7,-0.7,0,0
0.60223,260.388,913.479,1259.1,0.7,-0.7,0,0
0.605948,261.372,916.128,1256.7,0.7,-0.7,0,0
0.609665,262.322,918.77,1254.29,0.7,-0.7,0,0
0.613383,263.236,921.422,1251.85,0.7,-0.7,0,0
0.6171,264.113,924.107,1249.34,0.7,-0.7,0,0
0.620818,264.953,926.843,1246.77,0.7,-0.7,0,0
0.624535,265.758,929.643,1244.11,0.7,-0.7,0,0
0.628253,266.528,932.512,1241.37,0.7,-0.7,0,0
0.63197,267.266,935.445,1238.54,0.7,-0.7,0,0
0.635688,267.974,938.43,1235.65,0.7,-0.7,0,0
0.639405,268.658,941.445,1232.71,0.7,-0.7,0,0
0.643123,269.319,944.466,1229.76,0.7,-0.7,0,0
0.64684,269.96,947.469,1226.82,0.7,-0.7,0,0
0.650558,270.584,950.435,1223.92,0.7,-0.7,0,0
0.654275,271.191,953.351,1221.06,0.7,-0.7,0,0
0.657993,271.78,956.215,1218.26,0.7,-0.7,0,0
0.66171,272.349,959.033,1215.49,0.7,-0.7,0,0
0.665428,272.893,961.82,1212.76,0.7,-0.7,0,0
0.669145,273.409,964.598,1210.04,0.7,-0.7,0,0
0.672862,273.894,967.387,1207.3,0.7,-0.7,0,0
0.67658,274.343,970.207,1204.53,0.7,-0.7,0,0
0.680297,274.757,973.07,1201.71,0.7,-0.7,0,0
0.684015,275.135,975.983,1198.84,0.7,-0.7,0,0
0.687732,275.481,978.94,1195.93,0.7,-0.7,0,0
0.69145,275.801,981.927,1192.99,0.7,-0.7,0,0
0.695167,276.1,984.923,1190.04,0.7,-0.7,0,0
0.698885,276.385,987.904,1187.12,0.7,-0.7,0,0
0.702602,276.662,990.847,1184.26,0.7,-0.7,0,0
0.70632,276.937,993.733,1181.46,0.7,-0.7,0,0
0.710037,277.211,996.55,1178.76,0.7,-0.7,0,0
0.713755,277.484,999.297,1176.14,0.7,-0.7,0,0
0.717472,277.754,1001.98,1173.62,0.7,-0.7,0,0
0.72119,278.015,1004.61,1171.16,0.7,-0.7,0,0
0.724907,278.262,1007.22,1168.77,0.7,-0.7,0,0
0.728625,278.489,1009.81,1166.41,0.7,-0.7,0,0
0.732342,278.692,1012.41,1164.07,0.7,-0.7,0,0
0.736059,278.867,1015.04,1161.73,0.7,-0.7,0,0
0.739777,279.016,1017.68,1159.39,0.7,-0.7,0,0
0.743494,279.142,1020.35,1157.05,0.7,-0.7,0,0
0.747212,279.25,1023.02,1154.72,0.7,-0.7,0,0
0.750929,279.35,1025.68,1152.42,0.7,-0.7,0,0
0.754647,279.449,1028.3,1150.16,0.7,-0.7,0,0
0.758364,279.555,1030.86,1147.97,0.7,-0.7,0,0
0.762082,279.676,1033.36,1145.85,0.7,-0.7,0,0
0.765799,279.814,1035.77,1143.83,0.7,-0.7,0,0
0.769517,279.969,1038.09,1141.9,0.7,-0.7,0,0
0.773234,280.139,1040.34,1140.05,0.7,-0.7,0,0
0.776952,280.319,1042.52,1138.27,0.7,-0.7,0,0
0.780669,280.502,1044.64,1136.56,0.7,-0.7,0,0
0.784387,280.682,1046.73,1134.89,0.7,-0.7,0,0
0.788104,280.852,1048.81,1133.25,0.7,-0.7,0,0
0.791822,281.009,1050.87,1131.63,0.7,-0.7,0,0
0.795539,281.152,1052.92,1130.03,0.7,-0.7,0,0
0.799257,281.282,1054.97,1128.44,0.7,-0.7,0,0
0.802974,281.403,1057,1126.88,0.7,-0.7,0,0
0.806691,281.523,1059,1125.35,0.7,-0.7,0,0
0.810409,281.646,1060.96,1123.87,0.7,-0.7,0,0
0.814126,281.778,1062.86,1122.45,0.7,-0.7,0,0
0.817844,281.923,1064.68,1121.1,0.7,-0.7,0,0
0.821561,282.083,1066.43,1119.82,0.7,-0.7,0,0
0.825279,282.255,1068.1,1118.62,0.7,-0.7,0,0
0.828996,282.436,1069.7,1117.49,0.7,-0.7,0,0
0.832714,282.62,1071.23,1116.42,0.7,-0.7,0,0
0.836431,282.798,1072.7,1115.41,0.7,-0.7,0,0
0.840149,282.965,1074.14,1114.45,0.7,-0.7,0,0
0.843866,283.114,1075.55,1113.52,0.7,-0.7,0,0
0.847584,283.243,1076.93,1112.62,0.7,-0.7,0,0
0.851301,283.351,1078.3,1111.74,0.7,-0.7,0,0
0.855019,283.441,1079.64,1110.88,0.7,-0.7,0,0
0.858736,283.518,1080.96,1110.05,0.7,-0.7,0,0
0.862454,283.588,1082.25,1109.25,0.7,-0.7,0,0
0.866171,283.658,1083.49,1108.48,0.7,-0.7,0,0
0.869888,283.734,1084.69,1107.75,0.7,-0.7,0,0
0.873606,283.818,1085.83,1107.06,0.7,-0.7,0,0
0.877323,283.911,1086.91,1106.41,0.7,-0.7,0,0
0.881041,284.011,1087.94,1105.8,0.7,-0.7,0,0
0.884758,284.112,1088.9,1105.22,0.7,-0.7,0,0
0.888476,284.208,1089.82,1104.68,0.7,-0.7,0,0
0.892193,284.291,1090.69,1104.17,0.7,-0.7,0,0
0.895911,284.353,1091.53,1103.68,0.7,-0.7,0,0
0.899628,284.391,1092.34,1103.2,0.7,-0.7,0,0
0.903346,284.402,1093.12,1102.74,0.7,-0.7,0,0
0.907063,284.388,1093.87,1102.28,0.7,-0.7,0,0
0.910781,284.354,1094.61,1101.84,0.7,-0.7,0,0
0.914498,284.308,1095.32,1101.4,0.7,-0.7,0,0
0.918216,284.26,1096,1100.98,0.7,-0.7,0,0
0.921933,284.218,1096.65,1100.58,0.7,-0.7,0,0
0.925651,284.191,1097.26,1100.2,0.7,-0.7,0,0
0.929368,284.185,1097.83,1099.84,0.7,-0.7,0,0
0.933086,284.202,1098.35,1099.5,0.7,-0.7,0,0
0.936803,284.239,1098.84,1099.18,0.7,-0.7,0,0
0.94052,284.292,1099.28,1098.89,0.7,-0.7,0,0
0.944238,284.354,1099.68,1098.6,0.7,-0.7,0,0
0.947955,284.418,1100.04,1098.34,0.7,-0.7,0,0
0.951673,284.476,1100.37,1098.08,0.7,-0.7,0,0
0.95539,284.523,1100.67,1097.83,0.7,-0.7,0,0
0.959108,284.558,1100.94,1097.58,0.7,-0.7,0,0
0.962825,284.58,1101.18,1097.34,0.7,-0.7,0,0
0.966543,284.594,1101.4,1097.11,0.7,-0.7,0,0
0.97026,284.607,1101.6,1096.89,0.7,-0.7,0,0
0.973978,284.627,1101.77,1096.68,0.7,-0.7,0,0
0.977695,284.661,1101.93,1096.49,0.7,-0.7,0,0
0.981413,284.717,1102.06,1096.31,0.7,-0.7,0,0
0.98513,284.798,1102.17,1096.16,0.7,-0.7,0,0
0.988848,284.906,1102.25,1096.02,0.7,-0.7,0,0
0.992565,285.039,1102.31,1095.91,0.7,-0.7,0,0
0.996283,285.192,1102.35,1095.82,0.7,-0.7,0,0
1,285.357,1102.36,1095.75,0.7,-0.7,0,0
