0,0.040724,-1.0029
0.01,0.070045,-1.0029
0.02,0.10371,-1.0029
0.03,0.16235,-0.99732
0.04,0.2181,-0.97959
0.05,0.25973,-0.97493
0.06,0.28905,-0.95673
0.07,0.32344,-0.93808
0.08,0.35674,-0.91802
0.09,0.38606,-0.90122
0.1,0.41538,-0.8793
0.11,0.44471,-0.86437
0.12,0.46534,-0.84058
0.13,0.4943,-0.82706
0.14,0.52253,-0.80327
0.15,0.54389,-0.78601
0.16,0.57068,-0.75149
0.17,0.59023,-0.7305
0.18,0.61376,-0.70764
0.19,0.64308,-0.67592
0.2,0.6724,-0.65773
0.21,0.69557,-0.62927
0.22,0.70824,-0.60035
0.23,0.72561,-0.58496
0.24,0.73683,-0.58309
0.25,0.75566,-0.5481
0.26,0.76615,-0.54531
0.27,0.78425,-0.50939
0.28,0.79186,-0.487
0.29,0.79765,-0.45948
0.3,0.80995,-0.41516
0.31,0.8143,-0.39137
0.32,0.819,-0.34052
0.33,0.819,-0.28501
0.34,0.819,-0.22624
0.35,0.81176,-0.18192
0.36,0.80995,-0.12362
0.37,0.79258,-0.10542
0.38,0.79186,-0.046181
0.39,0.79186,-0.030787
0.4,0.79005,0.0069971
0.41,0.77774,0.051312
0.42,0.76471,0.097493
0.43,0.76471,0.11009
0.44,0.76,0.12268
0.45,0.75566,0.13528
0.46,0.74335,0.1558
0.47,0.73068,0.17213
0.48,0.7209,0.18472
0.49,0.71113,0.19732
0.5,0.70136,0.20991
0.51,0.68253,0.24676
0.52,0.67131,0.27009
0.53,0.65394,0.28548
0.54,0.63837,0.30694
0.55,0.61629,0.31487
0.56,0.60217,0.32606
0.57,0.58262,0.34472
0.58,0.56887,0.34985
0.59,0.54606,0.36665
0.6,0.52398,0.39184
0.61,0.5124,0.3965
0.62,0.49394,0.4077
0.63,0.48235,0.43195
0.64,0.43783,0.44455
0.65,0.42624,0.45714
0.66,0.40923,0.46647
0.67,0.38643,0.47067
0.68,0.35348,0.47813
0.69,0.3343,0.49026
0.7,0.30498,0.50845
0.71,0.28181,0.52105
0.72,0.24851,0.52478
0.73,0.23222,0.52478
0.74,0.21412,0.52478
0.75,0.20362,0.52478
0.76,0.17575,0.52478
0.77,0.16163,0.52478
0.78,0.12905,0.52478
0.79,0.11348,0.52478
0.8,0.087783,0.52478
0.81,0.068235,0.52478
0.82,0.058824,0.52478
0.83,0.058824,0.52478
0.84,0.058824,0.52478
0.85,0.058824,0.52478
0.86,0.058824,0.52478
0.87,0.058824,0.52478
0.88,0.058824,0.52478
0.89,0.058824,0.52478
0.9,0.058824,0.52478
0.91,0.058824,0.52478
0.92,0.058824,0.52478
0.93,0.058824,0.52478
0.94,0.058824,0.52478
0.95,0.058824,0.52478
0.96,0.058824,0.52478
0.97,0.058824,0.52478
0.98,0.058824,0.52478
0.99,0.058824,0.52478
1,0.058824,0.52478
