 1.00000 -264.10518
 6.00000 -261.16289
11.00000 -258.12836
16.00000 -255.01430
21.00000 -251.85034
26.00000 -248.67425
31.00000 -245.52017
36.00000 -242.45730
41.00000 -239.48969
46.00000 -236.71410
51.00000 -234.24917
56.00000 -232.23077
61.00000 -230.76722
66.00000 -229.89667
71.00000 -229.63891
76.00000 -229.79670
81.00000 -230.19307
86.00000 -230.56069
91.00000 -230.61015
96.00000 -230.12272
101.00000 -229.02749
106.00000 -227.39430
111.00000 -225.47231
116.00000 -223.17091
121.00000 -220.46009
126.00000 -217.15806
131.00000 -213.06722
136.00000 -208.11281
141.00000 -202.37874
146.00000 -195.96680
151.00000 -189.01081
156.00000 -181.41637
161.00000 -172.91835
166.00000 -163.20898
171.00000 -152.08586
176.00000 -139.55686
181.00000 -125.69178
186.00000 -110.98920
191.00000 -95.86987
196.00000 -80.78332
201.00000 -66.16064
206.00000 -52.26034
211.00000 -39.11429
216.00000 -26.54602
221.00000 -14.50518
226.00000 -3.11482
231.00000  7.34652
236.00000 16.42696
241.00000 23.78251
246.00000 29.35802
251.00000 33.39811
256.00000 36.26490
261.00000 38.36951
266.00000 39.94152
271.00000 41.11926
276.00000 41.96951
281.00000 42.53988
286.00000 42.88633
291.00000 43.09042
296.00000 43.17917
301.00000 43.26209
306.00000 43.35535
311.00000 43.50744
316.00000 43.76089
321.00000 44.14934
326.00000 44.97736
331.00000 46.00501
336.00000 47.46423
341.00000 49.46483
346.00000 52.13112
351.00000 55.56650
356.00000 59.79815
361.00000 64.40318
366.00000 69.11890
371.00000 72.76241
376.00000 73.87179
381.00000 70.87299
386.00000 62.63524
391.00000 48.88062
396.00000 30.13071
401.00000  7.94134
406.00000 -15.63014
411.00000 -38.06964
416.00000 -56.79743
421.00000 -69.88773
426.00000 -76.62521
431.00000 -77.23025
436.00000 -73.18860
441.00000 -65.42146
446.00000 -55.08370
451.00000 -42.84721
456.00000 -29.12927
461.00000 -14.18465
466.00000  1.74404
471.00000 17.85352
476.00000 33.47915
481.00000 46.54928
486.00000 54.93417
491.00000 56.56904
496.00000 50.36319
501.00000 36.57049
506.00000 16.31943
511.00000 -7.80316
516.00000 -33.14299
521.00000 -56.72163
526.00000 -75.90736
531.00000 -89.12086
536.00000 -96.15699
541.00000 -97.41167
546.00000 -94.52423
551.00000 -87.87728
556.00000 -77.91257
561.00000 -64.50589
566.00000 -47.47938
571.00000 -26.90222
576.00000 -3.25492
581.00000 22.33153
586.00000 47.62915
591.00000 70.10469
596.00000 86.77780
601.00000 95.37948
606.00000 95.12611
611.00000 86.43297
616.00000 71.39885
621.00000 51.78804
626.00000 29.66010
631.00000  6.70438
636.00000 -15.84256
641.00000 -37.34103
646.00000 -57.63616
651.00000 -76.32152
656.00000 -93.14116
661.00000 -106.27686
666.00000 -113.79108
671.00000 -113.69649
676.00000 -105.00325
681.00000 -88.12156
686.00000 -64.19557
691.00000 -36.09158
696.00000 -6.49120
701.00000 21.70376
706.00000 45.94516
711.00000 64.74727
716.00000 77.95145
721.00000 85.99262
726.00000 90.16449
731.00000 90.37103
736.00000 86.41455
741.00000 77.47298
746.00000 62.91854
751.00000 42.78009
756.00000 17.58564
761.00000 -10.91668
766.00000 -40.42910
771.00000 -68.48481
776.00000 -92.39988
781.00000 -110.25386
786.00000 -121.46847
791.00000 -126.41787
796.00000 -126.64811
801.00000 -122.71274
806.00000 -115.09507
811.00000 -103.49999
816.00000 -87.47397
821.00000 -66.84860
826.00000 -42.01911
831.00000 -13.79175
836.00000 15.77169
841.00000 44.04787
846.00000 68.21394
851.00000 85.66872
856.00000 95.07318
861.00000 96.66177
866.00000 91.24143
871.00000 81.08101
876.00000 67.23721
881.00000 50.73127
886.00000 32.10402
891.00000 11.64373
896.00000 -10.43068
901.00000 -33.75519
906.00000 -57.44320
911.00000 -79.50664
916.00000 -97.73532
921.00000 -109.57374
926.00000 -113.29722
931.00000 -108.63831
936.00000 -96.27685
941.00000 -78.45729
946.00000 -56.94742
951.00000 -33.60021
956.00000 -9.90221
961.00000 13.16977
966.00000 35.22711
971.00000 56.21186
976.00000 76.19409
981.00000 93.99292
986.00000 108.33020
991.00000 117.08302
996.00000 118.43397
1001.00000 111.65894
1006.00000 97.37134
1011.00000 76.49151
1016.00000 51.83752
1021.00000 25.36392
1026.00000 -0.86931
1031.00000 -25.20494
1036.00000 -46.78084
1041.00000 -65.54135
1046.00000 -81.45069
1051.00000 -94.83551
1056.00000 -104.38690
1061.00000 -108.57467
1066.00000 -105.53369
1071.00000 -94.14716
1076.00000 -74.57915
1081.00000 -47.80494
1086.00000 -16.48708
1091.00000 16.55934
1096.00000 48.28673
1101.00000 75.78797
1106.00000 97.18525
1111.00000 112.07869
1116.00000 120.99362
1121.00000 125.42557
1126.00000 125.62531
1131.00000 121.75353
1136.00000 113.15463
1141.00000 99.18508
1146.00000 79.72524
1151.00000 55.14810
1156.00000 26.88547
1161.00000 -2.90139
1166.00000 -31.99036
1171.00000 -57.74308
1176.00000 -78.07523
1181.00000 -92.10744
1186.00000 -100.23944
1191.00000 -103.24054
1196.00000 -102.56483
1201.00000 -98.46305
1206.00000 -90.98349
1211.00000 -79.83388
1216.00000 -64.89359
1221.00000 -46.46964
1226.00000 -24.83361
1231.00000 -1.65973
1236.00000 21.54866
1241.00000 43.20773
1246.00000 61.81784
1251.00000 76.63376
1256.00000 87.83162
1261.00000 96.26094
1266.00000 102.47801
1271.00000 106.42839
1276.00000 107.49137
1281.00000 104.55694
1286.00000 96.79911
1291.00000 84.14703
1296.00000 67.11867
1301.00000 46.84149
1306.00000 24.44646
1311.00000  0.62724
1316.00000 -24.04898
1321.00000 -49.25050
1326.00000 -74.82150
1331.00000 -100.85025
1336.00000 -127.10677
1341.00000 -153.08277
1346.00000 -178.34991
1351.00000 -202.15506
1356.00000 -223.91224
1361.00000 -243.45904
1366.00000 -261.05693
1371.00000 -277.20601
1376.00000 -292.04137
1381.00000 -305.44495
1386.00000 -316.95525
1391.00000 -326.05829
1396.00000 -332.53567
1401.00000 -336.60218
1406.00000 -338.79446
1411.00000 -339.70858
1416.00000 -339.99031
1421.00000 -340.00796
1426.00000 -340.04237
1431.00000 -340.23998
1436.00000 -340.64195
1441.00000 -341.22773
1446.00000 -341.89689
1451.00000 -342.67160
1456.00000 -343.42088
1461.00000 -344.10164
1466.00000 -344.69382
1471.00000 -345.20315
1476.00000 -345.65665
1481.00000 -346.07473
1486.00000 -346.47370
1491.00000 -346.85558
1496.00000 -347.21056
1501.00000 -347.52657
1506.00000 -347.79708
1511.00000 -348.02270
1516.00000 -348.20422
1521.00000 -348.34732
1526.00000 -348.44120
1531.00000 -348.47701
1536.00000 -348.44971
1541.00000 -348.36301
1546.00000 -348.22879
1551.00000 -348.06226
1556.00000 -347.87629
1561.00000 -347.68287
1566.00000 -347.48660
