0,-1.1629,-0.53143
0.001,-1.1507,-0.54686
0.002,-1.1385,-0.56229
0.003,-1.1262,-0.57771
0.004,-1.114,-0.59314
0.005,-1.1018,-0.60857
0.006,-1.0896,-0.624
0.007,-1.0774,-0.63943
0.008,-1.0311,-0.65211
0.009,-0.96149,-0.66291
0.01,-0.89186,-0.67371
0.011,-0.82222,-0.68451
0.012,-0.75258,-0.69531
0.013,-0.68294,-0.70611
0.014,-0.6133,-0.71691
0.015,-0.55136,-0.72
0.016,-0.52326,-0.68914
0.017,-0.49516,-0.65829
0.018,-0.46706,-0.62743
0.019,-0.43896,-0.59657
0.02,-0.41086,-0.56571
0.021,-0.38276,-0.53486
0.022,-0.35466,-0.504
0.023,-0.34747,-0.48634
0.024,-0.34624,-0.47246
0.025,-0.34502,-0.45857
0.026,-0.3438,-0.44469
0.027,-0.34258,-0.4308
0.028,-0.34136,-0.41691
0.029,-0.34014,-0.40303
0.03,-0.34118,-0.38114
0.031,-0.34606,-0.34566
0.032,-0.35095,-0.31017
0.033,-0.35584,-0.27469
0.034,-0.36072,-0.2392
0.035,-0.36561,-0.20371
0.036,-0.3705,-0.16823
0.037,-0.37538,-0.13274
0.038,-0.3838,-0.13143
0.039,-0.39235,-0.13143
0.04,-0.4009,-0.13143
0.041,-0.40946,-0.13143
0.042,-0.41801,-0.13143
0.043,-0.42656,-0.13143
0.044,-0.43511,-0.13143
0.045,-0.44299,-0.13229
0.046,-0.45032,-0.13383
0.047,-0.45765,-0.13537
0.048,-0.46498,-0.13691
0.049,-0.47231,-0.13846
0.05,-0.47964,-0.14
0.051,-0.48697,-0.14154
0.052,-0.49339,-0.14309
0.053,-0.49462,-0.14463
0.054,-0.49584,-0.14617
0.055,-0.49706,-0.14771
0.056,-0.49828,-0.14926
0.057,-0.4995,-0.1508
0.058,-0.50072,-0.15234
0.059,-0.50195,-0.15389
0.06,-0.50407,-0.15657
0.061,-0.50652,-0.15966
0.062,-0.50896,-0.16274
0.063,-0.5114,-0.16583
0.064,-0.51385,-0.16891
0.065,-0.51629,-0.172
0.066,-0.51873,-0.17509
0.067,-0.52077,-0.17766
0.068,-0.52199,-0.1792
0.069,-0.52321,-0.18074
0.07,-0.52443,-0.18229
0.071,-0.52566,-0.18383
0.072,-0.52688,-0.18537
0.073,-0.5281,-0.18691
0.074,-0.52932,-0.18846
0.075,-0.53167,-0.19571
0.076,-0.53412,-0.20343
0.077,-0.53656,-0.21114
0.078,-0.539,-0.21886
0.079,-0.54145,-0.22657
0.08,-0.54389,-0.23429
0.081,-0.54633,-0.242
0.082,-0.54751,-0.24811
0.083,-0.54751,-0.25274
0.084,-0.54751,-0.25737
0.085,-0.54751,-0.262
0.086,-0.54751,-0.26663
0.087,-0.54751,-0.27126
0.088,-0.54751,-0.27589
0.089,-0.54751,-0.2812
0.09,-0.54751,-0.292
0.091,-0.54751,-0.3028
0.092,-0.54751,-0.3136
0.093,-0.54751,-0.3244
0.094,-0.54751,-0.3352
0.095,-0.54751,-0.346
0.096,-0.54751,-0.3568
0.097,-0.54321,-0.37303
0.098,-0.5371,-0.39154
0.099,-0.531,-0.41006
0.1,-0.52489,-0.42857
0.101,-0.51878,-0.44709
0.102,-0.51267,-0.4656
0.103,-0.50656,-0.48411
0.104,-0.50045,-0.49806
0.105,-0.49434,-0.50114
0.106,-0.48824,-0.50423
0.107,-0.48213,-0.50731
0.108,-0.47602,-0.5104
0.109,-0.46991,-0.51349
0.11,-0.4638,-0.51657
0.111,-0.45769,-0.51966
0.112,-0.45158,-0.52274
0.113,-0.44548,-0.52583
0.114,-0.43937,-0.52891
0.115,-0.43326,-0.532
0.116,-0.42715,-0.53509
0.117,-0.42104,-0.53817
0.118,-0.41493,-0.54126
0.119,-0.40941,-0.54434
0.12,-0.40452,-0.54743
0.121,-0.39964,-0.55051
0.122,-0.39475,-0.5536
0.123,-0.38986,-0.55669
0.124,-0.38498,-0.55977
0.125,-0.38009,-0.56286
0.126,-0.37511,-0.56594
0.127,-0.369,-0.56903
0.128,-0.3629,-0.57211
0.129,-0.35679,-0.5752
0.13,-0.35068,-0.57829
0.131,-0.34457,-0.58137
0.132,-0.33846,-0.58446
0.133,-0.33235,-0.58754
0.134,-0.32624,-0.58857
0.135,-0.32014,-0.58857
0.136,-0.31403,-0.58857
0.137,-0.30792,-0.58857
0.138,-0.30181,-0.58857
0.139,-0.2957,-0.58857
0.14,-0.28959,-0.58857
0.141,-0.28317,-0.58857
0.142,-0.27584,-0.58857
0.143,-0.26851,-0.58857
0.144,-0.26118,-0.58857
0.145,-0.25385,-0.58857
0.146,-0.24652,-0.58857
0.147,-0.23919,-0.58857
0.148,-0.23186,-0.58857
0.149,-0.22869,-0.58857
0.15,-0.22624,-0.58857
0.151,-0.2238,-0.58857
0.152,-0.22136,-0.58857
0.153,-0.21891,-0.58857
0.154,-0.21647,-0.58857
0.155,-0.21403,-0.58857
0.156,-0.21158,-0.58857
0.157,-0.20914,-0.58857
0.158,-0.2067,-0.58857
0.159,-0.20425,-0.58857
0.16,-0.20181,-0.58857
0.161,-0.19937,-0.58857
0.162,-0.19692,-0.58857
0.163,-0.19452,-0.58857
0.164,-0.1933,-0.58857
0.165,-0.19208,-0.58857
0.166,-0.19086,-0.58857
0.167,-0.18964,-0.58857
0.168,-0.18842,-0.58857
0.169,-0.18719,-0.58857
0.17,-0.18597,-0.58857
0.171,-0.18475,-0.58857
0.172,-0.18353,-0.58857
0.173,-0.18231,-0.58857
0.174,-0.18109,-0.58857
0.175,-0.17986,-0.58857
0.176,-0.17864,-0.58857
0.177,-0.17742,-0.58857
0.178,-0.17593,-0.58857
0.179,-0.17348,-0.58857
0.18,-0.17104,-0.58857
0.181,-0.1686,-0.58857
0.182,-0.16615,-0.58857
0.183,-0.16371,-0.58857
0.184,-0.16127,-0.58857
0.185,-0.15882,-0.58857
0.186,-0.15738,-0.58731
0.187,-0.15615,-0.58577
0.188,-0.15493,-0.58423
0.189,-0.15371,-0.58269
0.19,-0.15249,-0.58114
0.191,-0.15127,-0.5796
0.192,-0.15005,-0.57806
0.193,-0.14882,-0.574
0.194,-0.1476,-0.56629
0.195,-0.14638,-0.55857
0.196,-0.14516,-0.55086
0.197,-0.14394,-0.54314
0.198,-0.14271,-0.53543
0.199,-0.14149,-0.52771
0.2,-0.14027,-0.52
0.201,-0.13783,-0.50766
0.202,-0.13538,-0.49531
0.203,-0.13294,-0.48297
0.204,-0.1305,-0.47063
0.205,-0.12805,-0.45829
0.206,-0.12561,-0.44594
0.207,-0.12317,-0.4336
0.208,-0.12217,-0.424
0.209,-0.12217,-0.41629
0.21,-0.12217,-0.40857
0.211,-0.12217,-0.40086
0.212,-0.12217,-0.39314
0.213,-0.12217,-0.38543
0.214,-0.12217,-0.37771
0.215,-0.12195,-0.37
0.216,-0.12072,-0.36229
0.217,-0.1195,-0.35457
0.218,-0.11828,-0.34686
0.219,-0.11706,-0.33914
0.22,-0.11584,-0.33143
0.221,-0.11462,-0.32371
0.222,-0.11339,-0.316
0.223,-0.11312,-0.30829
0.224,-0.11312,-0.30057
0.225,-0.11312,-0.29286
0.226,-0.11312,-0.28514
0.227,-0.11312,-0.27743
0.228,-0.11312,-0.26971
0.229,-0.11312,-0.262
0.23,-0.11312,-0.252
0.231,-0.11312,-0.23811
0.232,-0.11312,-0.22423
0.233,-0.11312,-0.21034
0.234,-0.11312,-0.19646
0.235,-0.11312,-0.18257
0.236,-0.11312,-0.16869
0.237,-0.11312,-0.1548
0.238,-0.11312,-0.14983
0.239,-0.11312,-0.1452
0.24,-0.11312,-0.14057
0.241,-0.11312,-0.13594
0.242,-0.11312,-0.13131
0.243,-0.11312,-0.12669
0.244,-0.11312,-0.12206
0.245,-0.1138,-0.11743
0.246,-0.11502,-0.1128
0.247,-0.11624,-0.10817
0.248,-0.11747,-0.10354
0.249,-0.11869,-0.098914
0.25,-0.11991,-0.094286
0.251,-0.12113,-0.089657
0.252,-0.12271,-0.084571
0.253,-0.12638,-0.076857
0.254,-0.13005,-0.069143
0.255,-0.13371,-0.061429
0.256,-0.13738,-0.053714
0.257,-0.14104,-0.046
0.258,-0.14471,-0.038286
0.259,-0.14837,-0.030571
0.26,-0.15294,-0.025143
0.261,-0.15783,-0.020514
0.262,-0.16271,-0.015886
0.263,-0.1676,-0.011257
0.264,-0.17249,-0.0066286
0.265,-0.17738,-0.002
0.266,-0.18226,0.0026286
0.267,-0.18633,0.0062286
0.268,-0.18878,0.0077714
0.269,-0.19122,0.0093143
0.27,-0.19367,0.010857
0.271,-0.19611,0.0124
0.272,-0.19855,0.013943
0.273,-0.201,0.015486
0.274,-0.20344,0.017029
0.275,-0.20475,0.018571
0.276,-0.20597,0.020114
0.277,-0.20719,0.021657
0.278,-0.20842,0.0232
0.279,-0.20964,0.024743
0.28,-0.21086,0.026286
0.281,-0.21208,0.027829
0.282,-0.2133,0.028571
0.283,-0.21452,0.028571
0.284,-0.21575,0.028571
0.285,-0.21697,0.028571
0.286,-0.21819,0.028571
0.287,-0.21941,0.028571
0.288,-0.22063,0.028571
0.289,-0.22199,0.028571
0.29,-0.22443,0.028571
0.291,-0.22688,0.028571
0.292,-0.22932,0.028571
0.293,-0.23176,0.028571
0.294,-0.23421,0.028571
0.295,-0.23665,0.028571
0.296,-0.2391,0.028571
0.297,-0.24068,0.027486
0.298,-0.2419,0.025943
0.299,-0.24312,0.0244
0.3,-0.24434,0.022857
0.301,-0.24557,0.021314
0.302,-0.24679,0.019771
0.303,-0.24801,0.018229
0.304,-0.24887,0.016686
0.305,-0.24887,0.015143
0.306,-0.24887,0.0136
0.307,-0.24887,0.012057
0.308,-0.24887,0.010514
0.309,-0.24887,0.0089714
0.31,-0.24887,0.0074286
0.311,-0.24887,0.0058857
0.312,-0.24995,0.0016
0.313,-0.25118,-0.0030286
0.314,-0.2524,-0.0076571
0.315,-0.25362,-0.012286
0.316,-0.25484,-0.016914
0.317,-0.25606,-0.021543
0.318,-0.25729,-0.026171
0.319,-0.25733,-0.036743
0.32,-0.25611,-0.053714
0.321,-0.25489,-0.070686
0.322,-0.25367,-0.087657
0.323,-0.25244,-0.10463
0.324,-0.25122,-0.1216
0.325,-0.25,-0.13857
0.326,-0.24878,-0.15463
0.327,-0.24756,-0.15926
0.328,-0.24633,-0.16389
0.329,-0.24511,-0.16851
0.33,-0.24389,-0.17314
0.331,-0.24267,-0.17777
0.332,-0.24145,-0.1824
0.333,-0.24023,-0.18703
0.334,-0.239,-0.19166
0.335,-0.23778,-0.19629
0.336,-0.23656,-0.20091
0.337,-0.23534,-0.20554
0.338,-0.23412,-0.21017
0.339,-0.2329,-0.2148
0.34,-0.23167,-0.21943
0.341,-0.22887,-0.22486
0.342,-0.22154,-0.23257
0.343,-0.21421,-0.24029
0.344,-0.20688,-0.248
0.345,-0.19955,-0.25571
0.346,-0.19222,-0.26343
0.347,-0.18489,-0.27114
0.348,-0.17756,-0.27886
0.349,-0.1671,-0.28657
0.35,-0.15611,-0.29429
0.351,-0.14511,-0.302
0.352,-0.13412,-0.30971
0.353,-0.12312,-0.31743
0.354,-0.11213,-0.32514
0.355,-0.10113,-0.33286
0.356,-0.091765,-0.33851
0.357,-0.084434,-0.3416
0.358,-0.077104,-0.34469
0.359,-0.069774,-0.34777
0.36,-0.062443,-0.35086
0.361,-0.055113,-0.35394
0.362,-0.047783,-0.35703
0.363,-0.040181,-0.36017
0.364,-0.02552,-0.3648
0.365,-0.01086,-0.36943
0.366,0.0038009,-0.37406
0.367,0.018462,-0.37869
0.368,0.033122,-0.38331
0.369,0.047783,-0.38794
0.37,0.062443,-0.39257
0.371,0.071719,-0.39429
0.372,0.077828,-0.39429
0.373,0.083937,-0.39429
0.374,0.090045,-0.39429
0.375,0.096154,-0.39429
0.376,0.10226,-0.39429
0.377,0.10837,-0.39429
0.378,0.11665,-0.39429
0.379,0.13253,-0.39429
0.38,0.14842,-0.39429
0.381,0.1643,-0.39429
0.382,0.18018,-0.39429
0.383,0.19606,-0.39429
0.384,0.21195,-0.39429
0.385,0.22783,-0.39429
0.386,0.23376,-0.39429
0.387,0.23742,-0.39429
0.388,0.24109,-0.39429
0.389,0.24475,-0.39429
0.39,0.24842,-0.39429
0.391,0.25208,-0.39429
0.392,0.25575,-0.39429
0.393,0.25941,-0.39366
0.394,0.26308,-0.39211
0.395,0.26674,-0.39057
0.396,0.27041,-0.38903
0.397,0.27407,-0.38749
0.398,0.27774,-0.38594
0.399,0.2814,-0.3844
0.4,0.28507,-0.38286
0.401,0.28873,-0.38131
0.402,0.2924,-0.37977
0.403,0.29606,-0.37823
0.404,0.29973,-0.37669
0.405,0.30339,-0.37514
0.406,0.30706,-0.3736
0.407,0.31072,-0.37206
0.408,0.31367,-0.36686
0.409,0.31611,-0.35914
0.41,0.31855,-0.35143
0.411,0.321,-0.34371
0.412,0.32344,-0.336
0.413,0.32588,-0.32829
0.414,0.32833,-0.32057
0.415,0.33032,-0.31314
0.416,0.33032,-0.30697
0.417,0.33032,-0.3008
0.418,0.33032,-0.29463
0.419,0.33032,-0.28846
0.42,0.33032,-0.28229
0.421,0.33032,-0.27611
0.422,0.33032,-0.26994
0.423,0.33127,-0.25777
0.424,0.33249,-0.24389
0.425,0.33371,-0.23
0.426,0.33493,-0.21611
0.427,0.33615,-0.20223
0.428,0.33738,-0.18834
0.429,0.3386,-0.17446
0.43,0.33891,-0.16229
0.431,0.33769,-0.15303
0.432,0.33647,-0.14377
0.433,0.33525,-0.13451
0.434,0.33403,-0.12526
0.435,0.33281,-0.116
0.436,0.33158,-0.10674
0.437,0.33036,-0.097486
0.438,0.32914,-0.089714
0.439,0.32792,-0.082
0.44,0.3267,-0.074286
0.441,0.32548,-0.066571
0.442,0.32425,-0.058857
0.443,0.32303,-0.051143
0.444,0.32181,-0.043429
0.445,0.31855,-0.028
0.446,0.31367,-0.0064
0.447,0.30878,0.0152
0.448,0.30389,0.0368
0.449,0.299,0.0584
0.45,0.29412,0.08
0.451,0.28923,0.1016
0.452,0.28507,0.12114
0.453,0.28507,0.12886
0.454,0.28507,0.13657
0.455,0.28507,0.14429
0.456,0.28507,0.152
0.457,0.28507,0.15971
0.458,0.28507,0.16743
0.459,0.28507,0.17514
0.46,0.28507,0.17943
0.461,0.28507,0.18251
0.462,0.28507,0.1856
0.463,0.28507,0.18869
0.464,0.28507,0.19177
0.465,0.28507,0.19486
0.466,0.28507,0.19794
0.467,0.28466,0.20051
0.468,0.28344,0.20206
0.469,0.28222,0.2036
0.47,0.281,0.20514
0.471,0.27977,0.20669
0.472,0.27855,0.20823
0.473,0.27733,0.20977
0.474,0.27611,0.21131
0.475,0.2681,0.21143
0.476,0.25955,0.21143
0.477,0.251,0.21143
0.478,0.24244,0.21143
0.479,0.23389,0.21143
0.48,0.22534,0.21143
0.481,0.21679,0.21143
0.482,0.21077,0.20743
0.483,0.2071,0.19971
0.484,0.20344,0.192
0.485,0.19977,0.18429
0.486,0.19611,0.17657
0.487,0.19244,0.16886
0.488,0.18878,0.16114
0.489,0.18579,0.15171
0.49,0.18824,0.12857
0.491,0.19068,0.10543
0.492,0.19312,0.082286
0.493,0.19557,0.059143
0.494,0.19801,0.036
0.495,0.20045,0.012857
0.496,0.2029,-0.010286
0.497,0.24317,-0.046457
0.498,0.29937,-0.088114
0.499,0.35557,-0.12977
0.5,0.41176,-0.17143
0.501,0.46796,-0.21309
0.502,0.52416,-0.25474
0.503,0.58036,-0.2964
0.504,0.61919,-0.30606
0.505,0.61674,-0.23971
0.506,0.6143,-0.17337
0.507,0.61186,-0.10703
0.508,0.60941,-0.040686
0.509,0.60697,0.025657
0.51,0.60452,0.092
0.511,0.60208,0.15834
0.512,0.59855,0.16709
0.513,0.59489,0.16863
0.514,0.59122,0.17017
0.515,0.58756,0.17171
0.516,0.58389,0.17326
0.517,0.58023,0.1748
0.518,0.57656,0.17634
0.519,0.57407,0.17789
0.52,0.57285,0.17943
0.521,0.57163,0.18097
0.522,0.57041,0.18251
0.523,0.56919,0.18406
0.524,0.56796,0.1856
0.525,0.56674,0.18714
0.526,0.56534,0.18857
0.527,0.56167,0.18857
0.528,0.55801,0.18857
0.529,0.55434,0.18857
0.53,0.55068,0.18857
0.531,0.54701,0.18857
0.532,0.54335,0.18857
0.533,0.53968,0.18857
0.534,0.53357,0.18651
0.535,0.52624,0.18343
0.536,0.51891,0.18034
0.537,0.51158,0.17726
0.538,0.50425,0.17417
0.539,0.49692,0.17109
0.54,0.48959,0.168
0.541,0.48321,0.16491
0.542,0.47955,0.16183
0.543,0.47588,0.15874
0.544,0.47222,0.15566
0.545,0.46855,0.15257
0.546,0.46489,0.14949
0.547,0.46122,0.1464
0.548,0.45756,0.14331
0.549,0.45701,0.13629
0.55,0.45701,0.12857
0.551,0.45701,0.12086
0.552,0.45701,0.11314
0.553,0.45701,0.10543
0.554,0.45701,0.097714
0.555,0.45701,0.09
0.556,0.4581,0.080229
0.557,0.46054,0.067886
0.558,0.46299,0.055543
0.559,0.46543,0.0432
0.56,0.46787,0.030857
0.561,0.47032,0.018514
0.562,0.47276,0.0061714
0.563,0.47538,-0.0061714
0.564,0.48271,-0.018514
0.565,0.49005,-0.030857
0.566,0.49738,-0.0432
0.567,0.50471,-0.055543
0.568,0.51204,-0.067886
0.569,0.51937,-0.080229
0.57,0.5267,-0.092571
0.571,0.55018,-0.11366
0.572,0.58317,-0.13989
0.573,0.61615,-0.16611
0.574,0.64914,-0.19234
0.575,0.68213,-0.21857
0.576,0.71511,-0.2448
0.577,0.7481,-0.27103
0.578,0.77647,-0.29211
0.579,0.78869,-0.2952
0.58,0.8009,-0.29829
0.581,0.81312,-0.30137
0.582,0.82534,-0.30446
0.583,0.83756,-0.30754
0.584,0.84977,-0.31063
0.585,0.86199,-0.31371
0.586,0.8762,-0.31429
0.587,0.89086,-0.31429
0.588,0.90552,-0.31429
0.589,0.92018,-0.31429
0.59,0.93484,-0.31429
0.591,0.9495,-0.31429
0.592,0.96416,-0.31429
0.593,0.97434,-0.31429
0.594,0.97801,-0.31429
0.595,0.98167,-0.31429
0.596,0.98534,-0.31429
0.597,0.989,-0.31429
0.598,0.99267,-0.31429
0.599,0.99633,-0.31429
0.6,1,-0.31429
0.601,1.0037,-0.31274
0.602,1.0073,-0.3112
0.603,1.011,-0.30966
0.604,1.0147,-0.30811
0.605,1.0183,-0.30657
0.606,1.022,-0.30503
0.607,1.0257,-0.30349
0.608,1.03,-0.29189
0.609,1.0349,-0.27337
0.61,1.0398,-0.25486
0.611,1.0447,-0.23634
0.612,1.0496,-0.21783
0.613,1.0545,-0.19931
0.614,1.0594,-0.1808
0.615,1.0633,-0.16114
0.616,1.0633,-0.13646
0.617,1.0633,-0.11177
0.618,1.0633,-0.087086
0.619,1.0633,-0.0624
0.62,1.0633,-0.037714
0.621,1.0633,-0.013029
0.622,1.0633,0.011657
0.623,1.0605,0.031543
0.624,1.0568,0.050057
0.625,1.0532,0.068571
0.626,1.0495,0.087086
0.627,1.0458,0.1056
0.628,1.0422,0.12411
0.629,1.0385,0.14263
0.63,1.0335,0.15886
0.631,1.0262,0.1712
0.632,1.0188,0.18354
0.633,1.0115,0.19589
0.634,1.0042,0.20823
0.635,0.99683,0.22057
0.636,0.9895,0.23291
0.637,0.98217,0.24526
0.638,0.97837,0.24869
0.639,0.97471,0.25177
0.64,0.97104,0.25486
0.641,0.96738,0.25794
0.642,0.96371,0.26103
0.643,0.96005,0.26411
0.644,0.95638,0.2672
0.645,0.95407,0.26943
0.646,0.95285,0.27097
0.647,0.95163,0.27251
0.648,0.95041,0.27406
0.649,0.94919,0.2756
0.65,0.94796,0.27714
0.651,0.94674,0.27869
0.652,0.94552,0.28
0.653,0.9443,0.28
0.654,0.94308,0.28
0.655,0.94186,0.28
0.656,0.94063,0.28
0.657,0.93941,0.28
0.658,0.93819,0.28
0.659,0.93697,0.28
0.66,0.92941,0.27657
0.661,0.91964,0.27194
0.662,0.90986,0.26731
0.663,0.90009,0.26269
0.664,0.89032,0.25806
0.665,0.88054,0.25343
0.666,0.87077,0.2488
0.667,0.86303,0.2452
0.668,0.85937,0.24366
0.669,0.8557,0.24211
0.67,0.85204,0.24057
0.671,0.84837,0.23903
0.672,0.84471,0.23749
0.673,0.84104,0.23594
0.674,0.83738,0.2344
0.675,0.83145,0.22143
0.676,0.82534,0.20754
0.677,0.81923,0.19366
0.678,0.81312,0.17977
0.679,0.80701,0.16589
0.68,0.8009,0.152
0.681,0.7948,0.13811
0.682,0.79122,0.12903
0.683,0.79,0.1244
0.684,0.78878,0.11977
0.685,0.78756,0.11514
0.686,0.78633,0.11051
0.687,0.78511,0.10589
0.688,0.78389,0.10126
0.689,0.78281,0.096286
0.69,0.78281,0.088571
0.691,0.78281,0.080857
0.692,0.78281,0.073143
0.693,0.78281,0.065429
0.694,0.78281,0.057714
0.695,0.78281,0.05
0.696,0.78281,0.042286
0.697,0.7871,0.0248
0.698,0.79321,0.0032
0.699,0.79932,-0.0184
0.7,0.80543,-0.04
0.701,0.81154,-0.0616
0.702,0.81765,-0.0832
0.703,0.82376,-0.1048
0.704,0.8295,-0.12274
0.705,0.83439,-0.132
0.706,0.83928,-0.14126
0.707,0.84416,-0.15051
0.708,0.84905,-0.15977
0.709,0.85394,-0.16903
0.71,0.85882,-0.17829
0.711,0.86371,-0.18754
0.712,0.86751,-0.19543
0.713,0.87118,-0.20314
0.714,0.87484,-0.21086
0.715,0.87851,-0.21857
0.716,0.88217,-0.22629
0.717,0.88584,-0.234
0.718,0.8895,-0.24171
0.719,0.89434,-0.24943
0.72,0.90045,-0.25714
0.721,0.90656,-0.26486
0.722,0.91267,-0.27257
0.723,0.91878,-0.28029
0.724,0.92489,-0.288
0.725,0.931,-0.29571
0.726,0.9371,-0.30343
0.727,0.94321,-0.31114
0.728,0.94932,-0.31886
0.729,0.95543,-0.32657
0.73,0.96154,-0.33429
0.731,0.96765,-0.342
0.732,0.97376,-0.34971
0.733,0.97986,-0.35743
0.734,0.99005,-0.3672
0.735,1.0023,-0.378
0.736,1.0145,-0.3888
0.737,1.0267,-0.3996
0.738,1.0389,-0.4104
0.739,1.0511,-0.4212
0.74,1.0633,-0.432
0.741,1.074,-0.4408
0.742,1.0801,-0.44389
0.743,1.0862,-0.44697
0.744,1.0923,-0.45006
0.745,1.0984,-0.45314
0.746,1.1045,-0.45623
0.747,1.1106,-0.45931
0.748,1.1167,-0.4624
0.749,1.1218,-0.46549
0.75,1.1267,-0.46857
0.751,1.1316,-0.47166
0.752,1.1365,-0.47474
0.753,1.1414,-0.47783
0.754,1.1462,-0.48091
0.755,1.1511,-0.484
0.756,1.1582,-0.48777
0.757,1.168,-0.4924
0.758,1.1777,-0.49703
0.759,1.1875,-0.50166
0.76,1.1973,-0.50629
0.761,1.2071,-0.51091
0.762,1.2168,-0.51554
0.763,1.2267,-0.52006
0.764,1.2402,-0.5216
0.765,1.2536,-0.52314
0.766,1.2671,-0.52469
0.767,1.2805,-0.52623
0.768,1.2939,-0.52777
0.769,1.3074,-0.52931
0.77,1.3208,-0.53086
0.771,1.3281,-0.53143
0.772,1.3318,-0.53143
0.773,1.3354,-0.53143
0.774,1.3391,-0.53143
0.775,1.3428,-0.53143
0.776,1.3464,-0.53143
0.777,1.3501,-0.53143
0.778,1.354,-0.53143
0.779,1.3589,-0.53143
0.78,1.3638,-0.53143
0.781,1.3687,-0.53143
0.782,1.3736,-0.53143
0.783,1.3785,-0.53143
0.784,1.3833,-0.53143
0.785,1.3882,-0.53143
0.786,1.3921,-0.53143
0.787,1.3958,-0.53143
0.788,1.3995,-0.53143
0.789,1.4031,-0.53143
0.79,1.4068,-0.53143
0.791,1.4105,-0.53143
0.792,1.4141,-0.53143
0.793,1.4183,-0.5308
0.794,1.4232,-0.52926
0.795,1.4281,-0.52771
0.796,1.4329,-0.52617
0.797,1.4378,-0.52463
0.798,1.4427,-0.52309
0.799,1.4476,-0.52154
0.8,1.4525,-0.52
0.801,1.4562,-0.51846
0.802,1.4598,-0.51691
0.803,1.4635,-0.51537
0.804,1.4671,-0.51383
0.805,1.4708,-0.51229
0.806,1.4745,-0.51074
0.807,1.4781,-0.5092
0.808,1.4825,-0.50491
0.809,1.4874,-0.49874
0.81,1.4923,-0.49257
0.811,1.4972,-0.4864
0.812,1.5021,-0.48023
0.813,1.507,-0.47406
0.814,1.5119,-0.46789
0.815,1.5161,-0.46171
0.816,1.5173,-0.45554
0.817,1.5185,-0.44937
0.818,1.5197,-0.4432
0.819,1.521,-0.43703
0.82,1.5222,-0.43086
0.821,1.5234,-0.42469
0.822,1.5246,-0.41851
0.823,1.5249,-0.41234
0.824,1.5249,-0.40617
0.825,1.5249,-0.4
0.826,1.5249,-0.39383
0.827,1.5249,-0.38766
0.828,1.5249,-0.38149
0.829,1.5249,-0.37531
0.83,1.5244,-0.36629
0.831,1.5232,-0.3524
0.832,1.522,-0.33851
0.833,1.5208,-0.32463
0.834,1.5195,-0.31074
0.835,1.5183,-0.29686
0.836,1.5171,-0.28297
0.837,1.5159,-0.26909
0.838,1.5158,-0.26114
0.839,1.5158,-0.25343
0.84,1.5158,-0.24571
0.841,1.5158,-0.238
0.842,1.5158,-0.23029
0.843,1.5158,-0.22257
0.844,1.5158,-0.21486
0.845,1.5158,-0.21057
0.846,1.5158,-0.20903
0.847,1.5158,-0.20749
0.848,1.5158,-0.20594
0.849,1.5158,-0.2044
0.85,1.5158,-0.20286
0.851,1.5158,-0.20131
0.852,1.5158,-0.2
0.853,1.5158,-0.2
0.854,1.5158,-0.2
0.855,1.5158,-0.2
0.856,1.5158,-0.2
0.857,1.5158,-0.2
0.858,1.5158,-0.2
0.859,1.5158,-0.2
0.86,1.5158,-0.2
0.861,1.5158,-0.2
0.862,1.5158,-0.2
0.863,1.5158,-0.2
0.864,1.5158,-0.2
0.865,1.5158,-0.2
0.866,1.5158,-0.2
0.867,1.5158,-0.2
0.868,1.5158,-0.2
0.869,1.5158,-0.2
0.87,1.5158,-0.2
0.871,1.5158,-0.2
0.872,1.5158,-0.2
0.873,1.5158,-0.2
0.874,1.5158,-0.2
0.875,1.5158,-0.2
0.876,1.5158,-0.2
0.877,1.5158,-0.2
0.878,1.5158,-0.2
0.879,1.5158,-0.2
0.88,1.5158,-0.2
0.881,1.5158,-0.2
0.882,1.5158,-0.2
0.883,1.5158,-0.2
0.884,1.5158,-0.2
0.885,1.5158,-0.2
0.886,1.5158,-0.2
0.887,1.5158,-0.2
0.888,1.5158,-0.2
0.889,1.5158,-0.2
0.89,1.5158,-0.2
0.891,1.5158,-0.2
0.892,1.5158,-0.2
0.893,1.5158,-0.2
0.894,1.5158,-0.2
0.895,1.5158,-0.2
0.896,1.5158,-0.2
0.897,1.5158,-0.2
0.898,1.5158,-0.2
0.899,1.5158,-0.2
0.9,1.5158,-0.2
0.901,1.5158,-0.2
0.902,1.5158,-0.2
0.903,1.5158,-0.2
0.904,1.5158,-0.2
0.905,1.5158,-0.2
0.906,1.5158,-0.2
0.907,1.5158,-0.2
0.908,1.5158,-0.2
0.909,1.5158,-0.2
0.91,1.5158,-0.2
0.911,1.5158,-0.2
0.912,1.5158,-0.2
0.913,1.5158,-0.2
0.914,1.5158,-0.2
0.915,1.5158,-0.2
0.916,1.5158,-0.2
0.917,1.5158,-0.2
0.918,1.5158,-0.2
0.919,1.5158,-0.2
0.92,1.5158,-0.2
0.921,1.5158,-0.2
0.922,1.5158,-0.2
0.923,1.5158,-0.2
0.924,1.5158,-0.2
0.925,1.5158,-0.2
0.926,1.5158,-0.2
0.927,1.5158,-0.2
0.928,1.5158,-0.2
0.929,1.5158,-0.2
0.93,1.5158,-0.2
0.931,1.5158,-0.2
0.932,1.5158,-0.2
0.933,1.5158,-0.2
0.934,1.5158,-0.2
0.935,1.5158,-0.2
0.936,1.5158,-0.2
0.937,1.5158,-0.2
0.938,1.5158,-0.2
0.939,1.5158,-0.2
0.94,1.5158,-0.2
0.941,1.5158,-0.2
0.942,1.5158,-0.2
0.943,1.5158,-0.2
0.944,1.5158,-0.2
0.945,1.5158,-0.2
0.946,1.5158,-0.2
0.947,1.5158,-0.2
0.948,1.5158,-0.2
0.949,1.5158,-0.2
0.95,1.5158,-0.2
0.951,1.5158,-0.2
0.952,1.5158,-0.2
0.953,1.5158,-0.2
0.954,1.5158,-0.2
0.955,1.5158,-0.2
0.956,1.5158,-0.2
0.957,1.5158,-0.2
0.958,1.5158,-0.2
0.959,1.5158,-0.2
0.96,1.5158,-0.2
0.961,1.5158,-0.2
0.962,1.5158,-0.2
0.963,1.5158,-0.2
0.964,1.5158,-0.2
0.965,1.5158,-0.2
0.966,1.5158,-0.2
0.967,1.5158,-0.2
0.968,1.5158,-0.2
0.969,1.5158,-0.2
0.97,1.5158,-0.2
0.971,1.5158,-0.2
0.972,1.5158,-0.2
0.973,1.5158,-0.2
0.974,1.5158,-0.2
0.975,1.5158,-0.2
0.976,1.5158,-0.2
0.977,1.5158,-0.2
0.978,1.5158,-0.2
0.979,1.5158,-0.2
0.98,1.5158,-0.2
0.981,1.5158,-0.2
0.982,1.5158,-0.2
0.983,1.5158,-0.2
0.984,1.5158,-0.2
0.985,1.5158,-0.2
0.986,1.5158,-0.2
0.987,1.5158,-0.2
0.988,1.5158,-0.2
0.989,1.5158,-0.2
0.99,1.5158,-0.2
0.991,1.5158,-0.2
0.992,1.5158,-0.2
0.993,1.5158,-0.2
0.994,1.5158,-0.2
0.995,1.5158,-0.2
0.996,1.5158,-0.2
0.997,1.5158,-0.2
0.998,1.5158,-0.2
0.999,1.5158,-0.2
1,1.5158,-0.2
