0,0.031674,-1.0262
0.01,0.10362,-0.99837
0.02,0.13828,-0.99125
0.03,0.18706,-0.99125
0.04,0.20471,-0.97819
0.05,0.24706,-0.96793
0.06,0.29719,-0.96793
0.07,0.32299,-0.96793
0.08,0.3495,-0.99125
0.09,0.37593,-0.99125
0.1,0.40181,-0.99125
0.11,0.42344,-0.99125
0.12,0.44833,-0.99125
0.13,0.51511,-0.99125
0.14,0.59059,-0.99125
0.15,0.66606,-0.97143
0.16,0.73937,-0.96793
0.17,0.77946,-0.96793
0.18,0.8105,-0.9677
0.19,0.84824,-0.94671
0.2,0.90045,-0.93294
0.21,0.94914,-0.93073
0.22,0.97955,-0.92128
0.23,1.0348,-0.89866
0.24,1.0829,-0.8779
0.25,1.1448,-0.85423
0.26,1.1835,-0.84805
0.27,1.2183,-0.82181
0.28,1.2603,-0.79487
0.29,1.3161,-0.7705
0.3,1.3602,-0.73003
0.31,1.3924,-0.70822
0.32,1.4471,-0.66519
0.33,1.4863,-0.64292
0.34,1.5182,-0.60035
0.35,1.5367,-0.57551
0.36,1.5531,-0.54764
0.37,1.587,-0.52641
0.38,1.5973,-0.50356
0.39,1.6263,-0.47079
0.4,1.6498,-0.42216
0.41,1.6875,-0.37353
0.42,1.7059,-0.3249
0.43,1.7059,-0.25831
0.44,1.6968,-0.22391
0.45,1.6869,-0.15569
0.46,1.6532,-0.096093
0.47,1.6155,-0.031254
0.48,1.5908,0.0083965
0.49,1.5591,0.049213
0.5,1.5385,0.075802
0.51,1.5178,0.11277
0.52,1.4992,0.12641
0.53,1.4614,0.17504
0.54,1.4418,0.18869
0.55,1.4122,0.22682
0.56,1.4072,0.24303
0.57,1.3655,0.26729
0.58,1.3055,0.31044
0.59,1.2533,0.33819
0.6,1.2262,0.35219
0.61,1.1776,0.38239
0.62,1.1292,0.41026
0.63,1.0841,0.43312
0.64,1.0376,0.44315
0.65,0.99367,0.47055
0.66,0.94172,0.48676
0.67,0.86742,0.51312
0.68,0.82335,0.51312
0.69,0.7943,0.53434
0.7,0.75113,0.53644
0.71,0.70072,0.54449
0.72,0.65394,0.5481
0.73,0.6162,0.5481
0.74,0.55511,0.5481
0.75,0.50905,0.5481
0.76,0.44615,0.5481
0.77,0.42,0.53644
0.78,0.37466,0.53644
0.79,0.34109,0.53644
0.8,0.29231,0.53644
0.81,0.26905,0.52268
0.82,0.23131,0.51312
0.83,0.20932,0.50146
0.84,0.18986,0.50146
0.85,0.1724,0.50146
0.86,0.14932,0.50146
0.87,0.14932,0.50146
0.88,0.14932,0.50146
0.89,0.14932,0.50146
0.9,0.14932,0.50146
0.91,0.14932,0.50146
0.92,0.14932,0.50146
0.93,0.14932,0.50146
0.94,0.14932,0.50146
0.95,0.14932,0.50146
0.96,0.14932,0.50146
0.97,0.14932,0.50146
0.98,0.14932,0.50146
0.99,0.14932,0.50146
1,0.14932,0.50146
