0,-314.447,1060.76,1091.1,0.7,-0.7,0.0,0.0
0.00371747,-313.766,1059.85,1092.03,0.7,-0.7,0.0,0.0
0.00743494,-312.874,1059.01,1093.13,0.7,-0.7,0.0,0.0
0.0111524,-311.999,1058.03,1094.37,0.7,-0.7,0.0,0.0
0.0148699,-311.142,1056.9,1095.78,0.7,-0.7,0.0,0.0
0.0185874,-310.303,1055.61,1097.35,0.7,-0.7,0.0,0.0
0.0223048,-309.482,1054.17,1099.07,0.7,-0.7,0.0,0.0
0.0260223,-308.677,1052.58,1100.95,0.7,-0.7,0.0,0.0
0.0297398,-307.887,1050.86,1102.96,0.7,-0.7,0.0,0.0
0.0334572,-307.108,1049.02,1105.1,0.7,-0.7,0.0,0.0
0.0371747,-306.34,1047.07,1107.33,0.7,-0.7,0.0,0.0
0.0408922,-305.577,1045.04,1109.64,0.7,-0.7,0.0,0.0
0.0446097,-304.82,1042.93,1112.03,0.7,-0.7,0.0,0.0
0.0483271,-304.067,1040.74,1114.47,0.7,-0.7,0.0,0.0
0.0520446,-303.317,1038.47,1116.98,0.7,-0.7,0.0,0.0
0.0557621,-302.57,1036.1,1119.57,0.7,-0.7,0.0,0.0
0.0594796,-301.829,1033.63,1122.24,0.7,-0.7,0.0,0.0
0.063197,-301.094,1031.03,1125.03,0.7,-0.7,0.0,0.0
0.0669145,-300.366,1028.27,1127.94,0.7,-0.7,0.0,0.0
0.070632,-299.648,1025.35,1131,0.7,-0.7,0.0,0.0
0.0743494,-298.938,1022.26,1134.21,0.7,-0.7,0.0,0.0
0.0780669,-298.235,1019.01,1137.55,0.7,-0.7,0.0,0.0
0.0817844,-297.537,1015.62,1141.03,0.7,-0.7,0.0,0.0
0.0855019,-296.839,1012.11,1144.59,0.7,-0.7,0.0,0.0
0.0892193,-296.137,1008.53,1148.22,0.7,-0.7,0.0,0.0
0.0929368,-295.426,1004.9,1151.88,0.7,-0.7,0.0,0.0
0.0966543,-294.699,1001.28,1155.53,0.7,-0.7,0.0,0.0
0.100372,-293.951,997.681,1159.13,0.7,-0.7,0.0,0.0
0.104089,-293.178,994.129,1162.67,0.7,-0.7,0.0,0.0
0.107807,-292.377,990.626,1166.15,0.7,-0.7,0.0,0.0
0.111524,-291.546,987.164,1169.58,0.7,-0.7,0.0,0.0
0.115242,-290.684,983.722,1172.96,0.7,-0.7,0.0,0.0
0.118959,-289.79,980.275,1176.33,0.7,-0.7,0.0,0.0
0.122677,-288.865,976.796,1179.71,0.7,-0.7,0.0,0.0
0.126394,-287.91,973.263,1183.12,0.7,-0.7,0.0,0.0
0.130112,-286.925,969.662,1186.58,0.7,-0.7,0.0,0.0
0.133829,-285.913,965.991,1190.08,0.7,-0.7,0.0,0.0
0.137546,-284.873,962.263,1193.61,0.7,-0.7,0.0,0.0
0.141264,-283.806,958.499,1197.17,0.7,-0.7,0.0,0.0
0.144981,-282.713,954.733,1200.71,0.7,-0.7,0.0,0.0
0.148699,-281.591,950.998,1204.21,0.7,-0.7,0.0,0.0
0.152416,-280.44,947.327,1207.63,0.7,-0.7,0.0,0.0
0.156134,-279.258,943.746,1210.96,0.7,-0.7,0.0,0.0
0.159851,-278.041,940.27,1214.18,0.7,-0.7,0.0,0.0
0.163569,-276.788,936.901,1217.29,0.7,-0.7,0.0,0.0
0.167286,-275.493,933.627,1220.28,0.7,-0.7,0.0,0.0
0.171004,-274.153,930.431,1223.19,0.7,-0.7,0.0,0.0
0.174721,-272.765,927.286,1226.03,0.7,-0.7,0.0,0.0
0.178439,-271.325,924.167,1228.83,0.7,-0.7,0.0,0.0
0.182156,-269.833,921.05,1231.6,0.7,-0.7,0.0,0.0
0.185874,-268.288,917.921,1234.36,0.7,-0.7,0.0,0.0
0.189591,-266.694,914.775,1237.11,0.7,-0.7,0.0,0.0
0.193309,-265.054,911.62,1239.85,0.7,-0.7,0.0,0.0
0.197026,-263.373,908.471,1242.58,0.7,-0.7,0.0,0.0
0.200743,-261.658,905.353,1245.27,0.7,-0.7,0.0,0.0
0.204461,-259.914,902.289,1247.9,0.7,-0.7,0.0,0.0
0.208178,-258.145,899.305,1250.46,0.7,-0.7,0.0,0.0
0.211896,-256.354,896.417,1252.94,0.7,-0.7,0.0,0.0
0.215613,-254.54,893.636,1255.32,0.7,-0.7,0.0,0.0
0.219331,-252.699,890.96,1257.61,0.7,-0.7,0.0,0.0
0.223048,-250.825,888.379,1259.81,0.7,-0.7,0.0,0.0
0.226766,-248.912,885.877,1261.95,0.7,-0.7,0.0,0.0
0.230483,-246.952,883.432,1264.03,0.7,-0.7,0.0,0.0
0.234201,-244.939,881.023,1266.08,0.7,-0.7,0.0,0.0
0.237918,-242.87,878.632,1268.1,0.7,-0.7,0.0,0.0
0.241636,-240.743,876.246,1270.12,0.7,-0.7,0.0,0.0
0.245353,-238.564,873.862,1272.12,0.7,-0.7,0.0,0.0
0.249071,-236.34,871.484,1274.12,0.7,-0.7,0.0,0.0
0.252788,-234.083,869.123,1276.11,0.7,-0.7,0.0,0.0
0.256506,-231.804,866.799,1278.06,0.7,-0.7,0.0,0.0
0.260223,-229.518,864.526,1279.97,0.7,-0.7,0.0,0.0
0.263941,-227.234,862.321,1281.83,0.7,-0.7,0.0,0.0
0.267658,-224.961,860.197,1283.62,0.7,-0.7,0.0,0.0
0.271375,-222.701,858.157,1285.36,0.7,-0.7,0.0,0.0
0.275093,-220.452,856.201,1287.02,0.7,-0.7,0.0,0.0
0.27881,-218.21,854.319,1288.64,0.7,-0.7,0.0,0.0
0.282528,-215.964,852.498,1290.21,0.7,-0.7,0.0,0.0
0.286245,-213.707,850.722,1291.75,0.7,-0.7,0.0,0.0
0.289963,-211.428,848.976,1293.27,0.7,-0.7,0.0,0.0
0.29368,-209.122,847.247,1294.78,0.7,-0.7,0.0,0.0
0.297398,-206.784,845.529,1296.28,0.7,-0.7,0.0,0.0
0.301115,-204.418,843.819,1297.79,0.7,-0.7,0.0,0.0
0.304833,-202.029,842.125,1299.28,0.7,-0.7,0.0,0.0
0.30855,-199.627,840.456,1300.77,0.7,-0.7,0.0,0.0
0.312268,-197.223,838.828,1302.23,0.7,-0.7,0.0,0.0
0.315985,-194.828,837.255,1303.65,0.7,-0.7,0.0,0.0
0.319703,-192.452,835.751,1305.04,0.7,-0.7,0.0,0.0
0.32342,-190.101,834.327,1306.37,0.7,-0.7,0.0,0.0
0.327138,-187.776,832.987,1307.66,0.7,-0.7,0.0,0.0
0.330855,-185.475,831.734,1308.89,0.7,-0.7,0.0,0.0
0.334572,-183.19,830.562,1310.07,0.7,-0.7,0.0,0.0
0.33829,-180.912,829.463,1311.22,0.7,-0.7,0.0,0.0
0.342007,-178.63,828.43,1312.34,0.7,-0.7,0.0,0.0
0.345725,-176.336,827.451,1313.43,0.7,-0.7,0.0,0.0
0.349442,-174.021,826.519,1314.51,0.7,-0.7,0.0,0.0
0.35316,-171.685,825.629,1315.58,0.7,-0.7,0.0,0.0
0.356877,-169.327,824.78,1316.63,0.7,-0.7,0.0,0.0
0.360595,-166.954,823.974,1317.66,0.7,-0.7,0.0,0.0
0.364312,-164.576,823.217,1318.66,0.7,-0.7,0.0,0.0
0.36803,-162.203,822.519,1319.63,0.7,-0.7,0.0,0.0
0.371747,-159.846,821.886,1320.55,0.7,-0.7,0.0,0.0
0.375465,-157.514,821.329,1321.42,0.7,-0.7,0.0,0.0
0.379182,-155.212,820.856,1322.22,0.7,-0.7,0.0,0.0
0.3829,-152.941,820.473,1322.95,0.7,-0.7,0.0,0.0
0.386617,-150.697,820.183,1323.61,0.7,-0.7,0.0,0.0
0.390335,-148.474,819.99,1324.19,0.7,-0.7,0.0,0.0
0.394052,-146.262,819.891,1324.71,0.7,-0.7,0.0,0.0
0.39777,-144.052,819.887,1325.16,0.7,-0.7,0.0,0.0
0.401487,-141.836,819.972,1325.54,0.7,-0.7,0.0,0.0
0.405204,-139.607,820.144,1325.87,0.7,-0.7,0.0,0.0
0.408922,-137.364,820.396,1326.13,0.7,-0.7,0.0,0.0
0.412639,-135.109,820.723,1326.35,0.7,-0.7,0.0,0.0
0.416357,-132.85,821.12,1326.51,0.7,-0.7,0.0,0.0
0.420074,-130.597,821.58,1326.62,0.7,-0.7,0.0,0.0
0.423792,-128.36,822.103,1326.68,0.7,-0.7,0.0,0.0
0.427509,-126.151,822.685,1326.68,0.7,-0.7,0.0,0.0
0.431227,-123.978,823.325,1326.62,0.7,-0.7,0.0,0.0
0.434944,-121.848,824.026,1326.5,0.7,-0.7,0.0,0.0
0.438662,-119.762,824.792,1326.31,0.7,-0.7,0.0,0.0
0.442379,-117.718,825.631,1326.04,0.7,-0.7,0.0,0.0
0.446097,-115.711,826.548,1325.69,0.7,-0.7,0.0,0.0
0.449814,-113.734,827.552,1325.26,0.7,-0.7,0.0,0.0
0.453532,-111.777,828.649,1324.74,0.7,-0.7,0.0,0.0
0.457249,-109.835,829.841,1324.12,0.7,-0.7,0.0,0.0
0.460967,-107.9,831.129,1323.42,0.7,-0.7,0.0,0.0
0.464684,-105.971,832.508,1322.64,0.7,-0.7,0.0,0.0
0.468401,-104.047,833.969,1321.78,0.7,-0.7,0.0,0.0
0.472119,-102.132,835.499,1320.86,0.7,-0.7,0.0,0.0
0.475836,-100.232,837.085,1319.87,0.7,-0.7,0.0,0.0
0.479554,-98.3517,838.712,1318.85,0.7,-0.7,0.0,0.0
0.483271,-96.4975,840.368,1317.78,0.7,-0.7,0.0,0.0
0.486989,-94.6743,842.046,1316.69,0.7,-0.7,0.0,0.0
0.490706,-92.8845,843.742,1315.56,0.7,-0.7,0.0,0.0
0.494424,-91.1282,845.46,1314.4,0.7,-0.7,0.0,0.0
0.498141,-89.4029,847.21,1313.2,0.7,-0.7,0.0,0.0
0.501859,-87.7042,849.002,1311.94,0.7,-0.7,0.0,0.0
0.505576,-86.0267,850.852,1310.62,0.7,-0.7,0.0,0.0
0.509294,-84.3648,852.77,1309.23,0.7,-0.7,0.0,0.0
0.513011,-82.7139,854.768,1307.75,0.7,-0.7,0.0,0.0
0.516729,-81.0709,856.847,1306.19,0.7,-0.7,0.0,0.0
0.520446,-79.435,859.006,1304.56,0.7,-0.7,0.0,0.0
0.524164,-77.8076,861.234,1302.85,0.7,-0.7,0.0,0.0
0.527881,-76.1925,863.515,1301.09,0.7,-0.7,0.0,0.0
0.531599,-74.5955,865.833,1299.28,0.7,-0.7,0.0,0.0
0.535316,-73.0219,868.166,1297.46,0.7,-0.7,0.0,0.0
0.539033,-71.4775,870.5,1295.61,0.7,-0.7,0.0,0.0
0.542751,-69.9675,872.823,1293.77,0.7,-0.7,0.0,0.0
0.546468,-68.4953,875.133,1291.93,0.7,-0.7,0.0,0.0
0.550186,-67.0626,877.433,1290.07,0.7,-0.7,0.0,0.0
0.553903,-65.6694,879.737,1288.2,0.7,-0.7,0.0,0.0
0.557621,-64.3143,882.059,1286.3,0.7,-0.7,0.0,0.0
0.561338,-62.9947,884.419,1284.35,0.7,-0.7,0.0,0.0
0.565056,-61.7079,886.832,1282.34,0.7,-0.7,0.0,0.0
0.568773,-60.4508,889.312,1280.25,0.7,-0.7,0.0,0.0
0.572491,-59.221,891.864,1278.07,0.7,-0.7,0.0,0.0
0.576208,-58.0166,894.485,1275.83,0.7,-0.7,0.0,0.0
0.579926,-56.8367,897.166,1273.51,0.7,-0.7,0.0,0.0
0.583643,-55.6812,899.889,1271.14,0.7,-0.7,0.0,0.0
0.587361,-54.5517,902.633,1268.74,0.7,-0.7,0.0,0.0
0.591078,-53.4487,905.377,1266.32,0.7,-0.7,0.0,0.0
0.594796,-52.3743,908.106,1263.91,0.7,-0.7,0.0,0.0
0.598513,-51.3305,910.807,1261.5,0.7,-0.7,0.0,0.0
0.60223,-50.3196,913.479,1259.1,0.7,-0.7,0.0,0.0
0.605948,-49.3436,916.128,1256.7,0.7,-0.7,0.0,0.0
0.609665,-48.4042,918.77,1254.29,0.7,-0.7,0.0,0.0
0.613383,-47.503,921.422,1251.85,0.7,-0.7,0.0,0.0
0.6171,-46.6407,924.107,1249.34,0.7,-0.7,0.0,0.0
0.620818,-45.8175,926.843,1246.77,0.7,-0.7,0.0,0.0
0.624535,-45.0327,929.643,1244.11,0.7,-0.7,0.0,0.0
0.628253,-44.2846,932.512,1241.37,0.7,-0.7,0.0,0.0
0.63197,-43.5706,935.445,1238.54,0.7,-0.7,0.0,0.0
0.635688,-42.8874,938.43,1235.65,0.7,-0.7,0.0,0.0
0.639405,-42.2313,941.445,1232.71,0.7,-0.7,0.0,0.0
0.643123,-41.5994,944.466,1229.76,0.7,-0.7,0.0,0.0
0.64684,-40.988,947.469,1226.82,0.7,-0.7,0.0,0.0
0.650558,-40.3951,950.435,1223.92,0.7,-0.7,0.0,0.0
0.654275,-39.8204,953.351,1221.06,0.7,-0.7,0.0,0.0
0.657993,-39.265,956.215,1218.26,0.7,-0.7,0.0,0.0
0.66171,-38.7316,959.033,1215.49,0.7,-0.7,0.0,0.0
0.665428,-38.2239,961.82,1212.76,0.7,-0.7,0.0,0.0
0.669145,-37.7461,964.598,1210.04,0.7,-0.7,0.0,0.0
0.672862,-37.3023,967.387,1207.3,0.7,-0.7,0.0,0.0
0.67658,-36.8954,970.207,1204.53,0.7,-0.7,0.0,0.0
0.680297,-36.527,973.07,1201.71,0.7,-0.7,0.0,0.0
0.684015,-36.196,975.983,1198.84,0.7,-0.7,0.0,0.0
0.687732,-35.8995,978.94,1195.93,0.7,-0.7,0.0,0.0
0.69145,-35.632,981.927,1192.99,0.7,-0.7,0.0,0.0
0.695167,-35.3869,984.923,1190.04,0.7,-0.7,0.0,0.0
0.698885,-35.1578,987.904,1187.12,0.7,-0.7,0.0,0.0
0.702602,-34.9378,990.847,1184.26,0.7,-0.7,0.0,0.0
0.70632,-34.7221,993.733,1181.46,0.7,-0.7,0.0,0.0
0.710037,-34.5086,996.55,1178.76,0.7,-0.7,0.0,0.0
0.713755,-34.2976,999.297,1176.14,0.7,-0.7,0.0,0.0
0.717472,-34.0926,1001.98,1173.62,0.7,-0.7,0.0,0.0
0.72119,-33.8987,1004.61,1171.16,0.7,-0.7,0.0,0.0
0.724907,-33.7223,1007.22,1168.77,0.7,-0.7,0.0,0.0
0.728625,-33.5697,1009.81,1166.41,0.7,-0.7,0.0,0.0
0.732342,-33.4458,1012.41,1164.07,0.7,-0.7,0.0,0.0
0.736059,-33.3532,1015.04,1161.73,0.7,-0.7,0.0,0.0
0.739777,-33.2914,1017.68,1159.39,0.7,-0.7,0.0,0.0
0.743494,-33.2567,1020.35,1157.05,0.7,-0.7,0.0,0.0
0.747212,-33.2423,1023.02,1154.72,0.7,-0.7,0.0,0.0
0.750929,-33.2392,1025.68,1152.42,0.7,-0.7,0.0,0.0
0.754647,-33.2385,1028.3,1150.16,0.7,-0.7,0.0,0.0
0.758364,-33.2313,1030.86,1147.97,0.7,-0.7,0.0,0.0
0.762082,-33.2107,1033.36,1145.85,0.7,-0.7,0.0,0.0
0.765799,-33.1732,1035.77,1143.83,0.7,-0.7,0.0,0.0
0.769517,-33.1186,1038.09,1141.9,0.7,-0.7,0.0,0.0
0.773234,-33.0502,1040.34,1140.05,0.7,-0.7,0.0,0.0
0.776952,-32.9737,1042.52,1138.27,0.7,-0.7,0.0,0.0
0.780669,-32.8964,1044.64,1136.56,0.7,-0.7,0.0,0.0
0.784387,-32.8258,1046.73,1134.89,0.7,-0.7,0.0,0.0
0.788104,-32.7682,1048.81,1133.25,0.7,-0.7,0.0,0.0
0.791822,-32.7274,1050.87,1131.63,0.7,-0.7,0.0,0.0
0.795539,-32.7046,1052.92,1130.03,0.7,-0.7,0.0,0.0
0.799257,-32.6975,1054.97,1128.44,0.7,-0.7,0.0,0.0
0.802974,-32.701,1057,1126.88,0.7,-0.7,0.0,0.0
0.806691,-32.7082,1059,1125.35,0.7,-0.7,0.0,0.0
0.810409,-32.7119,1060.96,1123.87,0.7,-0.7,0.0,0.0
0.814126,-32.7054,1062.86,1122.45,0.7,-0.7,0.0,0.0
0.817844,-32.684,1064.68,1121.1,0.7,-0.7,0.0,0.0
0.821561,-32.6461,1066.43,1119.82,0.7,-0.7,0.0,0.0
0.825279,-32.5935,1068.1,1118.62,0.7,-0.7,0.0,0.0
0.828996,-32.5307,1069.7,1117.49,0.7,-0.7,0.0,0.0
0.832714,-32.4646,1071.23,1116.42,0.7,-0.7,0.0,0.0
0.836431,-32.4031,1072.7,1115.41,0.7,-0.7,0.0,0.0
0.840149,-32.3538,1074.14,1114.45,0.7,-0.7,0.0,0.0
0.843866,-32.3227,1075.55,1113.52,0.7,-0.7,0.0,0.0
0.847584,-32.3133,1076.93,1112.62,0.7,-0.7,0.0,0.0
0.851301,-32.3256,1078.3,1111.74,0.7,-0.7,0.0,0.0
0.855019,-32.3564,1079.64,1110.88,0.7,-0.7,0.0,0.0
0.858736,-32.3997,1080.96,1110.05,0.7,-0.7,0.0,0.0
0.862454,-32.4478,1082.25,1109.25,0.7,-0.7,0.0,0.0
0.866171,-32.4931,1083.49,1108.48,0.7,-0.7,0.0,0.0
0.869888,-32.5285,1084.69,1107.75,0.7,-0.7,0.0,0.0
0.873606,-32.5496,1085.83,1107.06,0.7,-0.7,0.0,0.0
0.877323,-32.5553,1086.91,1106.41,0.7,-0.7,0.0,0.0
0.881041,-32.5478,1087.94,1105.8,0.7,-0.7,0.0,0.0
0.884758,-32.5323,1088.9,1105.22,0.7,-0.7,0.0,0.0
0.888476,-32.5162,1089.82,1104.68,0.7,-0.7,0.0,0.0
0.892193,-32.5076,1090.69,1104.17,0.7,-0.7,0.0,0.0
0.895911,-32.5139,1091.53,1103.68,0.7,-0.7,0.0,0.0
0.899628,-32.5407,1092.34,1103.2,0.7,-0.7,0.0,0.0
0.903346,-32.5903,1093.12,1102.74,0.7,-0.7,0.0,0.0
0.907063,-32.6617,1093.87,1102.28,0.7,-0.7,0.0,0.0
0.910781,-32.7499,1094.61,1101.84,0.7,-0.7,0.0,0.0
0.914498,-32.8472,1095.32,1101.4,0.7,-0.7,0.0,0.0
0.918216,-32.9443,1096,1100.98,0.7,-0.7,0.0,0.0
0.921933,-33.0319,1096.65,1100.58,0.7,-0.7,0.0,0.0
0.925651,-33.1019,1097.26,1100.2,0.7,-0.7,0.0,0.0
0.929368,-33.1489,1097.83,1099.84,0.7,-0.7,0.0,0.0
0.933086,-33.171,1098.35,1099.5,0.7,-0.7,0.0,0.0
0.936803,-33.17,1098.84,1099.18,0.7,-0.7,0.0,0.0
0.94052,-33.151,1099.28,1098.89,0.7,-0.7,0.0,0.0
0.944238,-33.121,1099.68,1098.6,0.7,-0.7,0.0,0.0
0.947955,-33.0881,1100.04,1098.34,0.7,-0.7,0.0,0.0
0.951673,-33.0599,1100.37,1098.08,0.7,-0.7,0.0,0.0
0.95539,-33.0419,1100.67,1097.83,0.7,-0.7,0.0,0.0
0.959108,-33.0371,1100.94,1097.58,0.7,-0.7,0.0,0.0
0.962825,-33.045,1101.18,1097.34,0.7,-0.7,0.0,0.0
0.966543,-33.0619,1101.4,1097.11,0.7,-0.7,0.0,0.0
0.97026,-33.0817,1101.6,1096.89,0.7,-0.7,0.0,0.0
0.973978,-33.0969,1101.77,1096.68,0.7,-0.7,0.0,0.0
0.977695,-33.1005,1101.93,1096.49,0.7,-0.7,0.0,0.0
0.981413,-33.0862,1102.06,1096.31,0.7,-0.7,0.0,0.0
0.98513,-33.0507,1102.17,1096.16,0.7,-0.7,0.0,0.0
0.988848,-32.9937,1102.25,1096.02,0.7,-0.7,0.0,0.0
0.992565,-32.9182,1102.31,1095.91,0.7,-0.7,0.0,0.0
0.996283,-32.8297,1102.35,1095.82,0.7,-0.7,0.0,0.0
1,-32.7355,1102.36,1095.75,0.7,-0.7,0.0,0.0
