6.802672542242795828e-01,-1.634235124987708232e-02
3.809518438642478078e+00,7.984834812700092321e-01
-1.661372395789898704e+00,-5.776669509655611989e-01
-2.573072541060864027e-01,-1.555517250716381139e-01
6.980174532952329036e-01,1.745612859547047147e-01
2.472264961837057573e+00,5.673050456691022259e-01
2.068475280378082870e-01,-2.743376591756798571e-02
5.672463565362535487e-01,8.908340767516417791e-02
-3.487690484018614590e-01,-2.314712128220809684e-01
-1.451962756812932076e+00,-3.729450658857800804e-01
1.111151612248612919e+00,5.167464197595521558e-01
-1.261680534690951205e+00,-3.833096280485273621e-01
-2.472421646817899887e+00,-8.087217322382667106e-01
-3.182125450439171055e-01,-7.944939174047804809e-02
2.497909908830484582e+00,4.344655865242682546e-01
6.428762833236950636e-01,1.357702652711778035e-01
-3.367353995980675752e+00,-7.035400125265595106e-01
2.657932474767660813e-01,9.733080257420728687e-02
2.044045742933499277e+00,3.579228714409924406e-01
-5.139146759780705009e-01,-8.218841848933899907e-02
-2.414030493204257777e+00,-4.631518783648808091e-01
3.316318171894042433e+00,9.509371771552171948e-01
-7.447263127390167936e-01,-1.242645024693092015e-01
1.321733604914246962e+00,4.362756783377566561e-01
-3.616584763637468170e-01,7.629367267020767396e-02
6.577342463607454004e-01,2.443076552630723819e-01
-2.007074713008100364e+00,-4.211723598920775746e-01
7.281641799017100070e-01,1.741509710460325544e-01
5.142022261576283393e-01,1.143370368575957752e-01
-6.166599821781347801e-01,-8.166425702675889076e-02
-6.112403746189202236e-01,-7.657521983862142223e-02
-2.934680423963850426e+00,-6.091984127282253914e-01
-6.830275915540451326e-01,-1.784549887086800402e-01
7.867298343938160521e-01,3.481327369069141531e-01
8.830717285343621381e-02,1.115079947567798047e-01
2.192709482875981331e-01,-2.131589191478942130e-02
-2.099203894601209264e+00,-6.078703965957911182e-01
-1.164177154598532438e+00,-3.141582004938802131e-01
-9.840444300995062621e-01,-1.444601509875780287e-01
9.548108179056724598e-02,5.362139010463544408e-02
1.531405027822118070e+00,4.768455788600104994e-01
-2.611614266671280493e+00,-6.610637184839355251e-01
3.223011599251991210e+00,6.095304510326733372e-01
-3.058722208809965259e-01,-1.898478914409054419e-01
1.792567935782932276e+00,5.288559529235089540e-01
2.078156619650126657e+00,5.292957228502889189e-01
1.660286362022311613e+00,3.698281167857990770e-01
1.201174385926311761e+00,2.469926275593390952e-01
3.035979839639919575e+00,7.132981954902520849e-01
6.833819178559927821e-01,1.481045361075186695e-01
-2.291190403942158671e+00,-7.274186941626040737e-01
1.647974403868618820e+00,5.148071831117778663e-01
3.304156015603797236e+00,8.947608147711331172e-01
-1.270673179449288259e+00,-2.576200265003283918e-01
2.516875145438521422e+00,3.999117139257312714e-01
1.540275919068154975e+00,1.756619672674971377e-01
3.247110420268357167e+00,8.501485497450838036e-01
1.364175872853871763e+00,3.477828954136961137e-01
-2.635171582544181268e-01,-1.567292340137084738e-01
1.567751341663095488e+00,3.074747315920027257e-01
-1.868981343993130650e+00,-4.774028693492407549e-01
2.254856024367951406e+00,5.007305412542065737e-01
-2.543787185570403064e-01,9.602969842068242654e-03
3.143748338414880994e+00,7.832208465639005635e-01
6.926851216098877106e-01,9.575525879520063732e-02
9.167236251960892979e-01,2.926912839612585415e-01
5.411194906639700541e-02,8.016548937547808562e-02
1.149936601409049519e+00,3.341579258164880106e-01
-3.541078844825912841e-01,-1.409785838926920498e-01
-1.858204564841859696e+00,-4.768252747583668905e-01
7.469658921497127624e-01,3.248824397763753202e-01
1.079553442716580935e+00,2.373452252195896728e-01
1.605615127883703419e+00,1.394773173097713370e-01
1.898927689762949900e+00,5.380887377827571205e-01
-7.846938281850052155e-01,-5.304310087473147750e-02
2.912682626803923203e+00,6.921612491922097821e-01
-1.404945515720324334e+00,-2.560999332587617916e-01
-1.127913086815582444e+00,-2.555460621022997425e-01
-1.835883564217819508e+00,-5.446361955560200530e-01
-7.442940760655378796e-01,-6.038115265666337689e-02
3.280204491488875718e+00,8.216160665960248188e-01
1.488371103548245256e-01,-5.992158413849973247e-02
1.435417059882630131e+00,4.602887424436356567e-01
-2.626110864521939536e+00,-5.178869039720882528e-01
5.388024402722443318e-01,7.974065534709671305e-03
5.418370100031359993e-01,3.540517879912657290e-02
-1.106743508610249727e+00,-3.460932985103278847e-01
1.158710681078765736e+00,3.760620914910972612e-01
-1.172234622175340801e+00,-1.954789446826961097e-01
2.971457034259643651e-02,5.254491396175701295e-02
-2.337417198810631813e+00,-5.145811262418591436e-01
-3.779785358781525328e+00,-8.249994206064816815e-01
-2.723498014531470890e+00,-7.033462073454178620e-01
8.868063474365649179e-02,1.313043656472348275e-01
2.623124812191450772e+00,6.911621378018256712e-01
4.539864778936109624e-01,2.361060387120180182e-01
-1.985758946160035565e+00,-4.633091172737294205e-01
-2.916287630778217621e-01,-1.209461985420746261e-01
1.399957061738343445e+00,2.522226064641258647e-01
2.272097514041866440e+00,3.182875848464878366e-01
-6.258427286559710367e+00,2.832434575696851642e+00
-5.230238282879020595e+00,3.458684611505818296e+00
-5.551907931731685508e+00,1.868130768982416035e+00
-6.017028287079255300e+00,2.483378363556017820e+00
-5.804052780669732847e+00,2.931294727249929455e+00
-5.362874764335185951e+00,3.222052750633911611e+00
-5.449570426523716371e+00,2.673506632284839757e+00
-6.661112379142775097e+00,2.712965214758216170e+00
-6.011914289703008230e+00,3.265406214888557201e+00
-4.418483734516403416e+00,2.970419993837550177e+00
-6.669161500344944038e+00,2.757812757010429383e+00
-6.324517182252265890e+00,3.337037031641423290e+00
-7.078557910111237028e+00,3.044283395940232229e+00
-5.890445423424236715e+00,3.162526725340192968e+00
-6.418121248275753921e+00,2.833454789184794986e+00
-6.996842636287771811e+00,2.654676081646464070e+00
-6.380003033211702146e+00,3.291235032382997971e+00
-6.809327702275338901e+00,3.546838671196995474e+00
-4.953860818856041348e+00,1.551010482490527309e+00
-5.701618888455329603e+00,3.473835624521171894e+00
-6.446205917886560499e+00,2.721909729969841596e+00
-6.093016404310868772e+00,2.791546384418789994e+00
-6.216309078332985294e+00,1.826797335569016356e+00
-5.193367904651815969e+00,3.755733014425774563e+00
-6.569354981442941721e+00,1.973502970538240309e+00
-5.635254586483068984e+00,2.596948421130853557e+00
-5.900632785675454350e+00,2.776470107998433523e+00
-5.515922874250869690e+00,3.486324400559204229e+00
-6.507918164924508808e+00,2.031645231223461412e+00
-7.108056878134557444e+00,3.427265565375043455e+00
-6.832201480448819808e+00,2.645228551990918664e+00
-6.417419826915355507e+00,2.963202892611317640e+00
-7.355395864092554525e+00,3.132145017755679994e+00
-5.633276283316056343e+00,3.061895460931263191e+00
-6.217620320188929739e+00,3.068180116388148360e+00
-5.720667558051909296e+00,1.059185070501345027e+00
-4.630861384224513877e+00,3.273065325881548304e+00
-6.456686007670914051e+00,2.726332637368679368e+00
-5.654380755855568097e+00,2.918727242675943412e+00
-7.421479127447046409e+00,4.445145002951523594e+00
-6.077378460062730525e+00,3.714120898201059617e+00
-6.484434893449074089e+00,4.075463937972058304e+00
-5.799559417775403958e+00,3.426190684132815356e+00
-6.731677356302868453e+00,3.847801702777890576e+00
-5.517127284825647848e+00,3.911292360695498793e+00
-6.439661291749104954e+00,2.663281017077448798e+00
-4.387258311621240914e+00,2.257988924094917138e+00
-6.095164790474824734e+00,3.795823953821886754e+00
-5.931592522599601125e+00,3.408067575827305351e+00
-6.279614320484012246e+00,3.259039121493263025e+00
-6.914568796214721758e+00,4.160691475732731348e+00
-6.082714831589998816e+00,2.523875257202204736e+00
-5.533531842577660065e+00,2.677496148828012679e+00
-6.933980929981927055e+00,2.057297745941711220e+00
-5.514358793116906909e+00,2.888298593297613071e+00
-6.093591091767907031e+00,3.754420664183383938e+00
-6.788778066129720123e+00,2.488525572994622514e+00
-6.269415866426892414e+00,3.066046112521951805e+00
-6.029520015903405472e+00,2.799178965327064894e+00
-6.043138481466953316e+00,2.924886306596177654e+00
-6.503723071986255100e+00,2.430904908012145871e+00
-5.807838549593242305e+00,2.376359441903130421e+00
-6.810148681433597417e+00,2.781395424212014689e+00
-6.110366911314670801e+00,4.579706448108746386e+00
-6.493290193099363172e+00,3.660282507478646252e+00
-5.476968166056757958e+00,2.167738531357384701e+00
-5.458722915818180255e+00,2.171283551864677364e+00
-7.861420566597718818e+00,3.424423667051566422e+00
-7.229123408406403328e+00,3.315654123264140551e+00
-6.478807628416051401e+00,4.161685557332910790e+00
-5.252043420478793578e+00,2.682629937304028545e+00
-6.481486327720077156e+00,2.150145817834115736e+00
-6.308645842604813758e+00,2.803751153370843685e+00
-6.255285481074179366e+00,3.109692698690654566e+00
-5.595034951589784811e+00,3.244758119895221782e+00
-6.534900746734510157e+00,1.993545968338895191e+00
-5.044827706328270267e+00,2.517385570815043661e+00
-6.456605519954512928e+00,2.635167481389222299e+00
-7.290148685109653748e+00,2.665418197171659287e+00
-6.335759069805563470e+00,3.434250808840458635e+00
-5.511079995624864836e+00,3.002639622360388394e+00
-5.347706138119987074e+00,3.237975488660883361e+00
-6.010977478121787954e+00,3.112649717808756211e+00
-6.133457445506979688e+00,2.723605340176584733e+00
-6.187413475825776388e+00,2.210392067970995189e+00
-5.803690806278592795e+00,2.304813472349293679e+00
-5.410858115148454495e+00,2.825378993887335710e+00
-5.965353512844936645e+00,3.345685743396669576e+00
-5.549679874455950568e+00,1.900563613956583131e+00
-6.144832573314780610e+00,3.616125238456547653e+00
-7.188674073602578041e+00,3.271096332776544102e+00
-7.578894960581532558e+00,2.284245209455077585e+00
-5.972958613711868203e+00,1.840299428374632562e+00
-6.689857516378905800e+00,1.969715494775489351e+00
-4.846305547454708318e+00,3.114959428841133970e+00
-5.602896805503131183e+00,2.844127429639391913e+00
-6.247402224130039095e+00,1.868468067944277333e+00
-6.204286153923503910e+00,2.466955451731863924e+00
-5.399453252995364494e+00,3.798771306660301494e+00
-4.973394899098075861e+00,3.596786357622862251e+00
