0,-4.5547,1051.5,1040.44,0.7,-0.7,0,0
0.00371747,-4.31134,1051.18,1041.16,0.7,-0.7,0,0
0.00743494,-3.44935,1050.68,1042.28,0.7,-0.7,0,0
0.0111524,-2.61647,1050.09,1043.55,0.7,-0.7,0,0
0.0148699,-1.81386,1049.42,1045,0.7,-0.7,0,0
0.0185874,-1.04169,1048.65,1046.61,0.7,-0.7,0,0
0.0223048,-0.298882,1047.8,1048.38,0.7,-0.7,0,0
0.0260223,0.416942,1046.86,1050.32,0.7,-0.7,0,0
0.0297398,1.10935,1045.84,1052.39,0.7,-0.7,0,0
0.0334572,1.78278,1044.76,1054.59,0.7,-0.7,0,0
0.0371747,2.44172,1043.62,1056.89,0.7,-0.7,0,0
0.0408922,3.09097,1042.44,1059.28,0.7,-0.7,0,0
0.0446097,3.73429,1041.21,1061.74,0.7,-0.7,0,0
0.0483271,4.37418,1039.96,1064.26,0.7,-0.7,0,0
0.0520446,5.01158,1038.66,1066.85,0.7,-0.7,0,0
0.0557621,5.64593,1037.33,1069.52,0.7,-0.7,0,0
0.0594796,6.27544,1035.94,1072.29,0.7,-0.7,0,0
0.063197,6.89759,1034.49,1075.17,0.7,-0.7,0,0
0.0669145,7.50973,1032.97,1078.18,0.7,-0.7,0,0
0.070632,8.10977,1031.37,1081.34,0.7,-0.7,0,0
0.0743494,8.69674,1029.69,1084.66,0.7,-0.7,0,0
0.0780669,9.27133,1027.93,1088.13,0.7,-0.7,0,0
0.0817844,9.83601,1026.1,1091.73,0.7,-0.7,0,0
0.0855019,10.3949,1024.21,1095.44,0.7,-0.7,0,0
0.0892193,10.9536,1022.3,1099.22,0.7,-0.7,0,0
0.0929368,11.5181,1020.36,1103.04,0.7,-0.7,0,0
0.0966543,12.0943,1018.44,1106.85,0.7,-0.7,0,0
0.100372,12.6876,1016.54,1110.63,0.7,-0.7,0,0
0.104089,13.3016,1014.67,1114.37,0.7,-0.7,0,0
0.107807,13.9384,1012.84,1118.05,0.7,-0.7,0,0
0.111524,14.5984,1011.04,1121.7,0.7,-0.7,0,0
0.115242,15.2803,1009.27,1125.32,0.7,-0.7,0,0
0.118959,15.9822,1007.5,1128.96,0.7,-0.7,0,0
0.122677,16.7016,1005.73,1132.62,0.7,-0.7,0,0
0.126394,17.4359,1003.95,1136.35,0.7,-0.7,0,0
0.130112,18.1834,1002.13,1140.14,0.7,-0.7,0,0
0.133829,18.9433,1000.3,1144.01,0.7,-0.7,0,0
0.137546,19.7157,998.438,1147.94,0.7,-0.7,0,0
0.141264,20.5023,996.567,1151.92,0.7,-0.7,0,0
0.144981,21.3054,994.701,1155.9,0.7,-0.7,0,0
0.148699,22.1286,992.853,1159.85,0.7,-0.7,0,0
0.152416,22.975,991.041,1163.75,0.7,-0.7,0,0
0.156134,23.8477,989.276,1167.57,0.7,-0.7,0,0
0.159851,24.7498,987.565,1171.3,0.7,-0.7,0,0
0.163569,25.6834,985.908,1174.93,0.7,-0.7,0,0
0.167286,26.6502,984.301,1178.48,0.7,-0.7,0,0
0.171004,27.6512,982.733,1181.96,0.7,-0.7,0,0
0.174721,28.6866,981.192,1185.42,0.7,-0.7,0,0
0.178439,29.7563,979.666,1188.86,0.7,-0.7,0,0
0.182156,30.8596,978.143,1192.32,0.7,-0.7,0,0
0.185874,31.9956,976.616,1195.82,0.7,-0.7,0,0
0.189591,33.1632,975.085,1199.34,0.7,-0.7,0,0
0.193309,34.3609,973.552,1202.9,0.7,-0.7,0,0
0.197026,35.5876,972.028,1206.46,0.7,-0.7,0,0
0.200743,36.8433,970.526,1210,0.7,-0.7,0,0
0.204461,38.1271,969.058,1213.5,0.7,-0.7,0,0
0.208178,39.4395,967.639,1216.93,0.7,-0.7,0,0
0.211896,40.7823,966.279,1220.27,0.7,-0.7,0,0
0.215613,42.1581,964.985,1223.52,0.7,-0.7,0,0
0.219331,43.5706,963.758,1226.67,0.7,-0.7,0,0
0.223048,45.0241,962.595,1229.74,0.7,-0.7,0,0
0.226766,46.5234,961.489,1232.75,0.7,-0.7,0,0
0.230483,48.0725,960.433,1235.72,0.7,-0.7,0,0
0.234201,49.675,959.417,1238.67,0.7,-0.7,0,0
0.237918,51.3326,958.433,1241.62,0.7,-0.7,0,0
0.241636,53.0453,957.475,1244.59,0.7,-0.7,0,0
0.245353,54.8106,956.542,1247.58,0.7,-0.7,0,0
0.249071,56.6242,955.636,1250.57,0.7,-0.7,0,0
0.252788,58.48,954.762,1253.55,0.7,-0.7,0,0
0.256506,60.3729,953.929,1256.5,0.7,-0.7,0,0
0.260223,62.2962,953.145,1259.39,0.7,-0.7,0,0
0.263941,64.2461,952.418,1262.21,0.7,-0.7,0,0
0.267658,66.2212,951.757,1264.92,0.7,-0.7,0,0
0.271375,68.2235,951.167,1267.54,0.7,-0.7,0,0
0.275093,70.2577,950.651,1270.05,0.7,-0.7,0,0
0.27881,72.3312,950.21,1272.47,0.7,-0.7,0,0
0.282528,74.4528,949.842,1274.8,0.7,-0.7,0,0
0.286245,76.6313,949.543,1277.08,0.7,-0.7,0,0
0.289963,78.8735,949.309,1279.32,0.7,-0.7,0,0
0.29368,81.1837,949.135,1281.53,0.7,-0.7,0,0
0.297398,83.5616,949.014,1283.71,0.7,-0.7,0,0
0.301115,86.0023,948.942,1285.89,0.7,-0.7,0,0
0.304833,88.4965,948.914,1288.03,0.7,-0.7,0,0
0.30855,91.0314,948.926,1290.15,0.7,-0.7,0,0
0.312268,93.5937,948.975,1292.21,0.7,-0.7,0,0
0.315985,96.1693,949.059,1294.21,0.7,-0.7,0,0
0.319703,98.7473,949.176,1296.12,0.7,-0.7,0,0
0.32342,101.321,949.326,1297.94,0.7,-0.7,0,0
0.327138,103.89,949.508,1299.66,0.7,-0.7,0,0
0.330855,106.458,949.725,1301.28,0.7,-0.7,0,0
0.334572,109.034,949.976,1302.81,0.7,-0.7,0,0
0.33829,111.629,950.264,1304.24,0.7,-0.7,0,0
0.342007,114.256,950.59,1305.61,0.7,-0.7,0,0
0.345725,116.925,950.953,1306.91,0.7,-0.7,0,0
0.349442,119.643,951.353,1308.16,0.7,-0.7,0,0
0.35316,122.414,951.788,1309.36,0.7,-0.7,0,0
0.356877,125.232,952.254,1310.52,0.7,-0.7,0,0
0.360595,128.088,952.746,1311.64,0.7,-0.7,0,0
0.364312,130.97,953.259,1312.71,0.7,-0.7,0,0
0.36803,133.862,953.788,1313.72,0.7,-0.7,0,0
0.371747,136.751,954.327,1314.68,0.7,-0.7,0,0
0.375465,139.624,954.871,1315.57,0.7,-0.7,0,0
0.379182,142.477,955.419,1316.39,0.7,-0.7,0,0
0.3829,145.308,955.97,1317.14,0.7,-0.7,0,0
0.386617,148.124,956.525,1317.81,0.7,-0.7,0,0
0.390335,150.936,957.087,1318.4,0.7,-0.7,0,0
0.394052,153.757,957.66,1318.92,0.7,-0.7,0,0
0.39777,156.601,958.247,1319.37,0.7,-0.7,0,0
0.401487,159.48,958.852,1319.76,0.7,-0.7,0,0
0.405204,162.401,959.477,1320.1,0.7,-0.7,0,0
0.408922,165.363,960.121,1320.38,0.7,-0.7,0,0
0.412639,168.363,960.784,1320.61,0.7,-0.7,0,0
0.416357,171.388,961.46,1320.8,0.7,-0.7,0,0
0.420074,174.42,962.145,1320.94,0.7,-0.7,0,0
0.423792,177.441,962.835,1321.05,0.7,-0.7,0,0
0.427509,180.434,963.524,1321.1,0.7,-0.7,0,0
0.431227,183.385,964.209,1321.12,0.7,-0.7,0,0
0.434944,186.284,964.887,1321.09,0.7,-0.7,0,0
0.438662,189.13,965.56,1321.01,0.7,-0.7,0,0
0.442379,191.926,966.229,1320.89,0.7,-0.7,0,0
0.446097,194.682,966.9,1320.7,0.7,-0.7,0,0
0.449814,197.409,967.576,1320.47,0.7,-0.7,0,0
0.453532,200.121,968.263,1320.17,0.7,-0.7,0,0
0.457249,202.828,968.965,1319.82,0.7,-0.7,0,0
0.460967,205.537,969.684,1319.41,0.7,-0.7,0,0
0.464684,208.249,970.42,1318.94,0.7,-0.7,0,0
0.468401,210.959,971.172,1318.43,0.7,-0.7,0,0
0.472119,213.657,971.934,1317.87,0.7,-0.7,0,0
0.475836,216.327,972.703,1317.27,0.7,-0.7,0,0
0.479554,218.954,973.472,1316.63,0.7,-0.7,0,0
0.483271,221.52,974.236,1315.97,0.7,-0.7,0,0
0.486989,224.013,974.992,1315.28,0.7,-0.7,0,0
0.490706,226.423,975.738,1314.56,0.7,-0.7,0,0
0.494424,228.744,976.474,1313.8,0.7,-0.7,0,0
0.498141,230.979,977.205,1313.01,0.7,-0.7,0,0
0.501859,233.132,977.934,1312.17,0.7,-0.7,0,0
0.505576,235.21,978.667,1311.28,0.7,-0.7,0,0
0.509294,237.223,979.409,1310.32,0.7,-0.7,0,0
0.513011,239.179,980.165,1309.3,0.7,-0.7,0,0
0.516729,241.087,980.938,1308.21,0.7,-0.7,0,0
0.520446,242.95,981.727,1307.04,0.7,-0.7,0,0
0.524164,244.773,982.531,1305.81,0.7,-0.7,0,0
0.527881,246.553,983.344,1304.53,0.7,-0.7,0,0
0.531599,248.288,984.163,1303.19,0.7,-0.7,0,0
0.535316,249.976,984.981,1301.81,0.7,-0.7,0,0
0.539033,251.61,985.793,1300.39,0.7,-0.7,0,0
0.542751,253.189,986.597,1298.95,0.7,-0.7,0,0
0.546468,254.708,987.391,1297.46,0.7,-0.7,0,0
0.550186,256.166,988.178,1295.92,0.7,-0.7,0,0
0.553903,257.564,988.961,1294.33,0.7,-0.7,0,0
0.557621,258.903,989.745,1292.66,0.7,-0.7,0,0
0.561338,260.186,990.537,1290.9,0.7,-0.7,0,0
0.565056,261.416,991.344,1289.04,0.7,-0.7,0,0
0.568773,262.598,992.168,1287.07,0.7,-0.7,0,0
0.572491,263.736,993.013,1284.97,0.7,-0.7,0,0
0.576208,264.834,993.879,1282.77,0.7,-0.7,0,0
0.579926,265.898,994.763,1280.46,0.7,-0.7,0,0
0.583643,266.93,995.66,1278.07,0.7,-0.7,0,0
0.587361,267.933,996.565,1275.61,0.7,-0.7,0,0
0.591078,268.912,997.473,1273.1,0.7,-0.7,0,0
0.594796,269.868,998.378,1270.55,0.7,-0.7,0,0
0.598513,270.802,999.279,1267.97,0.7,-0.7,0,0
0.60223,271.715,1000.18,1265.35,0.7,-0.7,0,0
0.605948,272.606,1001.07,1262.68,0.7,-0.7,0,0
0.609665,273.474,1001.97,1259.94,0.7,-0.7,0,0
0.613383,274.318,1002.88,1257.11,0.7,-0.7,0,0
0.6171,275.137,1003.81,1254.17,0.7,-0.7,0,0
0.620818,275.93,1004.76,1251.08,0.7,-0.7,0,0
0.624535,276.697,1005.74,1247.86,0.7,-0.7,0,0
0.628253,277.438,1006.75,1244.48,0.7,-0.7,0,0
0.63197,278.157,1007.79,1240.97,0.7,-0.7,0,0
0.635688,278.855,1008.85,1237.34,0.7,-0.7,0,0
0.639405,279.537,1009.93,1233.63,0.7,-0.7,0,0
0.643123,280.206,1011.02,1229.87,0.7,-0.7,0,0
0.64684,280.867,1012.11,1226.1,0.7,-0.7,0,0
0.650558,281.521,1013.19,1222.34,0.7,-0.7,0,0
0.654275,282.17,1014.27,1218.6,0.7,-0.7,0,0
0.657993,282.813,1015.33,1214.9,0.7,-0.7,0,0
0.66171,283.451,1016.39,1211.22,0.7,-0.7,0,0
0.665428,284.078,1017.45,1207.54,0.7,-0.7,0,0
0.669145,284.693,1018.52,1203.83,0.7,-0.7,0,0
0.672862,285.29,1019.61,1200.06,0.7,-0.7,0,0
0.67658,285.868,1020.72,1196.21,0.7,-0.7,0,0
0.680297,286.425,1021.85,1192.27,0.7,-0.7,0,0
0.684015,286.959,1023.02,1188.22,0.7,-0.7,0,0
0.687732,287.472,1024.21,1184.09,0.7,-0.7,0,0
0.69145,287.966,1025.42,1179.89,0.7,-0.7,0,0
0.695167,288.446,1026.65,1175.67,0.7,-0.7,0,0
0.698885,288.914,1027.88,1171.46,0.7,-0.7,0,0
0.702602,289.375,1029.1,1167.31,0.7,-0.7,0,0
0.70632,289.83,1030.31,1163.24,0.7,-0.7,0,0
0.710037,290.281,1031.5,1159.29,0.7,-0.7,0,0
0.713755,290.726,1032.67,1155.44,0.7,-0.7,0,0
0.717472,291.161,1033.83,1151.71,0.7,-0.7,0,0
0.72119,291.582,1034.97,1148.06,0.7,-0.7,0,0
0.724907,291.983,1036.12,1144.48,0.7,-0.7,0,0
0.728625,292.358,1037.28,1140.93,0.7,-0.7,0,0
0.732342,292.705,1038.46,1137.38,0.7,-0.7,0,0
0.736059,293.021,1039.65,1133.83,0.7,-0.7,0,0
0.739777,293.305,1040.87,1130.26,0.7,-0.7,0,0
0.743494,293.562,1042.1,1126.67,0.7,-0.7,0,0
0.747212,293.796,1043.35,1123.1,0.7,-0.7,0,0
0.750929,294.014,1044.59,1119.57,0.7,-0.7,0,0
0.754647,294.223,1045.83,1116.1,0.7,-0.7,0,0
0.758364,294.429,1047.04,1112.73,0.7,-0.7,0,0
0.762082,294.638,1048.23,1109.48,0.7,-0.7,0,0
0.765799,294.851,1049.38,1106.38,0.7,-0.7,0,0
0.769517,295.068,1050.49,1103.42,0.7,-0.7,0,0
0.773234,295.284,1051.57,1100.59,0.7,-0.7,0,0
0.776952,295.494,1052.63,1097.9,0.7,-0.7,0,0
0.780669,295.69,1053.66,1095.3,0.7,-0.7,0,0
0.784387,295.867,1054.68,1092.79,0.7,-0.7,0,0
0.788104,296.019,1055.69,1090.34,0.7,-0.7,0,0
0.791822,296.142,1056.71,1087.93,0.7,-0.7,0,0
0.795539,296.238,1057.72,1085.56,0.7,-0.7,0,0
0.799257,296.308,1058.73,1083.22,0.7,-0.7,0,0
0.802974,296.361,1059.74,1080.93,0.7,-0.7,0,0
0.806691,296.402,1060.72,1078.69,0.7,-0.7,0,0
0.810409,296.44,1061.69,1076.53,0.7,-0.7,0,0
0.814126,296.483,1062.62,1074.46,0.7,-0.7,0,0
0.817844,296.536,1063.52,1072.5,0.7,-0.7,0,0
0.821561,296.599,1064.38,1070.64,0.7,-0.7,0,0
0.825279,296.672,1065.19,1068.89,0.7,-0.7,0,0
0.828996,296.75,1065.96,1067.26,0.7,-0.7,0,0
0.832714,296.826,1066.7,1065.71,0.7,-0.7,0,0
0.836431,296.891,1067.4,1064.25,0.7,-0.7,0,0
0.840149,296.938,1068.08,1062.86,0.7,-0.7,0,0
0.843866,296.96,1068.74,1061.53,0.7,-0.7,0,0
0.847584,296.955,1069.37,1060.24,0.7,-0.7,0,0
0.851301,296.922,1070,1058.98,0.7,-0.7,0,0
0.855019,296.865,1070.61,1057.77,0.7,-0.7,0,0
0.858736,296.791,1071.2,1056.59,0.7,-0.7,0,0
0.862454,296.708,1071.77,1055.45,0.7,-0.7,0,0
0.866171,296.623,1072.32,1054.37,0.7,-0.7,0,0
0.869888,296.545,1072.84,1053.34,0.7,-0.7,0,0
0.873606,296.478,1073.34,1052.37,0.7,-0.7,0,0
0.877323,296.422,1073.8,1051.46,0.7,-0.7,0,0
0.881041,296.376,1074.23,1050.61,0.7,-0.7,0,0
0.884758,296.332,1074.63,1049.83,0.7,-0.7,0,0
0.888476,296.282,1075,1049.09,0.7,-0.7,0,0
0.892193,296.218,1075.34,1048.41,0.7,-0.7,0,0
0.895911,296.131,1075.67,1047.75,0.7,-0.7,0,0
0.899628,296.016,1075.97,1047.13,0.7,-0.7,0,0
0.903346,295.87,1076.26,1046.53,0.7,-0.7,0,0
0.907063,295.695,1076.53,1045.96,0.7,-0.7,0,0
0.910781,295.497,1076.79,1045.4,0.7,-0.7,0,0
0.914498,295.286,1077.04,1044.87,0.7,-0.7,0,0
0.918216,295.072,1077.27,1044.36,0.7,-0.7,0,0
0.921933,294.867,1077.49,1043.88,0.7,-0.7,0,0
0.925651,294.681,1077.7,1043.42,0.7,-0.7,0,0
0.929368,294.52,1077.89,1043,0.7,-0.7,0,0
0.933086,294.386,1078.07,1042.61,0.7,-0.7,0,0
0.936803,294.278,1078.24,1042.26,0.7,-0.7,0,0
0.94052,294.189,1078.4,1041.93,0.7,-0.7,0,0
0.944238,294.113,1078.54,1041.63,0.7,-0.7,0,0
0.947955,294.039,1078.68,1041.35,0.7,-0.7,0,0
0.951673,293.96,1078.8,1041.09,0.7,-0.7,0,0
0.95539,293.87,1078.92,1040.85,0.7,-0.7,0,0
0.959108,293.765,1079.03,1040.62,0.7,-0.7,0,0
0.962825,293.648,1079.13,1040.4,0.7,-0.7,0,0
0.966543,293.524,1079.23,1040.2,0.7,-0.7,0,0
0.97026,293.401,1079.32,1040.01,0.7,-0.7,0,0
0.973978,293.29,1079.41,1039.83,0.7,-0.7,0,0
0.977695,293.199,1079.49,1039.67,0.7,-0.7,0,0
0.981413,293.139,1079.57,1039.52,0.7,-0.7,0,0
0.98513,293.114,1079.64,1039.4,0.7,-0.7,0,0
0.988848,293.126,1079.71,1039.29,0.7,-0.7,0,0
0.992565,293.174,1079.77,1039.2,0.7,-0.7,0,0
0.996283,293.253,1079.83,1039.13,0.7,-0.7,0,0
1,293.356,1079.89,1039.07,0.7,-0.7,0,0
