0,0.049774,-0.99125
0.01,0.066063,-0.98939
0.02,0.12145,-0.97959
0.03,0.16706,-0.9684
0.04,0.19964,-0.95627
0.05,0.23439,-0.94694
0.06,0.24851,-0.94461
0.07,0.26805,-0.94461
0.08,0.28869,-0.94461
0.09,0.32525,-0.94461
0.1,0.34661,-0.94461
0.11,0.39186,-0.94461
0.12,0.45267,-0.94461
0.13,0.46968,-0.92128
0.14,0.52,-0.92128
0.15,0.55837,-0.92128
0.16,0.58986,-0.92128
0.17,0.60181,-0.91289
0.18,0.64163,-0.90962
0.19,0.65792,-0.88583
0.2,0.70679,-0.86997
0.21,0.7448,-0.84711
0.22,0.77846,-0.83965
0.23,0.80127,-0.82379
0.24,0.84796,-0.81633
0.25,0.86425,-0.80466
0.26,0.9229,-0.78134
0.27,0.9457,-0.77761
0.28,0.95439,-0.75848
0.29,0.98118,-0.73889
0.3,1.0127,-0.70671
0.31,1.0268,-0.67732
0.32,1.0384,-0.65026
0.33,1.0568,-0.62647
0.34,1.0633,-0.60268
0.35,1.0742,-0.5691
0.36,1.0883,-0.52431
0.37,1.1071,-0.49166
0.38,1.1176,-0.46274
0.39,1.122,-0.41703
0.4,1.1394,-0.39883
0.41,1.1448,-0.37831
0.42,1.1578,-0.35638
0.43,1.1629,-0.33959
0.44,1.1629,-0.30181
0.45,1.1593,-0.25656
0.46,1.1448,-0.20152
0.47,1.1401,-0.18052
0.48,1.1234,-0.13528
0.49,1.11,-0.10682
0.5,1.0905,-0.046647
0.51,1.0814,-0.0097959
0.52,1.0728,0.011195
0.53,1.0456,0.051778
0.54,1.0304,0.084898
0.55,1.0127,0.10262
0.56,1.0004,0.13854
0.57,0.98081,0.16466
0.58,0.96525,0.18146
0.59,0.93774,0.20851
0.6,0.91674,0.22857
0.61,0.89575,0.25096
0.62,0.84145,0.29948
0.63,0.82733,0.32746
0.64,0.81249,0.34379
0.65,0.78824,0.36152
0.66,0.75747,0.38111
0.67,0.70498,0.4049
0.68,0.68434,0.40816
0.69,0.65538,0.42029
0.7,0.6362,0.43615
0.71,0.61919,0.45901
0.72,0.57357,0.4786
0.73,0.52905,0.49773
0.74,0.45955,0.53085
0.75,0.41176,0.5481
0.76,0.37593,0.56536
0.77,0.31873,0.59848
0.78,0.28977,0.60641
0.79,0.27348,0.60641
0.8,0.25973,0.60641
0.81,0.24054,0.60641
0.82,0.2286,0.60641
0.83,0.21267,0.60641
0.84,0.21267,0.60641
0.85,0.21267,0.60641
0.86,0.21267,0.60641
0.87,0.21267,0.60641
0.88,0.21267,0.60641
0.89,0.21267,0.60641
0.9,0.21267,0.60641
0.91,0.21267,0.60641
0.92,0.21267,0.60641
0.93,0.21267,0.60641
0.94,0.21267,0.60641
0.95,0.21267,0.60641
0.96,0.21267,0.60641
0.97,0.21267,0.60641
0.98,0.21267,0.60641
0.99,0.21267,0.60641
1,0.21267,0.60641
