{
  "planningSteps":
  [
    {
        "name": "bauhaus-screw-box-large-top",
        "placingPosition": [3605.0, 4490.0, 1078.0]
        
    },
    {
        "name": "sponge",
        "placingPosition": [4035.0, 4490.0, 1075.0]
        
    },
    {
        "name": "cable-ties",
        "placingPosition": [4035.0, 4490.0, 1075.0]
        
    }
  ]
}
