{
  "@context": [
    "https://www.w3.org/2018/credentials/v1",
	"https://mm.aueb.gr/contexts/capabilities/v1"
  ],
  
  "id": "https://iot-ngin.eu/",
  "type": ["VerifiableCredential"],

  "credentialSubject": {
  	"capabilities": {
	  "https://devices.iot-ngin.eu/sensor1": ["READ"],
	  "https://devices.iot-ngin.eu/sensor2": ["READ"],
	  "https://devices.iot-ngin.eu/lamp1": ["READ", "WRITE"]
  	}
  }
}
