[
  {
    "inputs": [
      {
        "internalType": "bytes",
        "name": "es",
        "type": "bytes"
      },
      {
        "internalType": "bytes",
        "name": "ed",
        "type": "bytes"
      },
      {
        "internalType": "address[]",
        "name": "allowed",
        "type": "address[]"
      },
      {
        "internalType": "uint256",
        "name": "required",
        "type": "uint256"
      },
      {
        "internalType": "uint256",
        "name": "ts",
        "type": "uint256"
      },
      {
        "internalType": "uint256",
        "name": "td",
        "type": "uint256"
      },
      {
        "internalType": "uint256",
        "name": "srs",
        "type": "uint256"
      },
      {
        "internalType": "uint256",
        "name": "srd",
        "type": "uint256"
      }
    ],
    "stateMutability": "nonpayable",
    "type": "constructor"
  },
  {
    "inputs": [
      {
        "internalType": "uint256",
        "name": "transferId",
        "type": "uint256"
      },
      {
        "internalType": "address",
        "name": "bridge",
        "type": "address"
      }
    ],
    "name": "InactiveBridgeToUpdate",
    "type": "error"
  },
  {
    "inputs": [
      {
        "internalType": "uint256",
        "name": "transferId",
        "type": "uint256"
      },
      {
        "internalType": "address",
        "name": "bridge",
        "type": "address"
      },
      {
        "internalType": "enum Connection.TransferState",
        "name": "state",
        "type": "uint8"
      }
    ],
    "name": "InvalidDecline",
    "type": "error"
  },
  {
    "inputs": [
      {
        "internalType": "uint256",
        "name": "transferId",
        "type": "uint256"
      },
      {
        "internalType": "address",
        "name": "bridge",
        "type": "address"
      },
      {
        "internalType": "enum Connection.TransferState",
        "name": "state",
        "type": "uint8"
      }
    ],
    "name": "InvalidEndorsement",
    "type": "error"
  },
  {
    "inputs": [
      {
        "internalType": "uint256",
        "name": "tranferId",
        "type": "uint256"
      },
      {
        "internalType": "address",
        "name": "bridge",
        "type": "address"
      },
      {
        "internalType": "enum Connection.TransferState",
        "name": "state",
        "type": "uint8"
      }
    ],
    "name": "InvalidSignal",
    "type": "error"
  },
  {
    "inputs": [
      {
        "internalType": "uint256",
        "name": "transferId",
        "type": "uint256"
      },
      {
        "internalType": "address",
        "name": "bridge",
        "type": "address"
      }
    ],
    "name": "NotAllowedBridge",
    "type": "error"
  },
  {
    "inputs": [
      {
        "internalType": "uint256",
        "name": "transferId",
        "type": "uint256"
      },
      {
        "internalType": "address",
        "name": "bridge",
        "type": "address"
      }
    ],
    "name": "NotApplicableTransfer",
    "type": "error"
  },
  {
    "anonymous": false,
    "inputs": [
      {
        "indexed": true,
        "internalType": "bytes",
        "name": "endpointSource",
        "type": "bytes"
      },
      {
        "indexed": true,
        "internalType": "bytes",
        "name": "endpointDestination",
        "type": "bytes"
      }
    ],
    "name": "BridgeToSetup",
    "type": "event"
  },
  {
    "anonymous": false,
    "inputs": [
      {
        "indexed": true,
        "internalType": "uint256",
        "name": "id",
        "type": "uint256"
      },
      {
        "indexed": true,
        "internalType": "bytes",
        "name": "data",
        "type": "bytes"
      }
    ],
    "name": "EntryCreated",
    "type": "event"
  },
  {
    "anonymous": false,
    "inputs": [
      {
        "indexed": true,
        "internalType": "uint256",
        "name": "id",
        "type": "uint256"
      },
      {
        "indexed": true,
        "internalType": "enum Connection.TransferState",
        "name": "state",
        "type": "uint8"
      }
    ],
    "name": "EntryUpdated",
    "type": "event"
  },
  {
    "anonymous": false,
    "inputs": [
      {
        "indexed": true,
        "internalType": "bytes32",
        "name": "role",
        "type": "bytes32"
      },
      {
        "indexed": true,
        "internalType": "bytes32",
        "name": "previousAdminRole",
        "type": "bytes32"
      },
      {
        "indexed": true,
        "internalType": "bytes32",
        "name": "newAdminRole",
        "type": "bytes32"
      }
    ],
    "name": "RoleAdminChanged",
    "type": "event"
  },
  {
    "anonymous": false,
    "inputs": [
      {
        "indexed": true,
        "internalType": "bytes32",
        "name": "role",
        "type": "bytes32"
      },
      {
        "indexed": true,
        "internalType": "address",
        "name": "account",
        "type": "address"
      },
      {
        "indexed": true,
        "internalType": "address",
        "name": "sender",
        "type": "address"
      }
    ],
    "name": "RoleGranted",
    "type": "event"
  },
  {
    "anonymous": false,
    "inputs": [
      {
        "indexed": true,
        "internalType": "bytes32",
        "name": "role",
        "type": "bytes32"
      },
      {
        "indexed": true,
        "internalType": "address",
        "name": "account",
        "type": "address"
      },
      {
        "indexed": true,
        "internalType": "address",
        "name": "sender",
        "type": "address"
      }
    ],
    "name": "RoleRevoked",
    "type": "event"
  },
  {
    "inputs": [],
    "name": "ALLOWED_BRIDGE",
    "outputs": [
      {
        "internalType": "bytes32",
        "name": "",
        "type": "bytes32"
      }
    ],
    "stateMutability": "view",
    "type": "function"
  },
  {
    "inputs": [],
    "name": "DEFAULT_ADMIN_ROLE",
    "outputs": [
      {
        "internalType": "bytes32",
        "name": "",
        "type": "bytes32"
      }
    ],
    "stateMutability": "view",
    "type": "function"
  },
  {
    "inputs": [],
    "name": "OWNER",
    "outputs": [
      {
        "internalType": "bytes32",
        "name": "",
        "type": "bytes32"
      }
    ],
    "stateMutability": "view",
    "type": "function"
  },
  {
    "inputs": [
      {
        "internalType": "uint256",
        "name": "",
        "type": "uint256"
      }
    ],
    "name": "allowedBridges",
    "outputs": [
      {
        "internalType": "address",
        "name": "",
        "type": "address"
      }
    ],
    "stateMutability": "view",
    "type": "function"
  },
  {
    "inputs": [],
    "name": "endpointDestination",
    "outputs": [
      {
        "internalType": "bytes",
        "name": "",
        "type": "bytes"
      }
    ],
    "stateMutability": "view",
    "type": "function"
  },
  {
    "inputs": [],
    "name": "endpointSource",
    "outputs": [
      {
        "internalType": "bytes",
        "name": "",
        "type": "bytes"
      }
    ],
    "stateMutability": "view",
    "type": "function"
  },
  {
    "inputs": [
      {
        "internalType": "bytes32",
        "name": "role",
        "type": "bytes32"
      }
    ],
    "name": "getRoleAdmin",
    "outputs": [
      {
        "internalType": "bytes32",
        "name": "",
        "type": "bytes32"
      }
    ],
    "stateMutability": "view",
    "type": "function"
  },
  {
    "inputs": [
      {
        "internalType": "bytes32",
        "name": "role",
        "type": "bytes32"
      },
      {
        "internalType": "address",
        "name": "account",
        "type": "address"
      }
    ],
    "name": "grantRole",
    "outputs": [],
    "stateMutability": "nonpayable",
    "type": "function"
  },
  {
    "inputs": [
      {
        "internalType": "bytes32",
        "name": "role",
        "type": "bytes32"
      },
      {
        "internalType": "address",
        "name": "account",
        "type": "address"
      }
    ],
    "name": "hasRole",
    "outputs": [
      {
        "internalType": "bool",
        "name": "",
        "type": "bool"
      }
    ],
    "stateMutability": "view",
    "type": "function"
  },
  {
    "inputs": [
      {
        "internalType": "bytes32",
        "name": "role",
        "type": "bytes32"
      },
      {
        "internalType": "address",
        "name": "account",
        "type": "address"
      }
    ],
    "name": "renounceRole",
    "outputs": [],
    "stateMutability": "nonpayable",
    "type": "function"
  },
  {
    "inputs": [],
    "name": "requiredInstances",
    "outputs": [
      {
        "internalType": "uint256",
        "name": "",
        "type": "uint256"
      }
    ],
    "stateMutability": "view",
    "type": "function"
  },
  {
    "inputs": [
      {
        "internalType": "bytes32",
        "name": "role",
        "type": "bytes32"
      },
      {
        "internalType": "address",
        "name": "account",
        "type": "address"
      }
    ],
    "name": "revokeRole",
    "outputs": [],
    "stateMutability": "nonpayable",
    "type": "function"
  },
  {
    "inputs": [],
    "name": "searchRangeDestination",
    "outputs": [
      {
        "internalType": "uint256",
        "name": "",
        "type": "uint256"
      }
    ],
    "stateMutability": "view",
    "type": "function"
  },
  {
    "inputs": [],
    "name": "searchRangeSource",
    "outputs": [
      {
        "internalType": "uint256",
        "name": "",
        "type": "uint256"
      }
    ],
    "stateMutability": "view",
    "type": "function"
  },
  {
    "inputs": [
      {
        "internalType": "bytes4",
        "name": "interfaceId",
        "type": "bytes4"
      }
    ],
    "name": "supportsInterface",
    "outputs": [
      {
        "internalType": "bool",
        "name": "",
        "type": "bool"
      }
    ],
    "stateMutability": "view",
    "type": "function"
  },
  {
    "inputs": [],
    "name": "timeoutDestination",
    "outputs": [
      {
        "internalType": "uint256",
        "name": "",
        "type": "uint256"
      }
    ],
    "stateMutability": "view",
    "type": "function"
  },
  {
    "inputs": [],
    "name": "timeoutSource",
    "outputs": [
      {
        "internalType": "uint256",
        "name": "",
        "type": "uint256"
      }
    ],
    "stateMutability": "view",
    "type": "function"
  },
  {
    "inputs": [
      {
        "internalType": "uint256",
        "name": "",
        "type": "uint256"
      }
    ],
    "name": "transfers",
    "outputs": [
      {
        "internalType": "uint256",
        "name": "id",
        "type": "uint256"
      },
      {
        "internalType": "bytes",
        "name": "data",
        "type": "bytes"
      },
      {
        "internalType": "enum Connection.TransferState",
        "name": "state",
        "type": "uint8"
      },
      {
        "internalType": "address",
        "name": "activeBridge",
        "type": "address"
      },
      {
        "internalType": "uint256",
        "name": "endorsed",
        "type": "uint256"
      },
      {
        "internalType": "uint256",
        "name": "nonce",
        "type": "uint256"
      },
      {
        "components": [
          {
            "internalType": "uint256",
            "name": "blockNumber",
            "type": "uint256"
          },
          {
            "internalType": "bytes32",
            "name": "transactionHash",
            "type": "bytes32"
          },
          {
            "internalType": "uint256",
            "name": "additionalData",
            "type": "uint256"
          }
        ],
        "internalType": "struct Connection.Transaction",
        "name": "initialTx",
        "type": "tuple"
      },
      {
        "components": [
          {
            "internalType": "uint256",
            "name": "blockNumber",
            "type": "uint256"
          },
          {
            "internalType": "bytes32",
            "name": "transactionHash",
            "type": "bytes32"
          },
          {
            "internalType": "uint256",
            "name": "additionalData",
            "type": "uint256"
          }
        ],
        "internalType": "struct Connection.Transaction",
        "name": "responderTx",
        "type": "tuple"
      },
      {
        "components": [
          {
            "internalType": "uint256",
            "name": "blockNumber",
            "type": "uint256"
          },
          {
            "internalType": "bytes32",
            "name": "transactionHash",
            "type": "bytes32"
          },
          {
            "internalType": "uint256",
            "name": "additionalData",
            "type": "uint256"
          }
        ],
        "internalType": "struct Connection.Transaction",
        "name": "finalTx",
        "type": "tuple"
      },
      {
        "internalType": "uint256",
        "name": "rejected",
        "type": "uint256"
      }
    ],
    "stateMutability": "view",
    "type": "function"
  },
  {
    "inputs": [],
    "name": "getEndpointSource",
    "outputs": [
      {
        "internalType": "string",
        "name": "",
        "type": "string"
      }
    ],
    "stateMutability": "view",
    "type": "function"
  },
  {
    "inputs": [],
    "name": "getEndpointDestination",
    "outputs": [
      {
        "internalType": "string",
        "name": "",
        "type": "string"
      }
    ],
    "stateMutability": "view",
    "type": "function"
  },
  {
    "inputs": [
      {
        "internalType": "uint256",
        "name": "id",
        "type": "uint256"
      },
      {
        "internalType": "bytes",
        "name": "data",
        "type": "bytes"
      },
      {
        "internalType": "uint256",
        "name": "blockNumber",
        "type": "uint256"
      },
      {
        "internalType": "bytes32",
        "name": "transactionHash",
        "type": "bytes32"
      },
      {
        "internalType": "uint256",
        "name": "logIndex",
        "type": "uint256"
      }
    ],
    "name": "createEntry",
    "outputs": [
      {
        "internalType": "bool",
        "name": "",
        "type": "bool"
      }
    ],
    "stateMutability": "nonpayable",
    "type": "function"
  },
  {
    "inputs": [
      {
        "internalType": "uint256",
        "name": "id",
        "type": "uint256"
      },
      {
        "internalType": "enum Connection.TransferState",
        "name": "state",
        "type": "uint8"
      },
      {
        "internalType": "uint256",
        "name": "nonce",
        "type": "uint256"
      },
      {
        "internalType": "uint256",
        "name": "blockNumber",
        "type": "uint256"
      },
      {
        "internalType": "bytes32",
        "name": "transactionHash",
        "type": "bytes32"
      },
      {
        "internalType": "uint256",
        "name": "additionalData",
        "type": "uint256"
      }
    ],
    "name": "updateEntry",
    "outputs": [
      {
        "internalType": "bool",
        "name": "",
        "type": "bool"
      }
    ],
    "stateMutability": "nonpayable",
    "type": "function"
  },
  {
    "inputs": [
      {
        "internalType": "uint256",
        "name": "id",
        "type": "uint256"
      },
      {
        "internalType": "enum Connection.TransferState",
        "name": "state",
        "type": "uint8"
      }
    ],
    "name": "endorseAction",
    "outputs": [
      {
        "internalType": "bool",
        "name": "",
        "type": "bool"
      }
    ],
    "stateMutability": "nonpayable",
    "type": "function"
  },
  {
    "inputs": [
      {
        "internalType": "uint256",
        "name": "id",
        "type": "uint256"
      },
      {
        "internalType": "enum Connection.TransferState",
        "name": "state",
        "type": "uint8"
      }
    ],
    "name": "declineAction",
    "outputs": [
      {
        "internalType": "bool",
        "name": "",
        "type": "bool"
      }
    ],
    "stateMutability": "nonpayable",
    "type": "function"
  },
  {
    "inputs": [
      {
        "internalType": "uint256",
        "name": "id",
        "type": "uint256"
      }
    ],
    "name": "willingToSendTransfer",
    "outputs": [
      {
        "internalType": "bool",
        "name": "",
        "type": "bool"
      }
    ],
    "stateMutability": "nonpayable",
    "type": "function"
  },
  {
    "inputs": [
      {
        "internalType": "uint256",
        "name": "id",
        "type": "uint256"
      }
    ],
    "name": "willingToFinalizeTransfer",
    "outputs": [
      {
        "internalType": "bool",
        "name": "",
        "type": "bool"
      }
    ],
    "stateMutability": "nonpayable",
    "type": "function"
  }
]