<svg width="49" height="193" viewBox="0 0 49 193" fill="none" xmlns="http://www.w3.org/2000/svg">
<g>
<path d="M32.3442 59.111C32.3445 57.8428 32.8241 56.6223 33.6857 55.6971C34.5473 54.772 35.7264 54.2117 36.9835 54.1299C38.2406 54.0481 39.4815 54.451 40.4542 55.2568C41.427 56.0625 42.0587 57.2107 42.2211 58.4683L46.9083 91.356C47.0157 92.145 46.8073 92.9447 46.329 93.5791C45.8507 94.2135 45.1416 94.6306 44.3578 94.7388C43.574 94.8469 42.7796 94.6371 42.1495 94.1556C41.5193 93.674 41.1049 92.9602 40.9976 92.1712L32.622 60.7533C32.4385 60.2254 32.3446 59.6702 32.3442 59.111Z" fill="#94C7C5"/>
<path d="M43.5921 88.6604C43.9827 88.6149 44.3784 88.6475 44.7564 88.7564C45.1344 88.8653 45.4874 89.0483 45.7949 89.2949C46.1025 89.5415 46.3587 89.8468 46.5487 90.1934C46.7387 90.5399 46.8588 90.9209 46.9021 91.3143L48.1788 115.955H43.663L40.9914 92.1533C40.9914 92.0938 40.9914 92.0402 40.9559 91.9867C40.8695 91.1941 41.0982 90.3993 41.5922 89.776C42.0862 89.1527 42.8052 88.7516 43.5921 88.6604Z" fill="#94C7C5"/>
<path d="M45.8619 119.364H45.8678C46.7622 119.364 47.4873 118.634 47.4873 117.734V113.789C47.4873 112.888 46.7622 112.158 45.8678 112.158H45.8619C44.9674 112.158 44.2423 112.888 44.2423 113.789V117.734C44.2423 118.634 44.9674 119.364 45.8619 119.364Z" fill="#F6C3A3"/>
<path d="M48.1845 115.967V110.79H42.853L43.6628 115.967H48.1845Z" fill="#A5C9C2"/>
<path d="M44.2718 112.343C44.5101 112.343 44.7033 112.148 44.7033 111.909C44.7033 111.669 44.5101 111.474 44.2718 111.474C44.0335 111.474 43.8403 111.669 43.8403 111.909C43.8403 112.148 44.0335 112.343 44.2718 112.343Z" fill="#8BBAB8"/>
<path d="M43.9526 114.277C43.9526 114.391 43.9973 114.5 44.0769 114.582C44.1566 114.663 44.2648 114.71 44.3782 114.711C44.4349 114.711 44.491 114.7 44.5433 114.678C44.5957 114.656 44.6433 114.624 44.6833 114.584C44.7234 114.544 44.7552 114.496 44.7769 114.443C44.7985 114.39 44.8097 114.334 44.8097 114.277C44.8081 114.163 44.762 114.054 44.6812 113.973C44.6005 113.893 44.4916 113.848 44.3782 113.848C44.2653 113.848 44.1571 113.893 44.0773 113.974C43.9975 114.054 43.9526 114.163 43.9526 114.277Z" fill="#8BBAB8"/>
<path d="M16.6571 59.111C16.6569 57.8428 16.1773 56.6223 15.3156 55.6971C14.454 54.772 13.2749 54.2117 12.0178 54.1299C10.7608 54.0481 9.51986 54.451 8.54711 55.2568C7.57435 56.0625 6.94265 57.2107 6.78027 58.4683L2.09305 91.356C2.01587 92.1303 2.24005 92.9045 2.71843 93.5157C3.19681 94.127 3.89208 94.5275 4.65791 94.6332C5.42373 94.7388 6.2004 94.5412 6.82445 94.082C7.44851 93.6228 7.87128 92.9378 8.00379 92.1712L16.3734 60.7533C16.5589 60.2258 16.6549 59.6706 16.6571 59.111Z" fill="#94C7C5"/>
<path d="M5.40314 88.6604C5.01268 88.6157 4.61729 88.6489 4.23957 88.7581C3.86186 88.8673 3.50922 89.0503 3.20182 89.2968C2.89442 89.5433 2.63828 89.8483 2.44805 90.1945C2.25781 90.5406 2.13721 90.9212 2.09312 91.3143L0.816406 115.955H5.32039L7.99204 92.1533C7.99204 92.0938 7.99204 92.0402 8.0275 91.9867C8.1141 91.1959 7.88692 90.4027 7.39541 89.7797C6.9039 89.1568 6.18785 88.7545 5.40314 88.6604Z" fill="#94C7C5"/>
<path d="M3.13912 112.152H3.13321C2.23877 112.152 1.51367 112.882 1.51367 113.783V117.728C1.51367 118.628 2.23877 119.358 3.13321 119.358H3.13912C4.03357 119.358 4.75866 118.628 4.75866 117.728V113.783C4.75866 112.882 4.03357 112.152 3.13912 112.152Z" fill="#F6C3A3"/>
<path d="M0.816406 115.967V110.79H6.14789L5.33812 115.967H0.816406Z" fill="#A5C9C2"/>
<path d="M4.72934 112.343C4.96764 112.343 5.16082 112.148 5.16082 111.909C5.16082 111.669 4.96764 111.474 4.72934 111.474C4.49103 111.474 4.29785 111.669 4.29785 111.909C4.29785 112.148 4.49103 112.343 4.72934 112.343Z" fill="#8BBAB8"/>
<path d="M5.04848 114.277C5.04964 114.363 5.02518 114.448 4.97822 114.52C4.93127 114.593 4.86394 114.649 4.78486 114.683C4.70578 114.716 4.61854 114.726 4.53429 114.709C4.45005 114.692 4.37262 114.651 4.31193 114.59C4.25123 114.529 4.21001 114.451 4.19355 114.366C4.17709 114.281 4.18614 114.193 4.21952 114.114C4.25291 114.034 4.30913 113.966 4.38099 113.919C4.45284 113.872 4.53707 113.847 4.6229 113.848C4.73577 113.848 4.84402 113.893 4.92383 113.974C5.00364 114.054 5.04848 114.163 5.04848 114.277Z" fill="#8BBAB8"/>
<path d="M15.2026 181.337C14.9136 182.504 15.0154 183.734 15.4922 184.836C16.3079 186.413 16.1306 189.971 16.1306 189.971C16.1306 189.971 13.7663 189.912 12.3654 190.9C10.9646 191.887 8.65941 193 4.77606 193C0.892703 193 4.77606 188.686 8.36979 186.937C10.0484 185.747 10.1075 180.927 10.1075 180.927L15.2026 181.337Z" fill="#434040"/>
<path d="M15.4925 184.836C15.0157 183.734 14.9138 182.504 15.2028 181.337L13.9438 181.236C13.966 181.856 14.117 182.464 14.3871 183.021C14.4426 183.123 14.49 183.228 14.529 183.337C14.8907 184.365 14.837 185.496 14.3794 186.485C13.9218 187.474 13.0969 188.243 12.082 188.627C11.7913 188.737 11.5153 188.883 11.2604 189.061C10.4916 189.623 9.65049 190.078 8.76013 190.412C8.60433 189.976 8.3036 189.608 7.90899 189.37C7.09921 190.727 5.54469 191.209 3.67099 191.209H3.42865C2.87895 192.244 3.11538 193.036 4.7763 193.036C8.65965 193.036 10.9767 191.929 12.3657 190.935C13.7547 189.942 16.1308 190.007 16.1308 190.007C16.1308 190.007 16.3081 186.413 15.4925 184.836Z" fill="#3B3838"/>
<path d="M3.31641 191.411L3.38734 191.548C3.45918 191.674 3.56067 191.78 3.68287 191.858C3.86547 191.969 4.06521 192.05 4.27395 192.096C4.55574 192.157 4.84275 192.191 5.131 192.197C5.47423 192.211 5.81802 192.199 6.15947 192.161C6.52594 192.131 6.90422 192.066 7.30024 191.994C8.12303 191.857 8.92024 191.594 9.66454 191.215C10.4211 190.81 11.1659 190.37 11.8988 190.025C12.5649 189.681 13.2666 189.411 13.9912 189.222C14.2807 189.15 14.5751 189.101 14.8719 189.073C15.1002 189.059 15.3292 189.059 15.5575 189.073C15.7043 189.078 15.8505 189.094 15.9949 189.12H16.1486H15.9949C15.8945 189.12 15.7467 189.12 15.5575 189.12C15.3317 189.13 15.1066 189.154 14.8837 189.192C14.6296 189.239 14.3458 189.311 14.0385 189.4C13.7095 189.499 13.3875 189.62 13.075 189.763C12.7381 189.912 12.3894 190.084 12.0347 190.269C11.3255 190.638 10.5866 191.09 9.82413 191.507C9.05087 191.891 8.2236 192.154 7.37117 192.286C6.98007 192.351 6.5852 192.391 6.18902 192.405C5.83687 192.432 5.48316 192.432 5.131 192.405C4.59566 192.389 4.07557 192.222 3.62968 191.923C3.50731 191.835 3.41288 191.713 3.35778 191.572L3.31641 191.411Z" fill="#242222"/>
<path d="M5.76367 188.626C6.02663 188.593 6.29275 188.593 6.55571 188.626C6.82828 188.67 7.09566 188.742 7.35366 188.841C7.65147 188.96 7.93028 189.122 8.18116 189.323C8.30586 189.433 8.42058 189.555 8.52398 189.686C8.62837 189.807 8.71405 189.943 8.77815 190.09C8.84891 190.224 8.90254 190.366 8.93774 190.513C8.97509 190.639 8.99887 190.768 9.00866 190.9C9.01997 191.01 9.01997 191.122 9.00866 191.233V191.483C9.0033 191.555 8.99343 191.626 8.97911 191.697L8.94365 191.483L8.90818 191.239C8.88881 191.136 8.86314 191.035 8.83134 190.935C8.81009 190.816 8.77229 190.699 8.71904 190.59C8.66861 190.466 8.60729 190.346 8.53581 190.233L8.4235 190.055L8.28756 189.894C8.1921 189.782 8.0873 189.678 7.97429 189.584C7.54136 189.242 7.05089 188.98 6.52616 188.811C6.30155 188.745 6.11832 188.68 5.98828 188.65L5.76367 188.626Z" fill="#242222"/>
<path d="M13.5066 181.2C13.5066 181.2 13.5066 181.7 13.5775 182.444C13.5775 182.813 13.6248 183.247 13.6544 183.706C13.683 184.181 13.7442 184.654 13.8376 185.122C13.8849 185.342 13.9854 185.574 14.0386 185.836C14.0914 186.073 14.1308 186.314 14.1568 186.556C14.21 187.026 14.2159 187.466 14.2277 187.841C14.2367 188.256 14.2249 188.671 14.1922 189.085C14.1922 189.085 14.1331 188.591 14.0386 187.853C14.0031 187.484 13.9381 187.056 13.8612 186.597C13.8273 186.367 13.7819 186.139 13.7253 185.913C13.678 185.693 13.5775 185.467 13.5125 185.199C13.3586 184.289 13.3169 183.364 13.3884 182.444C13.4298 181.694 13.5066 181.2 13.5066 181.2Z" fill="#242222"/>
<path d="M16.2903 181.867H8.36996L8.16309 177.481H16.5918L16.2903 181.867Z" fill="#401A4C"/>
<path d="M33.9106 181.337C34.1996 182.504 34.0978 183.734 33.621 184.836C32.8053 186.413 32.9826 189.971 32.9826 189.971C32.9826 189.971 35.3469 189.912 36.7477 190.9C38.1486 191.887 40.4538 193 44.3371 193C48.2205 193 44.3371 188.686 40.7434 186.937C39.0647 185.747 39.0056 180.927 39.0056 180.927L33.9106 181.337Z" fill="#434040"/>
<path d="M33.621 184.836C34.0978 183.734 34.1996 182.504 33.9106 181.337L35.1696 181.236C35.1474 181.856 34.9964 182.464 34.7263 183.021C34.6708 183.123 34.6234 183.228 34.5844 183.337C34.2227 184.365 34.2764 185.496 34.734 186.485C35.1916 187.474 36.0165 188.243 37.0314 188.627C37.3221 188.737 37.5981 188.883 37.853 189.061C38.6218 189.623 39.4629 190.078 40.3533 190.412C40.5091 189.976 40.8098 189.608 41.2044 189.37C42.0142 190.727 43.5687 191.209 45.4424 191.209H45.6848C46.2345 192.244 45.998 193.036 44.3371 193.036C40.4538 193.036 38.1368 191.929 36.7477 190.935C35.3587 189.942 32.9826 190.007 32.9826 190.007C32.9826 190.007 32.8053 186.413 33.621 184.836Z" fill="#3B3838"/>
<path d="M45.7967 191.411L45.7435 191.554C45.6884 191.695 45.5939 191.817 45.4716 191.905C45.0262 192.205 44.5058 192.372 43.9702 192.387C43.6181 192.414 43.2644 192.414 42.9122 192.387C42.516 192.373 42.1212 192.333 41.7301 192.268C40.8776 192.136 40.0504 191.873 39.2771 191.489C38.5146 191.072 37.7817 190.62 37.0665 190.251C36.7119 190.066 36.3631 189.894 36.0262 189.745C35.7137 189.602 35.3918 189.481 35.0628 189.382C34.7554 189.293 34.4717 189.222 34.2175 189.174C33.9946 189.136 33.7696 189.112 33.5437 189.103C33.3546 189.103 33.2127 189.103 33.1063 189.103H32.9526H33.1063C33.2507 189.076 33.3969 189.06 33.5437 189.055C33.772 189.041 34.001 189.041 34.2294 189.055C34.5261 189.083 34.8205 189.132 35.1101 189.204C35.8468 189.391 36.5605 189.66 37.2379 190.007C37.9708 190.37 38.7156 190.81 39.4722 191.197C40.2165 191.576 41.0137 191.839 41.8365 191.977C42.2325 192.048 42.6108 192.113 42.9772 192.143C43.3187 192.181 43.6625 192.193 44.0057 192.179C44.2959 192.173 44.5848 192.139 44.8687 192.078C45.0768 192.03 45.2762 191.949 45.4597 191.84C45.5791 191.761 45.6783 191.655 45.7494 191.53L45.7967 191.411Z" fill="#242222"/>
<path d="M43.3497 188.626L43.1428 188.68C43.0069 188.71 42.8236 188.775 42.599 188.841C42.0743 189.009 41.5838 189.271 41.1509 189.614C41.0379 189.708 40.9331 189.812 40.8376 189.924L40.7017 190.084L40.5894 190.263C40.5179 190.376 40.4566 190.496 40.4062 190.62C40.3529 190.729 40.3151 190.845 40.2938 190.965C40.262 191.064 40.2364 191.166 40.217 191.268C40.217 191.364 40.1875 191.447 40.1815 191.512L40.1461 191.727C40.1416 191.655 40.1416 191.584 40.1461 191.512C40.1461 191.441 40.1461 191.358 40.1461 191.262C40.1316 191.152 40.1316 191.04 40.1461 190.929C40.1559 190.798 40.1797 190.668 40.217 190.542C40.2522 190.395 40.3058 190.253 40.3766 190.12C40.4407 189.973 40.5264 189.837 40.6308 189.715C40.7342 189.584 40.8489 189.463 40.9736 189.352C41.2257 189.15 41.5067 188.988 41.807 188.87C42.0483 188.764 42.2999 188.682 42.5577 188.626C42.8206 188.593 43.0867 188.593 43.3497 188.626Z" fill="#242222"/>
<path d="M35.6069 181.2C35.6069 181.2 35.6837 181.694 35.7251 182.444C35.7965 183.364 35.7549 184.289 35.6009 185.199C35.5359 185.467 35.4354 185.693 35.3882 185.913C35.3409 186.133 35.2877 186.371 35.2522 186.597C35.1754 187.056 35.1103 187.484 35.0749 187.853C34.9803 188.591 34.9212 189.085 34.9212 189.085C34.8886 188.671 34.8767 188.256 34.8857 187.841C34.8857 187.466 34.8857 187.026 34.9567 186.556C34.9826 186.314 35.0221 186.073 35.0749 185.836C35.1281 185.574 35.2286 185.342 35.2758 185.122C35.3692 184.654 35.4304 184.181 35.4591 183.706C35.4591 183.247 35.5241 182.813 35.5359 182.444C35.5773 181.7 35.6069 181.2 35.6069 181.2Z" fill="#242222"/>
<path d="M32.8229 181.867H40.7433L40.9502 177.481H32.5215L32.8229 181.867Z" fill="#401A4C"/>
<path d="M25.6943 55.6121C25.6943 58.1708 35.0274 63.3476 37.5631 63.3476C38.7827 63.3476 39.9524 62.8599 40.8148 61.9917C41.6772 61.1235 42.1616 59.946 42.1616 58.7182C42.1616 56.1655 40.0988 54.2733 37.5631 54.0948C34.5841 53.8865 25.6943 53.0594 25.6943 55.6121Z" fill="#94C7C5"/>
<path d="M23.3062 55.6121C23.3062 58.1708 13.9731 63.3476 11.4374 63.3476C10.2178 63.3476 9.04815 62.8599 8.18575 61.9917C7.32336 61.1235 6.83887 59.946 6.83887 58.7182C6.83887 56.1655 8.90171 54.2733 11.4374 54.0948C14.4164 53.8865 23.3062 53.0594 23.3062 55.6121Z" fill="#94C7C5"/>
<path d="M37.2969 97.1338H11.7034C12.5368 86.0007 12.395 74.6355 10.4149 63.4012C9.41597 58.1054 12.6787 53.6486 18.4358 53.6486H30.5587C36.3216 53.6486 39.5844 58.1054 38.5854 63.4012C36.6054 74.6355 36.4635 86.0007 37.2969 97.1338Z" fill="#94C7C5"/>
<path d="M24.5008 91.1002C18.5901 91.1002 14.0979 86.8159 13.2172 80.7406C12.7621 77.8844 12.236 75.0223 11.5977 72.1602C12.3461 80.4721 12.3817 88.8336 11.704 97.1517H37.2975C36.6174 88.8337 36.6511 80.4723 37.398 72.1602C36.7656 75.0163 36.2159 77.8784 35.7844 80.7346C34.9037 86.8159 30.3879 91.1002 24.5008 91.1002Z" fill="#8BBAB8"/>
<path d="M24.5004 55.6418C24.5004 55.6418 24.5358 58.266 24.5949 62.1872C24.5949 64.1509 24.5949 66.4477 24.6422 68.9052C24.6895 71.3627 24.6422 73.9868 24.6422 76.6407C24.6422 79.2945 24.6422 81.8829 24.6422 84.3404C24.6422 86.7979 24.6068 89.1007 24.5949 91.0584C24.5358 94.9916 24.5004 97.6038 24.5004 97.6038C24.5004 97.6038 24.4649 94.9797 24.4058 91.0584C24.4058 89.0948 24.3703 86.7979 24.3526 84.3404C24.3349 81.8829 24.3526 79.2588 24.3526 76.6407C24.3526 74.0225 24.3526 71.3924 24.3526 68.9052C24.3526 66.4179 24.3881 64.1449 24.4058 62.1872C24.4649 58.266 24.5004 55.6418 24.5004 55.6418Z" fill="#6A8F8D"/>
<path d="M18.4361 53.6486C18.0408 53.6512 17.6461 53.677 17.2539 53.7259C18.0459 57.0581 21.551 58.4862 21.551 58.4862L24.5064 55.6777L23.7498 53.6307L18.4361 53.6486ZM30.559 53.6486H25.2393L24.5005 55.6955L27.4558 58.5041C27.4558 58.5041 30.9609 57.0581 31.7529 53.7438C31.3572 53.6885 30.9585 53.6567 30.559 53.6486Z" fill="#92C4C2"/>
<path d="M18.4364 53.6486L17.2542 53.7378C17.3251 54.0054 17.4139 54.2678 17.5202 54.5233L17.6798 54.9041L17.8867 55.2611C17.9546 55.3806 18.0296 55.4958 18.1113 55.6062C18.194 55.7193 18.2649 55.8383 18.3536 55.9394C18.5304 56.1456 18.7179 56.3422 18.9151 56.5285C19.1012 56.7376 19.2985 56.9362 19.5062 57.1236C19.719 57.2961 19.9436 57.4568 20.1682 57.6055C20.6173 57.9086 21.092 58.1715 21.5868 58.391H21.4331L22.9049 56.9748L24.4062 55.5884L24.3707 55.749C24.1225 55.0647 23.8979 54.3685 23.6555 53.6843L23.7501 53.7438L21.0962 53.6783L18.4364 53.6486ZM18.4364 53.6486H21.0903L23.7442 53.5533H23.8092V53.6188C24.0752 54.2912 24.353 54.9636 24.6131 55.6419L24.6485 55.7371L24.5776 55.8026L23.1058 57.2188L21.6282 58.6112L21.5572 58.6766L21.4686 58.6409C20.7066 58.2784 20.0016 57.8053 19.3762 57.2366C19.1674 57.0505 18.97 56.8518 18.7851 56.6416C18.5984 56.4329 18.4228 56.2144 18.259 55.987C18.1754 55.8747 18.0984 55.7575 18.0285 55.636C17.9486 55.5227 17.8774 55.4033 17.8157 55.279L17.6266 54.9041L17.467 54.5173C17.3665 54.2595 17.2836 53.9951 17.2188 53.7259L18.4364 53.6486Z" fill="#6A8F8D"/>
<path d="M30.5589 53.6485H27.9109L25.257 53.7139L25.3457 53.6544C25.1092 54.3387 24.8846 55.0349 24.6364 55.7192L24.6009 55.5586L26.1022 56.945C26.5987 57.4151 27.0834 57.8911 27.574 58.3612H27.4144C27.9111 58.1417 28.3878 57.8789 28.8389 57.5757C29.0662 57.4252 29.2852 57.2623 29.495 57.0878C29.9312 56.7359 30.3276 56.3368 30.6772 55.8977C30.8488 55.6819 31.0068 55.4553 31.15 55.2194L31.351 54.8624L31.5165 54.4815C31.6227 54.2261 31.7116 53.9637 31.7825 53.6961L30.5589 53.6485ZM30.5589 53.6485L31.7411 53.7139C31.6762 53.9831 31.5933 54.2475 31.4928 54.5053L31.3332 54.8921L31.1441 55.267C31.0811 55.3925 31.01 55.5138 30.9313 55.63C30.8545 55.743 30.7895 55.868 30.7008 55.9751C30.2021 56.6564 29.6043 57.2582 28.9276 57.7602C28.4785 58.1032 27.9928 58.3946 27.4794 58.6289L27.3967 58.6646L27.3258 58.5992C26.8234 58.1351 26.3209 57.6769 25.8244 57.2068L24.3527 55.7906L24.2817 55.7192L24.3172 55.63C24.5773 54.9516 24.8551 54.2792 25.1211 53.6068V53.5414H25.1861L27.84 53.6128L30.5589 53.6485Z" fill="#6A8F8D"/>
<path d="M28.8391 53.6605L24.5006 55.642L20.1621 53.6605V48.6087C20.1621 47.4503 20.6192 46.3394 21.4328 45.5203C22.2464 44.7012 23.35 44.2411 24.5006 44.2411C25.6512 44.2411 26.7547 44.7012 27.5684 45.5203C28.382 46.3394 28.8391 47.4503 28.8391 48.6087V53.6605Z" fill="#EFB596"/>
<path d="M31.1857 63.669L35.1873 63.5857H35.27V63.669L35.3055 66.5608V68.0068C35.3349 68.4923 35.3349 68.9791 35.3055 69.4646C35.1815 70.4699 34.6932 71.3938 33.9342 72.059C33.1773 72.7296 32.2058 73.1035 31.1975 73.1122C30.6985 73.1045 30.2045 73.0099 29.7376 72.8325C29.0358 72.5658 28.4193 72.1122 27.9539 71.52C27.4885 70.9278 27.1918 70.2194 27.0955 69.4706C27.0632 68.9832 27.0632 68.4942 27.0955 68.0068V66.5608L27.1309 63.669V63.5797H27.1901L31.1857 63.663L27.1901 63.7463L27.2728 63.663L27.3083 66.5549V68.0008C27.3019 68.4775 27.3197 68.9541 27.3615 69.4289C27.4566 70.1206 27.7359 70.7735 28.1699 71.3183C28.6038 71.863 29.1762 72.2794 29.8262 72.5231C30.2582 72.6819 30.7141 72.7644 31.1739 72.7671C32.0951 72.7691 32.9873 72.4423 33.6919 71.8447C34.3938 71.2349 34.8517 70.389 34.9804 69.4646C35.0202 68.9897 35.0359 68.513 35.0277 68.0365V66.5906L35.0632 63.6987L35.1459 63.782L31.1857 63.669Z" fill="#6A8F8D"/>
<path d="M27.1899 64.9958C27.1899 64.9958 27.6864 64.9423 28.4371 64.9066C29.1878 64.8709 30.2103 64.8292 31.1856 64.8292C32.1609 64.8292 33.1893 64.8649 33.94 64.9006C34.6907 64.9363 35.1872 64.9958 35.1872 64.9958C35.1872 64.9958 34.6907 65.0553 33.94 65.091C33.1893 65.1267 32.1668 65.1684 31.1856 65.1684C30.2044 65.1684 29.1878 65.1327 28.4371 65.091C27.6864 65.0494 27.1899 64.9958 27.1899 64.9958Z" fill="#6A8F8D"/>
<path d="M23.5958 94.2478C23.5943 94.362 23.5481 94.471 23.4674 94.5512C23.3866 94.6313 23.2778 94.6763 23.1643 94.6763C23.0515 94.6763 22.9432 94.6311 22.8634 94.5508C22.7836 94.4704 22.7388 94.3615 22.7388 94.2478C22.7388 94.1337 22.7834 94.0241 22.8631 93.9428C22.9427 93.8615 23.0509 93.815 23.1643 93.8135C23.2788 93.8135 23.3885 93.8592 23.4694 93.9407C23.5504 94.0222 23.5958 94.1326 23.5958 94.2478Z" fill="#6E9492"/>
<path d="M23.5958 87.1609C23.5943 87.2751 23.5481 87.3841 23.4674 87.4642C23.3866 87.5444 23.2778 87.5894 23.1643 87.5894C23.0515 87.5894 22.9432 87.5442 22.8634 87.4639C22.7836 87.3835 22.7388 87.2746 22.7388 87.1609C22.7388 87.0468 22.7834 86.9372 22.8631 86.8559C22.9427 86.7746 23.0509 86.7281 23.1643 86.7266C23.2788 86.7266 23.3885 86.7723 23.4694 86.8538C23.5504 86.9352 23.5958 87.0457 23.5958 87.1609Z" fill="#6E9492"/>
<path d="M23.5962 80.0741C23.5947 80.1883 23.5485 80.2973 23.4678 80.3775C23.387 80.4576 23.2782 80.5026 23.1648 80.5026C23.0598 80.4901 22.963 80.4393 22.8927 80.3598C22.8225 80.2803 22.7837 80.1776 22.7837 80.0712C22.7837 79.9648 22.8225 79.862 22.8927 79.7825C22.963 79.703 23.0598 79.6522 23.1648 79.6398C23.2792 79.6398 23.3889 79.6855 23.4699 79.767C23.5508 79.8485 23.5962 79.9589 23.5962 80.0741Z" fill="#6E9492"/>
<path d="M23.5964 72.9813C23.5964 73.0965 23.5509 73.2069 23.47 73.2884C23.3891 73.3699 23.2793 73.4156 23.1649 73.4156C23.0795 73.4156 22.9961 73.3902 22.9252 73.3424C22.8542 73.2947 22.7989 73.2269 22.7662 73.1475C22.7336 73.0681 22.725 72.9808 22.7417 72.8965C22.7583 72.8122 22.7994 72.7349 22.8598 72.6741C22.9201 72.6134 22.997 72.572 23.0807 72.5552C23.1644 72.5385 23.2512 72.5471 23.33 72.5799C23.4088 72.6128 23.4762 72.6685 23.5236 72.7399C23.5711 72.8114 23.5964 72.8953 23.5964 72.9813Z" fill="#6E9492"/>
<path d="M23.5964 65.8943C23.5964 66.0095 23.5509 66.12 23.47 66.2015C23.3891 66.283 23.2793 66.3287 23.1649 66.3287C23.0795 66.3287 22.9961 66.3032 22.9252 66.2555C22.8542 66.2078 22.7989 66.1399 22.7662 66.0606C22.7336 65.9812 22.725 65.8939 22.7417 65.8096C22.7583 65.7253 22.7994 65.6479 22.8598 65.5872C22.9201 65.5264 22.997 65.4851 23.0807 65.4683C23.1644 65.4515 23.2512 65.4601 23.33 65.493C23.4088 65.5259 23.4762 65.5816 23.5236 65.653C23.5711 65.7244 23.5964 65.8084 23.5964 65.8943Z" fill="#6E9492"/>
<path d="M23.5958 58.8076C23.5958 58.9228 23.5504 59.0333 23.4694 59.1147C23.3885 59.1962 23.2788 59.242 23.1643 59.242C23.0509 59.2404 22.9427 59.1939 22.8631 59.1126C22.7834 59.0314 22.7388 58.9218 22.7388 58.8076C22.7388 58.694 22.7836 58.585 22.8634 58.5046C22.9432 58.4243 23.0515 58.3792 23.1643 58.3792C23.2778 58.3791 23.3866 58.4241 23.4674 58.5043C23.5481 58.5844 23.5943 58.6934 23.5958 58.8076Z" fill="#6E9492"/>
<path d="M23.8981 107.321C23.9012 106.027 23.4957 104.765 22.7404 103.719C21.985 102.672 20.9188 101.893 19.6955 101.496C18.4723 101.099 17.1553 101.103 15.9347 101.508C14.714 101.914 13.6528 102.699 12.9042 103.751C12.1446 104.884 11.7523 106.227 11.7811 107.595L9.77148 140.565C9.77148 140.649 9.77148 140.732 9.77148 140.821C9.78724 142.039 10.2699 143.203 11.1186 144.071C11.9672 144.938 13.1162 145.442 14.3252 145.477C15.5342 145.511 16.7097 145.074 17.6059 144.256C18.5022 143.439 19.0497 142.304 19.1341 141.089C19.1341 141.089 23.8981 108.332 23.8981 107.321Z" fill="#580473"/>
<path d="M19.1218 141.101C19.1218 141.012 19.1218 140.923 19.1218 140.833C19.1036 139.616 18.619 138.454 17.7694 137.588C16.9198 136.723 15.7708 136.221 14.5624 136.188C13.354 136.155 12.1796 136.593 11.2846 137.411C10.3896 138.229 9.84308 139.363 9.75924 140.577L8.3584 181.867H16.0128L19.1041 141.321C19.1069 141.309 19.1069 141.297 19.1041 141.286L19.1218 141.101Z" fill="#580473"/>
<path d="M9.64684 179.903L8.37012 181.867H16.0127L17.9396 156.661L15.2384 167.164C14.0756 171.688 12.1869 175.991 9.64684 179.903Z" fill="#580473"/>
<path d="M25.2158 107.321C25.2128 106.027 25.6182 104.765 26.3736 103.719C27.129 102.672 28.1952 101.893 29.4184 101.496C30.6417 101.099 31.9587 101.103 33.1793 101.508C34.4 101.914 35.4612 102.699 36.2098 103.751C36.9694 104.884 37.3617 106.227 37.3328 107.595L39.3425 140.566C39.3425 140.649 39.3425 140.732 39.3425 140.821C39.3512 142.054 38.8799 143.241 38.0297 144.127C37.1795 145.014 36.0181 145.531 34.7943 145.566C33.5706 145.601 32.3819 145.152 31.483 144.315C30.5842 143.478 30.0467 142.32 29.9858 141.089C29.9858 141.089 25.2158 108.332 25.2158 107.321Z" fill="#580473"/>
<path d="M29.9971 141.101C29.9971 141.012 29.9971 140.923 29.9971 140.833C30.0154 139.616 30.4999 138.454 31.3495 137.588C32.1992 136.723 33.3482 136.221 34.5566 136.188C35.7649 136.155 36.9393 136.593 37.8343 137.411C38.7293 138.229 39.2758 139.363 39.3597 140.577L40.7605 181.867H33.1002L30.0089 141.321C30.0061 141.309 30.0061 141.297 30.0089 141.286L29.9971 141.101Z" fill="#580473"/>
<path d="M39.4665 179.903L40.7433 181.867H33.1007L31.1797 156.661L33.875 167.164C35.0378 171.688 36.9265 175.991 39.4665 179.903Z" fill="#580473"/>
<path d="M11.7041 97.1338H37.2976V105.173C37.2976 106.231 37.0906 107.278 36.6884 108.256C36.2862 109.233 35.6967 110.122 34.9535 110.87C34.2104 111.618 33.3281 112.211 32.3571 112.616C31.3861 113.021 30.3454 113.23 29.2945 113.23H17.7331C16.1335 113.228 14.6001 112.587 13.4696 111.448C12.3391 110.309 11.7041 108.764 11.7041 107.154V97.1338Z" fill="#580473"/>
<path d="M37.2976 97.1338H11.7041V99.4366C11.7041 100.716 37.2976 100.716 37.2976 99.4366V97.1338Z" fill="#401A4C"/>
<path d="M25.5823 109.737L23.419 109.796H23.3599V109.737C23.3126 107.987 23.3008 106.238 23.2771 104.488L23.2476 99.2402V99.0736H23.419H25.5823H25.7419V99.2283C25.7419 100.978 25.7419 102.727 25.6946 104.477C25.6473 106.226 25.6296 107.987 25.5823 109.737ZM25.5823 109.737C25.535 107.987 25.4877 106.238 25.47 104.488C25.4523 102.739 25.4345 100.99 25.4286 99.2402L25.5823 99.4009H23.419L23.5845 99.2283V104.477C23.5845 106.226 23.5431 107.975 23.4958 109.725L23.4426 109.671L25.5823 109.737Z" fill="#401A4C"/>
<path d="M11.7041 105.565L12.0587 105.53C12.2834 105.53 12.6025 105.464 12.9749 105.393C13.1755 105.356 13.3731 105.304 13.566 105.238C13.7724 105.162 13.9705 105.064 14.1571 104.947C14.3484 104.816 14.5197 104.657 14.6654 104.476C14.7304 104.381 14.8072 104.286 14.8663 104.179L15.0318 103.852C15.1237 103.623 15.2007 103.388 15.2624 103.15C15.3258 102.913 15.3751 102.672 15.4101 102.43C15.4574 102.197 15.4752 101.965 15.5106 101.751C15.5461 101.537 15.552 101.323 15.5697 101.126C15.5993 100.746 15.6229 100.418 15.6347 100.192C15.6466 99.9661 15.6347 99.8352 15.6347 99.8352C15.6347 99.8352 15.6347 99.9661 15.6702 100.192C15.7057 100.418 15.7293 100.746 15.7293 101.132C15.7293 101.329 15.7293 101.543 15.7293 101.769C15.7275 102.004 15.7117 102.238 15.682 102.471C15.6555 102.726 15.612 102.978 15.552 103.227C15.4937 103.487 15.4126 103.742 15.3097 103.989L15.1264 104.352C15.0555 104.465 14.9668 104.572 14.89 104.685C14.7225 104.887 14.5227 105.06 14.2989 105.196C14.0894 105.322 13.8622 105.414 13.6251 105.47C13.4172 105.523 13.2059 105.561 12.9926 105.583C12.6798 105.606 12.3657 105.606 12.0528 105.583L11.7041 105.565Z" fill="#401A4C"/>
<path d="M37.2382 105.565L36.8835 105.595C36.5707 105.618 36.2566 105.618 35.9437 105.595C35.7306 105.572 35.5192 105.535 35.3113 105.482C35.0745 105.425 34.8475 105.332 34.6374 105.208C34.4145 105.071 34.2149 104.898 34.0464 104.697C33.9695 104.584 33.8809 104.477 33.8099 104.363L33.6267 104.001C33.5238 103.754 33.4427 103.499 33.3844 103.239C33.3243 102.99 33.2809 102.738 33.2543 102.483C33.213 102.239 33.2543 102.001 33.2071 101.781C33.1598 101.561 33.2071 101.341 33.2071 101.144C33.2071 100.758 33.2484 100.43 33.2662 100.204C33.2839 99.9781 33.3016 99.8472 33.3016 99.8472C33.3016 99.8472 33.3016 99.9781 33.3312 100.204C33.3607 100.43 33.3666 100.758 33.3962 101.138C33.3962 101.335 33.3962 101.543 33.4553 101.763C33.5144 101.983 33.5085 102.209 33.5558 102.442C33.5908 102.684 33.6402 102.925 33.7036 103.162C33.7652 103.4 33.8422 103.635 33.9341 103.864L34.0996 104.191C34.1646 104.298 34.2355 104.393 34.3064 104.488C34.4485 104.671 34.6181 104.829 34.8089 104.959C34.9954 105.076 35.1935 105.174 35.3999 105.25C35.5929 105.316 35.7904 105.368 35.991 105.405C36.3634 105.476 36.6826 105.518 36.9072 105.542L37.2382 105.565Z" fill="#401A4C"/>
<path d="M18.6903 97.1338H17.3604V101.115H18.6903V97.1338Z" fill="#0B4568"/>
<path d="M14.4168 97.1338H13.0869V101.115H14.4168V97.1338Z" fill="#0B4568"/>
<path d="M35.9139 97.1338H34.584V101.115H35.9139V97.1338Z" fill="#0B4568"/>
<path d="M31.6409 97.1338H30.311V101.115H31.6409V97.1338Z" fill="#0B4568"/>
<path d="M27.5089 96.9553H21.4858V100.395H27.5089V96.9553Z" fill="#D8DADE"/>
<path d="M6.27783 36.7019C8.85345 36.7019 10.9414 34.6 10.9414 32.0071C10.9414 29.4142 8.85345 27.3123 6.27783 27.3123C3.70221 27.3123 1.61426 29.4142 1.61426 32.0071C1.61426 34.6 3.70221 36.7019 6.27783 36.7019Z" fill="#EFB596"/>
<path d="M42.8413 36.7019C45.4169 36.7019 47.5049 34.6 47.5049 32.0071C47.5049 29.4142 45.4169 27.3123 42.8413 27.3123C40.2657 27.3123 38.1777 29.4142 38.1777 32.0071C38.1777 34.6 40.2657 36.7019 42.8413 36.7019Z" fill="#EFB596"/>
<path d="M43.5746 26.5923C43.5746 38.2669 35.0631 49.4655 24.5598 49.4655C14.0564 49.4655 5.54492 38.2669 5.54492 26.5923C5.54492 14.9177 14.0564 7.19409 24.5598 7.19409C35.0631 7.19409 43.5746 14.9177 43.5746 26.5923Z" fill="#F6C3A3"/>
<path d="M43.5739 26.5923H42.043C40.902 29.5359 39.9735 32.5586 39.2649 35.6368C39.0916 36.7552 38.7404 37.8382 38.2247 38.8441C36.6465 41.6527 33.1946 44.0328 31.0727 43.1343C29.4827 42.4738 29.7073 40.4209 27.7804 39.6117C26.7343 39.239 25.5893 39.2622 24.559 39.6771C23.5288 39.2622 22.3837 39.239 21.3377 39.6117C19.4049 40.4209 19.6354 42.4738 18.0395 43.1343C15.9234 44.0328 12.4538 41.6527 10.8934 38.8441C10.3777 37.8382 10.0264 36.7552 9.85312 35.6368C9.15033 32.5591 8.22783 29.5364 7.09281 26.5923H5.5442C4.95312 35.4226 6.47218 38.9333 8.15083 40.4269C9.21656 41.2863 10.2055 42.238 11.1062 43.2712C12.9858 45.4668 12.7612 46.1095 14.1798 47.2162C15.5984 48.323 15.8348 47.7637 18.4946 49.3643C19.7772 50.1379 20.1082 50.4949 21.0776 50.84C22.1937 51.225 23.3823 51.3491 24.5531 51.203C25.724 51.3491 26.9125 51.225 28.0286 50.84C28.998 50.4949 29.329 50.1379 30.6116 49.3643C33.2655 47.7637 33.567 48.2754 34.9206 47.2162C36.2741 46.1571 36.1027 45.4668 38 43.2712C38.9012 42.2384 39.89 41.2867 40.9554 40.4269C42.6459 38.9333 44.1827 35.4226 43.5739 26.5923Z" fill="#734A27"/>
<path d="M40.9617 37.999C39.8948 38.8571 38.9058 39.809 38.0063 40.8433C36.1267 43.033 36.3454 43.6816 34.9268 44.7884C33.5083 45.8952 33.2718 45.3299 30.6179 46.9305C29.3353 47.7041 29.0043 48.067 28.0349 48.4122C26.919 48.7982 25.7298 48.9204 24.5594 48.7692C23.389 48.9204 22.1998 48.7982 21.0839 48.4122C20.1145 48.067 19.7835 47.7041 18.5009 46.9305C15.8411 45.3299 15.5455 45.8416 14.1861 44.7884C12.8266 43.7352 13.0039 43.0033 11.1125 40.8433C10.2134 39.8085 9.22439 38.8566 8.15712 37.999C6.83311 36.809 5.59777 34.3574 5.43227 29.0259C5.24904 36.0771 6.64397 39.076 8.15712 40.4268C9.22285 41.2862 10.2117 42.2379 11.1125 43.271C12.9921 45.4667 12.7675 46.1094 14.1861 47.2161C15.6046 48.3229 15.8411 47.7636 18.5009 49.3642C19.7835 50.1378 20.1145 50.4948 21.0839 50.8399C22.2 51.2249 23.3886 51.349 24.5594 51.2029C25.7303 51.349 26.9188 51.2249 28.0349 50.8399C29.0043 50.4948 29.3353 50.1378 30.6179 49.3642C33.2718 47.7636 33.5733 48.2753 34.9268 47.2161C36.2804 46.157 36.109 45.4667 38.0063 43.271C38.9074 42.2383 39.8963 41.2866 40.9617 40.4268C42.4808 39.076 43.8757 36.0771 43.6866 29.0259C43.527 34.3574 42.2916 36.8149 40.9617 37.999Z" fill="#5C3A1A"/>
<path d="M39.2477 10.5382C45.2293 5.77791 48.6753 23.5992 43.3261 29.2937C37.1553 21.5761 34.4363 16.1672 39.2477 10.5382Z" fill="#734A27"/>
<path d="M39.2477 10.5382C45.2293 5.77791 48.6753 23.5992 43.3261 29.2937C37.1553 21.5761 34.4363 16.1672 39.2477 10.5382Z" fill="#5C3A1A"/>
<path d="M19.2874 25.0927C18.986 25.3426 17.9457 24.706 16.7221 24.7476C15.4986 24.7893 14.4642 25.3426 14.1628 25.0927C13.8613 24.8428 14.7539 23.3076 16.7221 23.3076C18.6904 23.3076 19.642 24.8785 19.2874 25.0927Z" fill="#734A27"/>
<path d="M34.9563 25.0927C34.6549 25.3426 33.6146 24.706 32.3911 24.7476C31.1676 24.7893 30.1332 25.3426 29.8317 25.0927C29.5303 24.8428 30.4228 23.3076 32.3911 23.3076C34.3594 23.3076 35.311 24.8785 34.9563 25.0927Z" fill="#734A27"/>
<path d="M16.7221 37.8146C19.9147 37.8146 22.5028 35.2091 22.5028 31.9951C22.5028 28.7811 19.9147 26.1757 16.7221 26.1757C13.5295 26.1757 10.9414 28.7811 10.9414 31.9951C10.9414 35.2091 13.5295 37.8146 16.7221 37.8146Z" fill="white"/>
<path d="M32.391 37.8146C35.5836 37.8146 38.1717 35.2091 38.1717 31.9951C38.1717 28.7811 35.5836 26.1757 32.391 26.1757C29.1985 26.1757 26.6104 28.7811 26.6104 31.9951C26.6104 35.2091 29.1985 37.8146 32.391 37.8146Z" fill="white"/>
<path d="M17.242 35.8153C19.3377 35.8153 21.0367 34.105 21.0367 31.9952C21.0367 29.8854 19.3377 28.175 17.242 28.175C15.1462 28.175 13.4473 29.8854 13.4473 31.9952C13.4473 34.105 15.1462 35.8153 17.242 35.8153Z" fill="#401A4C"/>
<path d="M35.6714 31.9952C35.6714 32.7507 35.4489 33.4893 35.0319 34.1175C34.6149 34.7457 34.0223 35.2354 33.3289 35.5245C32.6355 35.8137 31.8725 35.8893 31.1364 35.7419C30.4003 35.5945 29.7242 35.2307 29.1935 34.6964C28.6628 34.1622 28.3014 33.4815 28.1549 32.7405C28.0085 31.9994 28.0837 31.2313 28.3709 30.5333C28.6581 29.8352 29.1445 29.2386 29.7685 28.8189C30.3925 28.3991 31.1262 28.175 31.8767 28.175C32.8831 28.175 33.8483 28.5775 34.56 29.2939C35.2716 30.0104 35.6714 30.982 35.6714 31.9952Z" fill="#401A4C"/>
<path d="M25.0387 34.2921C25.3106 35.256 24.7668 37.9158 25.8603 37.9158C26.8296 37.9158 27.0424 39.5819 25.7539 39.8081C21.0667 40.6411 24.3057 31.7513 25.0387 34.2921Z" fill="#F1A89E"/>
<path d="M22.6802 41.8906L22.7393 42.1762C22.7536 42.2838 22.7793 42.3896 22.8161 42.4916C22.8558 42.6252 22.9031 42.7563 22.958 42.8843C23.0188 43.0342 23.094 43.1777 23.1826 43.3128C23.2791 43.4604 23.39 43.5979 23.5136 43.7233L23.7205 43.9078L23.9569 44.0447C24.0396 44.0804 24.1283 44.1042 24.2111 44.1339C24.2938 44.1637 24.3943 44.1339 24.483 44.1339C24.5716 44.1339 24.6544 44.1339 24.743 44.0923C24.8317 44.0506 24.9144 44.0209 24.9972 43.9911C25.1551 43.9002 25.2986 43.7858 25.4228 43.6519L25.606 43.4496L25.7597 43.2295C25.8565 43.1102 25.9397 42.9805 26.0079 42.8427C26.067 42.7058 26.1498 42.5868 26.1971 42.4678L26.3212 42.1643L26.4335 41.8966L26.3803 42.1822C26.3803 42.2714 26.3389 42.3845 26.3094 42.5095C26.2788 42.6501 26.2353 42.7876 26.1793 42.92C26.1247 43.0856 26.0534 43.2451 25.9665 43.3961C25.9252 43.4794 25.8779 43.5627 25.8306 43.646C25.7833 43.7293 25.7065 43.8066 25.6415 43.884C25.5791 43.9727 25.5033 44.051 25.4169 44.1161C25.3369 44.1927 25.2475 44.2587 25.1509 44.3124C25.0445 44.3541 24.944 44.4136 24.8376 44.4493C24.7312 44.485 24.6012 44.4969 24.4889 44.5028C24.3698 44.4978 24.2513 44.4838 24.1342 44.4612C24.0256 44.4277 23.9191 44.388 23.815 44.3422L23.5313 44.1577L23.3008 43.9375C23.1697 43.7893 23.0603 43.623 22.9757 43.4437C22.889 43.2886 22.8234 43.1225 22.7807 42.9498C22.7354 42.811 22.7076 42.6671 22.6979 42.5214C22.6876 42.4105 22.6876 42.299 22.6979 42.1881C22.6802 41.9977 22.6802 41.8906 22.6802 41.8906Z" fill="#401A4C"/>
<path d="M5.57471 29.0079C9.10933 27.3716 14.6477 20.2312 15.0674 14.9413C18.3892 19.4576 27.3853 25.289 37.0612 22.0817C34.9688 20.7012 30.9495 15.7505 30.9495 15.7505C33.4369 17.4957 36.2718 18.6748 39.2573 19.2061C42.2429 19.7373 45.3075 19.6079 48.2384 18.8269C49.9407 9.09804 28.8867 -10.8357 11.8578 7.47954C7.09377 5.266 -1.22263 19.9098 5.57471 29.0079Z" fill="#734A27"/>
<path d="M25.5472 10.9191C26.4481 11.7858 27.208 12.7898 27.7991 13.8942C29.4778 17.2026 26.8712 20.8264 23.6439 19.6363C19.0572 17.8512 16.7638 14.6261 14.6891 11.8414C14.3049 16.5124 8.50059 27.8002 4.0498 26.3305C4.44625 27.2831 4.95848 28.1825 5.57477 29.0082C9.10939 27.3718 14.6478 20.2314 15.0674 14.9415C18.3892 19.4578 27.3854 25.2892 37.0613 22.0819C34.9689 20.7015 30.9496 15.7508 30.9496 15.7508C33.4369 17.4959 36.2718 18.6751 39.2574 19.2063C42.2429 19.7375 45.3076 19.6081 48.2385 18.8271C48.3338 18.1482 48.3338 17.4591 48.2385 16.7802C39.1537 21.5464 25.5472 10.9191 25.5472 10.9191Z" fill="#5C3A1A"/>
<path d="M15.6465 11.2284C15.6465 11.2284 15.8534 11.5616 16.273 12.109C16.8533 12.8688 17.4769 13.594 18.1408 14.2809C18.5368 14.7153 19.0097 15.1437 19.5003 15.6019C19.9909 16.0601 20.5524 16.4945 21.1257 16.9526C21.6991 17.4108 22.3079 17.8511 22.9817 18.2379C23.3068 18.4343 23.6319 18.6485 23.9688 18.833L25.0032 19.3685C25.6899 19.7297 26.3964 20.0515 27.1192 20.3324C27.4663 20.4868 27.8238 20.6161 28.1891 20.7192L29.2471 21.0584C29.588 21.1692 29.9355 21.2586 30.2874 21.3262L31.2981 21.5523C31.911 21.6956 32.5332 21.7951 33.16 21.8498L33.9934 21.9509C34.2436 21.9922 34.4965 22.014 34.75 22.0164L35.9853 22.0581L37.0611 22.0878H35.9853H34.7441C34.2092 22.0961 33.6743 22.0722 33.1423 22.0164C32.5072 21.9797 31.8753 21.9002 31.2508 21.7784L30.2283 21.582C29.8693 21.523 29.5155 21.4354 29.1702 21.3202L28.0945 20.9929C27.7234 20.8898 27.36 20.7606 27.0069 20.6062C26.2723 20.3236 25.554 19.9998 24.8554 19.6363L23.8092 19.0769C23.4664 18.8746 23.1413 18.6604 22.8103 18.4521C22.1424 18.0535 21.5454 17.5715 20.9484 17.1312C20.3514 16.6908 19.8313 16.1969 19.3348 15.7328C18.8383 15.2687 18.3891 14.8105 18.0049 14.3642C17.6207 13.918 17.266 13.5014 16.9646 13.1266C16.6631 12.7517 16.4208 12.4066 16.2316 12.1209C15.8356 11.5735 15.6465 11.2284 15.6465 11.2284Z" fill="#452C17"/>
<path d="M16.5977 7.1405C16.5977 7.1405 16.775 7.43802 17.1237 7.92595C17.4724 8.41388 17.9867 9.11602 18.631 9.90147C18.962 10.2942 19.3107 10.7286 19.7185 11.157C20.1264 11.5854 20.546 12.0317 20.9952 12.4899C21.4445 12.9481 21.941 13.3765 22.4316 13.8406C22.9221 14.3047 23.4659 14.7094 24.0275 15.1021C24.589 15.4948 25.115 15.9173 25.7002 16.2505L26.5513 16.7682C26.8351 16.9348 27.1424 17.0598 27.4143 17.2085L28.2595 17.625C28.5373 17.7559 28.8211 17.8512 29.093 17.9642C29.5971 18.1832 30.1167 18.3642 30.6475 18.5057L31.9892 18.8806L33.0531 19.0591L33.9811 19.2138L33.0472 19.1186L31.9656 19.0055L30.5943 18.6902C30.053 18.5623 29.5216 18.3952 29.0043 18.1903C28.7265 18.0892 28.4132 17.9999 28.1472 17.8809L27.2902 17.4703C27.0006 17.3275 26.6991 17.1966 26.4095 17.03L25.5406 16.5183C24.9495 16.191 24.3939 15.7626 23.8265 15.3758C23.2591 14.989 22.7566 14.5011 22.2247 14.0786C21.6927 13.6561 21.2317 13.1682 20.7884 12.6981C19.9675 11.8528 19.1977 10.9586 18.4832 10.0205C17.9778 9.35814 17.5082 8.66889 17.0764 7.9557C16.7572 7.44397 16.5977 7.1405 16.5977 7.1405Z" fill="#452C17"/>
<path d="M21.5215 6.97388C21.5215 6.97388 22.1776 7.51536 23.1351 8.36626C23.608 8.79469 24.1695 9.28262 24.7606 9.8241L26.5988 11.5319L28.4075 13.2634C28.9986 13.8168 29.5069 14.3523 29.962 14.8046C30.8664 15.709 31.4456 16.3338 31.4456 16.3338C31.4456 16.3338 30.7895 15.7864 29.832 14.9414C29.3591 14.513 28.7917 14.0251 28.2065 13.4776L26.3742 11.7758L24.5655 10.0383C23.9744 9.48493 23.4661 8.9494 23.011 8.50312C22.1007 7.59271 21.5215 6.97388 21.5215 6.97388Z" fill="#452C17"/>
<path d="M23.2827 4.11182C24.8454 4.27226 26.3969 4.5286 27.9286 4.87941C29.5009 5.23314 31.0537 5.6701 32.5803 6.18849C33.4137 6.48006 34.2708 6.78353 35.1278 7.1584C35.9849 7.53327 36.8478 7.92005 37.6931 8.34847C38.5383 8.7769 39.354 9.25888 40.1401 9.75871C40.9098 10.2491 41.6536 10.7793 42.3685 11.3475C42.7172 11.6271 43.06 11.8949 43.3733 12.1865C43.6866 12.478 43.9998 12.7815 44.2836 13.0493C44.5673 13.317 44.8746 13.6443 45.0992 13.918C45.3238 14.1917 45.6076 14.4773 45.8144 14.763C46.0213 15.0486 46.2459 15.3104 46.4055 15.5782C46.5651 15.8459 46.7542 16.1077 46.9138 16.3458C47.2271 16.8337 47.4517 17.2859 47.6586 17.6429L48.2142 18.833L47.6231 17.6846C47.3985 17.3335 47.1562 16.8932 46.8252 16.4291C46.6597 16.1911 46.4764 15.9471 46.2932 15.6853C46.11 15.4235 45.8794 15.1735 45.6548 14.8939C45.4302 14.6142 45.182 14.3583 44.9278 14.0727C44.6737 13.7871 44.3899 13.5193 44.1003 13.2397C43.8107 12.96 43.5092 12.6863 43.1782 12.4126C42.8472 12.1389 42.5281 11.8592 42.1793 11.5914C41.4669 11.0365 40.7272 10.5182 39.9628 10.0384C39.1767 9.55045 38.361 9.08632 37.5276 8.66384C36.6942 8.24137 35.8489 7.82484 34.9978 7.47377C34.1466 7.1227 33.3132 6.75973 32.5094 6.46221C30.8485 5.86717 29.2703 5.409 27.9049 5.06387C26.5395 4.71875 25.3928 4.46884 24.5831 4.32008C23.7733 4.17132 23.2827 4.11182 23.2827 4.11182Z" fill="#452C17"/>
<path d="M26.1851 7.46777C26.1851 7.46777 27.0067 8.19372 28.2715 9.25288C28.904 9.78246 29.6606 10.3775 30.4644 11.038C30.8723 11.3474 31.286 11.6806 31.7234 11.996C32.1608 12.3114 32.5982 12.6446 33.0533 12.9481C33.9399 13.5847 34.862 14.1798 35.7427 14.6915C36.1801 14.9652 36.6234 15.1794 37.0313 15.4115C37.4391 15.6436 37.8588 15.7983 38.2134 15.9768C38.568 16.1553 38.9404 16.2624 39.2537 16.3874L39.6911 16.548L40.0753 16.6373L40.8082 16.8158L40.0753 16.6611L39.6793 16.5956L39.23 16.4647C38.8642 16.3715 38.5049 16.2542 38.1543 16.1137C37.776 15.947 37.3445 15.8102 36.9249 15.59C36.5052 15.3699 36.0383 15.1794 35.6009 14.9057C35.1635 14.632 34.6847 14.388 34.2355 14.0905C33.7863 13.793 33.3134 13.4955 32.8583 13.1801C32.4032 12.8648 31.9717 12.5315 31.5343 12.2043C31.0969 11.877 30.689 11.5438 30.2812 11.2225C29.4832 10.5739 28.7621 9.93122 28.1533 9.37784C26.9357 8.27107 26.1851 7.46777 26.1851 7.46777Z" fill="#452C17"/>
<path d="M25.0972 2.13623C25.3111 2.07516 25.5282 2.02551 25.7473 1.98747C25.9601 1.98747 26.2143 1.91012 26.5157 1.88632C26.8456 1.85169 27.1771 1.83382 27.5087 1.83276C27.8752 1.83276 28.2712 1.83276 28.6909 1.83276C29.1328 1.862 29.5729 1.91564 30.009 1.99342C30.4641 2.05888 30.9192 2.17788 31.3921 2.29094C31.865 2.404 32.3201 2.58251 32.787 2.71937C33.254 2.85623 33.6914 3.10019 34.1347 3.3144L35.3878 3.97489L36.5049 4.68894C36.8536 4.91505 37.1551 5.17687 37.4506 5.39703C37.7217 5.59027 37.9785 5.80306 38.219 6.03372L38.8101 6.55735L39.2948 7.02148L38.7628 6.6109L38.1717 6.12892C37.9471 5.93851 37.6634 5.76 37.3679 5.53389C37.0723 5.30778 36.7768 5.08761 36.3985 4.8734L35.2755 4.20696L34.0342 3.58217C33.5968 3.40366 33.1535 3.21325 32.7043 3.04664C32.2551 2.88003 31.7704 2.73722 31.3271 2.62416C30.8838 2.5111 30.4168 2.38615 29.9735 2.31474C29.5302 2.24334 29.0987 2.16598 28.6909 2.10648C28.2831 2.04698 27.887 2.02913 27.5087 2.02318C26.7032 1.97754 25.8951 2.01542 25.0972 2.13623Z" fill="#452C17"/>
<path d="M13.0452 10.4132C13.026 11.2332 12.9628 12.0516 12.856 12.8648C12.7615 13.5967 12.6374 14.4476 12.4364 15.352C12.228 16.2949 11.9715 17.2264 11.668 18.1427C11.3424 19.0567 10.9472 19.9439 10.4858 20.7966C10.0793 21.5382 9.58514 22.2275 9.01407 22.8495C8.78921 23.1017 8.5419 23.3328 8.27523 23.5397C8.07424 23.703 7.86513 23.856 7.64869 23.9979C7.47137 24.1169 7.31178 24.1823 7.2113 24.2418L7.05762 24.3192L7.20539 24.224C7.29996 24.1585 7.44182 24.0752 7.61323 23.9443C7.82047 23.7904 8.01788 23.6234 8.2043 23.4445C8.43916 23.2181 8.66023 22.9777 8.8663 22.7245C9.96304 21.3215 10.8 19.7312 11.337 18.0297C11.6505 17.13 11.9169 16.2144 12.1349 15.2866C12.3477 14.394 12.531 13.5609 12.6551 12.835C12.9329 11.3891 13.0452 10.4132 13.0452 10.4132Z" fill="#452C17"/>
<path d="M11.2306 9.05054C10.6073 9.49358 10.0327 10.0022 9.51645 10.5679C9.28002 10.8118 9.04359 11.1034 8.79534 11.4009C8.54709 11.6984 8.30475 12.0436 8.08014 12.4065C7.83229 12.7689 7.60724 13.1464 7.40632 13.5371C7.1758 13.9239 7.02212 14.3523 6.81525 14.7629C6.60837 15.1735 6.50198 15.6138 6.35421 16.066L6.00547 17.3394C5.92272 17.7619 5.84588 18.1724 5.76905 18.5592C5.69221 18.946 5.68038 19.2911 5.63901 19.6362C5.59763 19.9814 5.55626 20.2908 5.55626 20.5764C5.55626 20.862 5.55626 21.1 5.52671 21.3023C5.52671 21.707 5.52671 21.9331 5.52671 21.9331C5.52671 21.9331 5.5267 21.707 5.49124 21.3023C5.49124 21.1 5.49124 20.8501 5.46169 20.5704C5.43855 20.2555 5.43855 19.9393 5.46169 19.6243C5.46169 19.2733 5.46169 18.8924 5.53853 18.4997C5.61537 18.107 5.66265 17.6845 5.73358 17.2561L6.06458 15.947C6.21235 15.5186 6.36603 15.0723 6.53153 14.6379C6.69703 14.2036 6.90982 13.7811 7.1226 13.3884C7.33741 12.9931 7.57627 12.6115 7.8378 12.2459C8.07197 11.898 8.32866 11.5661 8.6062 11.2522C8.87218 10.9547 9.12634 10.6571 9.38051 10.437C9.93199 9.89263 10.5544 9.42622 11.2306 9.05054Z" fill="#452C17"/>
<path d="M10.5802 12.5791C10.5802 12.5791 10.4501 13.1325 10.2196 13.9477C10.0955 14.3523 9.96544 14.8283 9.79994 15.3341C9.63444 15.8399 9.45121 16.3695 9.26798 16.905C9.08474 17.4405 8.86605 17.9642 8.68873 18.4462C8.5114 18.9281 8.29271 19.3923 8.12721 19.785C7.78438 20.5585 7.53613 21.0584 7.53613 21.0584C7.53613 21.0584 7.70163 20.5169 7.96762 19.7136C8.10947 19.3149 8.25133 18.8448 8.42865 18.345C8.60598 17.8452 8.78921 17.3156 8.97244 16.7801C9.15567 16.2445 9.36255 15.7209 9.56351 15.227C9.76448 14.7331 9.92998 14.269 10.0837 13.8763C10.3496 13.0908 10.5802 12.5791 10.5802 12.5791Z" fill="#452C17"/>
<path d="M20.2208 42.676L20.0966 42.8426C20.0139 42.9319 19.9311 43.0747 19.8188 43.2294C19.5642 43.6279 19.3447 44.048 19.1627 44.4849C18.9893 44.9072 18.9047 45.361 18.9145 45.8178C18.9187 45.9693 18.9571 46.1178 19.0268 46.2522L19.1332 46.401L18.9736 46.2938C18.8538 46.1693 18.7682 46.0155 18.7253 45.8476C18.665 45.6125 18.6529 45.3675 18.6899 45.1276C18.7254 44.858 18.7949 44.594 18.8967 44.3421C19.0002 44.0945 19.1268 43.8574 19.275 43.634C19.4065 43.4406 19.5549 43.2594 19.7183 43.0925C19.8329 42.9765 19.9576 42.871 20.0907 42.7772L20.2208 42.676Z" fill="#452C17"/>
<path d="M17.3306 44.9729L17.2301 45.4132C17.1946 45.5382 17.171 45.6929 17.1355 45.8476C17.0999 46.0103 17.0762 46.1753 17.0646 46.3415C17.05 46.5018 17.05 46.6631 17.0646 46.8235C17.075 46.9633 17.1028 47.1012 17.1474 47.234C17.1819 47.3322 17.2275 47.426 17.2833 47.5137C17.3065 47.5494 17.3263 47.5873 17.3424 47.6268C17.204 47.5499 17.0815 47.4469 16.9819 47.3233C16.8844 47.1867 16.8123 47.0335 16.7691 46.8711C16.7295 46.6754 16.7195 46.4747 16.7395 46.276C16.7777 45.934 16.8907 45.6048 17.0705 45.3121C17.1434 45.1889 17.2307 45.075 17.3306 44.9729Z" fill="#452C17"/>
<path d="M15.1026 43.6936C15.1026 43.6936 15.1026 43.8186 15.1026 43.9911C15.1026 44.1637 15.1026 44.3838 15.1026 44.5862C15.1026 44.7885 15.1026 45.0086 15.1026 45.1812C15.1026 45.3538 15.1026 45.4728 15.1026 45.4787L15.0376 45.4192C14.9885 45.362 14.945 45.3003 14.9075 45.2348C14.8541 45.1425 14.8161 45.042 14.7952 44.9372C14.763 44.8211 14.749 44.7007 14.7539 44.5802C14.7631 44.3559 14.8216 44.1364 14.9253 43.9376C14.9718 43.8477 15.0315 43.7654 15.1026 43.6936Z" fill="#452C17"/>
<path d="M12.3599 41.5514C12.3599 41.5514 12.3599 41.7002 12.3599 41.9144C12.3451 42.1601 12.3451 42.4065 12.3599 42.6522C12.371 42.78 12.3887 42.9071 12.4131 43.033C12.4313 43.1449 12.461 43.2546 12.5017 43.3603C12.527 43.4412 12.5566 43.5206 12.5904 43.5983L12.6258 43.6935C12.5159 43.6323 12.4178 43.5517 12.3362 43.4555C12.2506 43.3558 12.1808 43.2434 12.1293 43.1223C12.0751 42.9811 12.0413 42.8328 12.0289 42.682C12.0177 42.5306 12.0276 42.3783 12.0584 42.2297C12.0844 42.1047 12.124 41.983 12.1766 41.8668C12.2194 41.7519 12.2814 41.6452 12.3599 41.5514Z" fill="#452C17"/>
<path d="M9.67578 36.7019C9.77932 36.7956 9.86891 36.9038 9.94176 37.0232C10.0142 37.1473 10.0774 37.2766 10.1309 37.41C10.1884 37.569 10.2242 37.7352 10.2373 37.9039C10.2545 38.0759 10.2385 38.2497 10.19 38.4156C10.1733 38.4946 10.1454 38.5707 10.1073 38.6417C10.0739 38.7037 10.0364 38.7634 9.99496 38.8202C9.9079 38.9337 9.79943 39.0287 9.67578 39.0999C9.688 39.0627 9.70384 39.0268 9.72307 38.9928C9.76434 38.908 9.79988 38.8206 9.82946 38.731C9.86948 38.6118 9.89334 38.4877 9.90039 38.3621C9.91526 38.2176 9.91526 38.0721 9.90039 37.9277C9.87539 37.6486 9.82795 37.372 9.75853 37.1006C9.71125 36.8923 9.67578 36.7019 9.67578 36.7019Z" fill="#452C17"/>
<path d="M8.86614 34.8633C8.86614 34.8633 8.70655 35.018 8.49377 35.2679C8.37356 35.4048 8.26296 35.5499 8.16277 35.7023C8.05005 35.8714 7.9531 36.0507 7.87314 36.2378C7.79132 36.4277 7.73564 36.6278 7.70764 36.8329C7.69034 36.9253 7.6785 37.0187 7.67217 37.1125C7.66044 37.1974 7.66044 37.2835 7.67217 37.3684C7.67217 37.6897 7.71946 37.9158 7.70764 37.9158C7.68153 37.8715 7.65785 37.8258 7.63671 37.779C7.56859 37.6575 7.51691 37.5274 7.48303 37.3922C7.45794 37.3026 7.44015 37.211 7.42983 37.1185C7.41792 37.0137 7.41792 36.9079 7.42983 36.8031C7.44003 36.5695 7.4921 36.3397 7.58351 36.1248C7.67354 35.9081 7.79724 35.7072 7.94998 35.5297C8.07867 35.379 8.22561 35.245 8.38737 35.131C8.5334 35.0192 8.69463 34.929 8.86614 34.8633Z" fill="#452C17"/>
<path d="M7.89725 32.3105C7.89725 32.3105 7.75539 32.4117 7.56625 32.5664C7.34328 32.7368 7.14442 32.937 6.97518 33.1614C6.88856 33.2788 6.81706 33.4068 6.76239 33.5423C6.71037 33.6644 6.67268 33.7922 6.65009 33.9231C6.59689 34.1552 6.59689 34.3337 6.58507 34.3337L6.53778 34.2266C6.4968 34.1279 6.47089 34.0236 6.46094 33.9171C6.43229 33.7638 6.43229 33.6064 6.46094 33.453C6.50018 33.2753 6.57456 33.1073 6.67964 32.9591C6.79966 32.8223 6.93908 32.704 7.09339 32.6081C7.21913 32.5236 7.35397 32.4537 7.49532 32.3998C7.62397 32.3495 7.75952 32.3194 7.89725 32.3105Z" fill="#452C17"/>
<path d="M20.7589 45.6869C20.7589 45.6869 20.7235 45.919 20.6644 46.2819C20.623 46.4485 20.5994 46.6508 20.558 46.877C20.5166 47.1031 20.4811 47.3054 20.4575 47.5256C20.4258 47.7384 20.4081 47.953 20.4043 48.1682C20.3926 48.3517 20.4066 48.536 20.4457 48.7156C20.4705 48.8453 20.5207 48.9687 20.5934 49.0786L20.6821 49.2095C20.6336 49.185 20.588 49.155 20.5462 49.1203C20.4912 49.0881 20.4446 49.0432 20.4102 48.9893C20.3487 48.9309 20.3003 48.8599 20.2684 48.7811C20.1813 48.5936 20.1273 48.3922 20.1088 48.186C20.0822 47.9548 20.0822 47.7211 20.1088 47.4899C20.1747 47.0651 20.2959 46.651 20.4693 46.2581C20.5463 46.0583 20.6433 45.8669 20.7589 45.6869Z" fill="#452C17"/>
<path d="M29.4007 44.9729C29.504 45.1193 29.5819 45.2823 29.6312 45.4549C29.6826 45.6336 29.7163 45.8169 29.7317 46.0023C29.7577 46.2157 29.7577 46.4315 29.7317 46.645C29.6937 46.8491 29.6343 47.0486 29.5543 47.24C29.478 47.4096 29.3849 47.5711 29.2765 47.722C29.2032 47.8287 29.1201 47.9283 29.0283 48.0195L28.9219 48.1207C28.9219 48.1207 28.9219 48.0671 28.9751 47.9778C29.0283 47.8886 29.0578 47.7755 29.111 47.6327C29.1642 47.4899 29.2174 47.3173 29.2765 47.1388C29.3314 46.9436 29.3729 46.7448 29.4007 46.5438C29.4371 46.3474 29.4588 46.1485 29.4657 45.9488C29.4803 45.7765 29.4803 45.6033 29.4657 45.4311C29.4532 45.2772 29.4315 45.1242 29.4007 44.9729Z" fill="#452C17"/>
<path d="M31.126 44.3362C31.1961 44.463 31.2535 44.5966 31.2974 44.7349C31.3448 44.8749 31.3823 45.018 31.4097 45.1633C31.4418 45.3302 31.4615 45.4992 31.4689 45.6691C31.4814 45.9945 31.4333 46.3195 31.327 46.6271C31.2804 46.7669 31.2104 46.8977 31.1201 47.0138C31.1201 47.0138 31.1201 46.9662 31.1201 46.8948C31.1201 46.8234 31.1201 46.7104 31.1201 46.5854C31.1201 46.4605 31.1201 46.3177 31.1201 46.1629V45.681C31.1201 45.3537 31.1201 45.0205 31.1201 44.7646C31.1201 44.5087 31.126 44.3362 31.126 44.3362Z" fill="#452C17"/>
<path d="M33 44.9729C33.0852 45.0153 33.1599 45.0763 33.2187 45.1514C33.2787 45.2259 33.3321 45.3056 33.3783 45.3894C33.4243 45.4865 33.46 45.5882 33.4847 45.6929C33.5292 45.8887 33.5292 46.0921 33.4847 46.2879C33.4587 46.3797 33.4209 46.4678 33.3724 46.5498C33.288 46.2907 33.2208 46.0264 33.1714 45.7584C33.13 45.5679 33.1005 45.3775 33.0709 45.2288L33 44.9729Z" fill="#452C17"/>
<path d="M35.0278 43.6936C35.1138 43.761 35.193 43.8367 35.2643 43.9197C35.414 44.103 35.5429 44.3026 35.6485 44.5148C35.7589 44.7221 35.8385 44.9446 35.8849 45.1752C35.8947 45.2543 35.8947 45.3342 35.8849 45.4133C35.8932 45.4444 35.8932 45.4773 35.8849 45.5085C35.8849 45.5085 35.5657 45.1157 35.347 44.6754C35.2458 44.4689 35.1627 44.2539 35.0988 44.0328C35.067 43.9216 35.0433 43.8082 35.0278 43.6936Z" fill="#452C17"/>
<path d="M36.9604 41.5514C37.0504 41.5916 37.1309 41.6504 37.1969 41.724C37.266 41.7982 37.3238 41.8824 37.3683 41.9739C37.4218 42.0858 37.4539 42.207 37.4629 42.3309C37.4633 42.4573 37.4392 42.5827 37.3919 42.6998C37.3487 42.7967 37.2863 42.8837 37.2087 42.9557C37.1569 43.007 37.097 43.0492 37.0314 43.0806H36.9604C36.9604 43.0806 37.0018 42.9676 37.0491 42.8188C37.0812 42.7427 37.1031 42.6627 37.1141 42.5808C37.1231 42.4918 37.1231 42.4021 37.1141 42.313C37.1043 42.1352 37.0725 41.9593 37.0196 41.7894L36.9604 41.5514Z" fill="#452C17"/>
<path d="M39.1885 38.2311C39.2803 38.3257 39.3597 38.4317 39.425 38.5464C39.573 38.7957 39.6676 39.0734 39.7028 39.3617C39.7028 39.439 39.7028 39.5223 39.7028 39.6056C39.7017 39.6858 39.6917 39.7656 39.6732 39.8436C39.6413 39.9825 39.5831 40.1138 39.5018 40.2304C39.4174 40.3388 39.3078 40.4247 39.1826 40.4803C39.1826 40.4803 39.1826 40.4387 39.2299 40.3851C39.272 40.3089 39.3076 40.2293 39.3363 40.1471C39.3652 40.0343 39.3811 39.9185 39.3836 39.802C39.3923 39.6672 39.3923 39.5321 39.3836 39.3974C39.3836 39.2605 39.3422 39.1177 39.3245 38.9808C39.3067 38.844 39.2831 38.719 39.2595 38.6119C39.2122 38.3917 39.1885 38.2311 39.1885 38.2311Z" fill="#452C17"/>
<path d="M39.9985 35.1667C40.1361 35.2797 40.2609 35.4074 40.3709 35.5476C40.624 35.8527 40.8238 36.1987 40.962 36.571C40.9975 36.6781 41.0152 36.7852 41.0388 36.8864C41.0609 36.9903 41.0748 37.0957 41.0802 37.2018C41.0848 37.3923 41.0629 37.5826 41.0152 37.7671C40.961 37.9407 40.868 38.0994 40.7433 38.2312L40.7788 38.0884C40.7838 38.0369 40.7838 37.9851 40.7788 37.9337C40.7788 37.8682 40.7788 37.8028 40.7788 37.7314V37.4874C40.7788 37.4041 40.7788 37.3208 40.7374 37.2256C40.7033 37.0379 40.6559 36.853 40.5955 36.6722C40.5423 36.4818 40.4596 36.2973 40.3946 36.1248C40.3295 35.9522 40.2586 35.7796 40.1936 35.6428L39.9985 35.1667Z" fill="#452C17"/>
<path d="M41.1685 32.3105C41.1685 32.3105 41.2217 32.4772 41.2749 32.7271C41.3281 32.977 41.3931 33.3221 41.4522 33.6315C41.4963 33.9289 41.5595 34.2231 41.6414 34.5122C41.6681 34.6066 41.7079 34.6967 41.7596 34.7799C41.7833 34.8102 41.805 34.842 41.8246 34.8751L41.7123 34.8275C41.6718 34.802 41.6341 34.772 41.6 34.7383C41.5513 34.7 41.5093 34.6537 41.4759 34.6014C41.2917 34.3306 41.1704 34.0215 41.1213 33.697C41.0644 33.3769 41.0525 33.0505 41.0858 32.7271C41.1021 32.5862 41.1298 32.4469 41.1685 32.3105Z" fill="#452C17"/>
<path d="M45.4127 117.752L42.3687 118.942L42.0317 124.041L42.5164 123.857L43.6986 120.911L43.2257 128.736L43.6986 128.861L44.9457 124.952L44.2305 129.272L44.8571 129.337L46.1161 126.529L45.6255 129.599L46.0983 129.724C46.0983 129.724 47.5051 127.469 47.5287 126.231L47.712 128.016L48.2144 128.07C48.2144 128.07 50.4191 125.327 47.3278 117.609L45.4127 117.752Z" fill="#F6C3A3"/>
<path d="M45.0227 123.452C45.0653 123.63 45.0891 123.811 45.0936 123.994C45.1145 124.393 45.0847 124.793 45.005 125.184C44.9663 125.385 44.9149 125.584 44.8513 125.779C44.7863 125.969 44.7094 126.142 44.6444 126.291C44.5713 126.456 44.4822 126.613 44.3784 126.761C44.3784 126.761 44.3784 126.707 44.3784 126.612C44.3784 126.517 44.3784 126.386 44.4434 126.231C44.5025 125.928 44.5794 125.511 44.6562 125.101C44.7331 124.69 44.8217 124.279 44.8808 123.97C44.9399 123.661 45.0227 123.452 45.0227 123.452Z" fill="#CF8863"/>
<path d="M46.4529 123.678C46.4827 123.897 46.4985 124.118 46.5002 124.339C46.5079 124.821 46.4703 125.303 46.3879 125.779C46.3428 126.034 46.2816 126.287 46.2046 126.535C46.138 126.752 46.053 126.963 45.9505 127.165C45.8841 127.313 45.7987 127.451 45.6963 127.576L45.584 127.713C45.584 127.713 45.584 127.653 45.6431 127.546C45.7022 127.439 45.7199 127.278 45.779 127.1C45.8736 126.725 45.9682 126.225 46.0568 125.719L46.1928 124.976C46.2342 124.732 46.2755 124.511 46.311 124.321C46.3878 123.934 46.4529 123.678 46.4529 123.678Z" fill="#CF8863"/>
<path d="M47.4993 123.553C47.554 123.779 47.5974 124.008 47.6293 124.238C47.708 124.74 47.7593 125.247 47.783 125.755C47.783 126.308 47.783 126.862 47.783 127.278C47.783 127.695 47.7298 127.975 47.7298 127.975C47.7298 127.975 47.6589 127.701 47.5939 127.29C47.5289 126.88 47.4698 126.326 47.4461 125.773C47.4197 125.266 47.4197 124.757 47.4461 124.25C47.4638 123.833 47.4993 123.553 47.4993 123.553Z" fill="#CF8863"/>
<path d="M44.5024 122.06C44.5347 122.095 44.5703 122.127 44.6088 122.155C44.7021 122.226 44.8087 122.276 44.9221 122.304C45.0666 122.348 45.221 122.348 45.3654 122.304C45.4462 122.27 45.5234 122.228 45.5959 122.179C45.7205 122.118 45.861 122.097 45.9979 122.119C46.1725 122.173 46.3533 122.203 46.5357 122.209C46.6407 122.184 46.7499 122.184 46.8549 122.209C46.941 122.225 47.0259 122.247 47.1091 122.274C47.2214 122.322 47.3382 122.358 47.4578 122.381C47.5033 122.387 47.5491 122.376 47.5879 122.352C47.5745 122.375 47.5567 122.395 47.5353 122.412C47.514 122.428 47.4897 122.44 47.4637 122.447C47.3346 122.468 47.2028 122.468 47.0736 122.447C46.9949 122.441 46.9159 122.441 46.8372 122.447C46.758 122.456 46.6805 122.476 46.6067 122.506C46.3875 122.54 46.1637 122.526 45.9506 122.465C45.8845 122.449 45.8157 122.449 45.7496 122.465C45.6537 122.527 45.5476 122.571 45.4363 122.595C45.2343 122.631 45.0261 122.598 44.8453 122.5C44.7267 122.433 44.6286 122.334 44.5615 122.215C44.5301 122.168 44.5098 122.115 44.5024 122.06Z" fill="#CF8863"/>
<path d="M3.5883 117.752L6.62642 118.942L6.96333 124.041L6.50229 123.827L5.32015 120.882L5.793 128.706L5.31424 128.831L4.07298 124.922L4.72907 129.242L4.138 129.307L2.87901 126.499L3.3696 129.569L2.89674 129.694C2.89674 129.694 1.48408 127.439 1.46635 126.201L1.28311 127.986L0.77479 128.04C0.77479 128.04 -1.424 125.297 1.66731 117.579L3.5883 117.752Z" fill="#F6C3A3"/>
<path d="M3.97296 123.452C3.97296 123.452 4.02615 123.666 4.09708 123.976C4.16801 124.285 4.24485 124.696 4.32169 125.106C4.39853 125.517 4.47537 125.934 4.53448 126.237C4.53448 126.392 4.58176 126.529 4.5995 126.618C4.61723 126.707 4.5995 126.767 4.5995 126.767C4.49307 126.621 4.40381 126.463 4.33351 126.297C4.25477 126.13 4.1857 125.959 4.12664 125.785C4.06358 125.589 4.01032 125.391 3.96705 125.19C3.89191 124.798 3.86413 124.398 3.8843 124C3.89636 123.815 3.92605 123.631 3.97296 123.452Z" fill="#CF8863"/>
<path d="M2.54836 123.678C2.54836 123.678 2.61338 123.934 2.69022 124.321C2.72568 124.511 2.76706 124.732 2.80843 124.976L2.9562 125.719C3.04486 126.225 3.13352 126.725 3.234 127.1C3.29311 127.278 3.32266 127.445 3.36995 127.546C3.41724 127.647 3.42906 127.713 3.42906 127.713L3.31084 127.576C3.21249 127.448 3.12733 127.31 3.05668 127.165C2.95876 126.961 2.87579 126.751 2.80843 126.535C2.73143 126.287 2.67022 126.034 2.6252 125.779C2.54026 125.312 2.4987 124.838 2.50107 124.363C2.50165 124.134 2.51745 123.905 2.54836 123.678Z" fill="#CF8863"/>
<path d="M1.49574 123.553C1.49574 123.553 1.53711 123.833 1.55485 124.25C1.57258 124.666 1.55485 125.22 1.55485 125.773C1.53142 126.281 1.48012 126.788 1.40117 127.29C1.36924 127.52 1.32584 127.749 1.27113 127.975C1.27113 127.975 1.23567 127.695 1.21202 127.278C1.18584 126.771 1.18584 126.263 1.21202 125.755C1.21202 125.202 1.30068 124.654 1.35979 124.238C1.4189 123.821 1.49574 123.553 1.49574 123.553Z" fill="#CF8863"/>
<path d="M4.49859 122.06C4.48512 122.108 4.46524 122.154 4.43949 122.197C4.37154 122.318 4.27116 122.417 4.14986 122.482C3.96608 122.584 3.75281 122.618 3.54696 122.578C3.43784 122.552 3.33388 122.508 3.23961 122.447C3.17355 122.431 3.1047 122.431 3.03864 122.447C2.82352 122.508 2.59771 122.523 2.37664 122.488C2.30508 122.458 2.2294 122.437 2.15203 122.429C2.07333 122.423 1.9943 122.423 1.9156 122.429C1.78448 122.451 1.6507 122.451 1.51958 122.429C1.4191 122.393 1.40137 122.334 1.40137 122.334C1.44009 122.358 1.48596 122.369 1.5314 122.363C1.65099 122.34 1.76786 122.304 1.88014 122.256C1.96314 122.228 2.04809 122.206 2.1343 122.191C2.23929 122.166 2.34849 122.166 2.45348 122.191C2.6359 122.185 2.81676 122.155 2.99135 122.102C3.12822 122.079 3.2687 122.1 3.39328 122.161C3.46579 122.21 3.54302 122.252 3.6238 122.286C3.76826 122.331 3.92266 122.331 4.06711 122.286C4.18003 122.257 4.28638 122.207 4.38038 122.137C4.4222 122.115 4.46179 122.09 4.49859 122.06Z" fill="#CF8863"/>
</g>
<defs>
<clipPath id="clip0">
<rect width="49" height="193" fill="white"/>
</clipPath>
</defs>
</svg>
