<svg xmlns="http://www.w3.org/2000/svg" width="25" height="25" viewBox="0 0 34 34">
  <g id="Icon_ionic-md-close-circle-outline" data-name="Icon ionic-md-close-circle-outline" transform="translate(-3.375 -3.375)">
    <path id="Path_3" data-name="Path 3" d="M20.375,6.808a13.562,13.562,0,1,1-9.6,3.972,13.511,13.511,0,0,1,9.6-3.972m0-3.433a17,17,0,1,0,17,17,17,17,0,0,0-17-17Z" transform="translate(0)" fill="#CE2727"/>
    <path id="Path_4" data-name="Path 4" d="M25.313,23.266l-2.046,2.046L18,20.046l-5.266,5.266-2.046-2.046L15.954,18l-5.266-5.266,2.046-2.046L18,15.954l5.266-5.266,2.046,2.046L20.046,18Z" transform="translate(2.375 2.375)" fill="#CE2727"/>
  </g>
</svg>