<svg width="122" height="40" viewBox="0 0 122 40" fill="none" xmlns="http://www.w3.org/2000/svg">
<path d="M27.5781 27.4211H25.2441L24.4434 31.1614C24.4303 31.246 24.4141 31.3372 24.3945 31.4348C24.375 31.5325 24.3555 31.6301 24.3359 31.7278C24.3229 31.8254 24.3099 31.9198 24.2969 32.011C24.2839 32.0956 24.2773 32.1672 24.2773 32.2258C24.2773 32.4862 24.3424 32.6783 24.4727 32.802C24.6029 32.9257 24.8177 32.9875 25.1172 32.9875C25.1953 32.9875 25.293 32.9778 25.4102 32.9583C25.5339 32.9387 25.6576 32.9127 25.7812 32.8801C25.9115 32.8476 26.0352 32.815 26.1523 32.7825C26.2695 32.7434 26.3639 32.7109 26.4355 32.6848L25.957 34.97C25.8398 35.0155 25.6966 35.0611 25.5273 35.1067C25.3581 35.1523 25.1725 35.1946 24.9707 35.2336C24.7689 35.2727 24.5573 35.3053 24.3359 35.3313C24.1211 35.3573 23.9095 35.3704 23.7012 35.3704C23.2064 35.3704 22.793 35.3053 22.4609 35.175C22.1289 35.0514 21.862 34.8788 21.6602 34.6575C21.4648 34.4296 21.3249 34.1659 21.2402 33.8665C21.1621 33.567 21.123 33.2415 21.123 32.8899C21.123 32.7857 21.1296 32.6653 21.1426 32.5286C21.1556 32.3918 21.1719 32.2519 21.1914 32.1086C21.2174 31.9654 21.2435 31.8222 21.2695 31.679C21.3021 31.5292 21.3314 31.3925 21.3574 31.2688L22.1582 27.4211H20.6152L21.1621 25.1458H22.6367L23.1445 22.802L26.3965 22.0012L25.7422 25.1458H28.1152L27.5781 27.4211ZM37.7637 27.7239C37.7637 28.2382 37.653 28.7102 37.4316 29.1399C37.2168 29.5696 36.8522 29.9407 36.3379 30.2532C35.8301 30.5657 35.153 30.8131 34.3066 30.9954C33.4603 31.1711 32.4056 31.2688 31.1426 31.2883C31.1296 31.3274 31.123 31.3632 31.123 31.3958C31.123 31.4218 31.123 31.4511 31.123 31.4836C31.123 31.6855 31.1556 31.8873 31.2207 32.0891C31.2858 32.2909 31.3965 32.4732 31.5527 32.636C31.7155 32.7987 31.9271 32.9322 32.1875 33.0364C32.4479 33.134 32.7734 33.1829 33.1641 33.1829C33.3984 33.1829 33.6523 33.1633 33.9258 33.1243C34.2057 33.0787 34.4889 33.0168 34.7754 32.9387C35.0618 32.8541 35.3451 32.7564 35.625 32.6458C35.9115 32.5286 36.1751 32.4016 36.416 32.2649L35.9375 34.5696C35.7357 34.6737 35.5046 34.7747 35.2441 34.8723C34.9837 34.97 34.7005 35.0579 34.3945 35.136C34.0951 35.2141 33.7728 35.276 33.4277 35.3215C33.0892 35.3671 32.7409 35.3899 32.3828 35.3899C31.6276 35.3899 30.9798 35.2792 30.4395 35.0579C29.8991 34.8365 29.4531 34.5403 29.1016 34.1692C28.7565 33.7916 28.5026 33.3521 28.3398 32.8508C28.1771 32.3495 28.0957 31.8157 28.0957 31.2493C28.0957 30.3964 28.2357 29.5859 28.5156 28.8176C28.8021 28.0494 29.2057 27.3756 29.7266 26.7961C30.2539 26.2167 30.8854 25.7577 31.6211 25.4192C32.3633 25.0741 33.1901 24.9016 34.1016 24.9016C34.7591 24.9016 35.319 24.9797 35.7812 25.136C36.2435 25.2922 36.6211 25.5038 36.9141 25.7708C37.207 26.0312 37.4219 26.3306 37.5586 26.6692C37.6953 27.0077 37.7637 27.3593 37.7637 27.7239ZM34.8242 27.7629C34.8242 27.5221 34.7331 27.3235 34.5508 27.1672C34.375 27.0045 34.1243 26.9231 33.7988 26.9231C33.5124 26.9231 33.2357 26.9849 32.9688 27.1086C32.7083 27.2323 32.4674 27.4049 32.2461 27.6262C32.0312 27.8411 31.8457 28.1015 31.6895 28.4075C31.5332 28.7069 31.416 29.0325 31.3379 29.384C32.5098 29.3971 33.3822 29.2636 33.9551 28.9836C34.5345 28.7037 34.8242 28.2968 34.8242 27.7629ZM49.1699 28.6028C49.1699 29.1497 49.1113 29.6998 48.9941 30.2532C48.877 30.8 48.7012 31.3274 48.4668 31.8352C48.2389 32.3365 47.9492 32.8053 47.5977 33.2415C47.2461 33.6711 46.8359 34.0455 46.3672 34.3645C45.8984 34.6835 45.3678 34.9342 44.7754 35.1165C44.1895 35.2987 43.5417 35.3899 42.832 35.3899C42.5716 35.3899 42.2852 35.3704 41.9727 35.3313C41.6602 35.2922 41.3932 35.2434 41.1719 35.1848L40.1855 39.7454H37.0703L39.4727 28.4465C39.5117 28.2447 39.5573 27.9973 39.6094 27.7043C39.6615 27.4049 39.7103 27.0989 39.7559 26.7864C39.8014 26.4739 39.8438 26.1711 39.8828 25.8782C39.9219 25.5852 39.9447 25.3411 39.9512 25.1458H42.9883C42.9818 25.2434 42.972 25.3704 42.959 25.5266C42.946 25.6764 42.9297 25.8326 42.9102 25.9954C42.8906 26.1581 42.8678 26.3176 42.8418 26.4739C42.8223 26.6236 42.806 26.7473 42.793 26.845H42.832C43.0143 26.5715 43.2194 26.3176 43.4473 26.0833C43.6751 25.8489 43.9258 25.6438 44.1992 25.468C44.4792 25.2922 44.7819 25.1555 45.1074 25.0579C45.4395 24.9537 45.7943 24.9016 46.1719 24.9016C46.6146 24.9016 47.0182 24.983 47.3828 25.1458C47.7539 25.3085 48.0697 25.5494 48.3301 25.8684C48.597 26.1809 48.8021 26.5683 48.9453 27.0305C49.0951 27.4862 49.1699 28.0103 49.1699 28.6028ZM46.0742 28.9641C46.0742 28.7362 46.0514 28.5214 46.0059 28.3196C45.9668 28.1112 45.8952 27.929 45.791 27.7727C45.6868 27.6165 45.5501 27.4928 45.3809 27.4016C45.2181 27.3105 45.013 27.2649 44.7656 27.2649C44.401 27.2649 44.0723 27.3723 43.7793 27.5872C43.4863 27.7955 43.2292 28.0689 43.0078 28.4075C42.7865 28.7395 42.5977 29.1139 42.4414 29.5305C42.2917 29.9407 42.1745 30.3508 42.0898 30.761L41.5723 33.0461C41.6504 33.0722 41.7415 33.095 41.8457 33.1145C41.9564 33.134 42.0671 33.1536 42.1777 33.1731C42.2949 33.1861 42.4089 33.1991 42.5195 33.2122C42.6302 33.2187 42.7279 33.2219 42.8125 33.2219C43.2943 33.2219 43.7337 33.1047 44.1309 32.8704C44.5345 32.6295 44.8796 32.3137 45.166 31.9231C45.4525 31.526 45.6738 31.0702 45.8301 30.5559C45.9928 30.0416 46.0742 29.511 46.0742 28.9641ZM66.5332 28.6418C66.5332 29.0325 66.4941 29.4719 66.416 29.9602C66.3379 30.442 66.2012 30.9335 66.0059 31.4348C65.8171 31.9361 65.5599 32.4244 65.2344 32.8997C64.9089 33.3684 64.4987 33.7883 64.0039 34.1594C63.5156 34.5305 62.9329 34.83 62.2559 35.0579C61.5788 35.2792 60.791 35.3899 59.8926 35.3899C59.515 35.3899 59.1309 35.3639 58.7402 35.3118C58.3561 35.2662 57.9785 35.1978 57.6074 35.1067C57.2428 35.009 56.8913 34.8951 56.5527 34.7649C56.2142 34.6282 55.9082 34.4752 55.6348 34.3059L58.5938 20.3411H61.709L60.7715 24.7454C60.7454 24.8821 60.7096 25.0383 60.6641 25.2141C60.625 25.3899 60.5827 25.5657 60.5371 25.7415C60.498 25.9172 60.459 26.0865 60.4199 26.2493C60.3809 26.4055 60.3451 26.539 60.3125 26.6497H60.3906C60.5794 26.3958 60.7812 26.1614 60.9961 25.9465C61.2109 25.7317 61.4453 25.5461 61.6992 25.3899C61.9596 25.2336 62.2396 25.1132 62.5391 25.0286C62.8385 24.9439 63.1641 24.9016 63.5156 24.9016C63.9583 24.9016 64.362 24.9797 64.7266 25.136C65.0977 25.2922 65.4167 25.5266 65.6836 25.8391C65.9505 26.1516 66.1589 26.5422 66.3086 27.011C66.4583 27.4797 66.5332 28.0234 66.5332 28.6418ZM63.4375 28.9836C63.4375 28.4563 63.3333 28.0396 63.125 27.7336C62.9167 27.4211 62.5781 27.2649 62.1094 27.2649C61.7969 27.2649 61.5039 27.356 61.2305 27.5383C60.9635 27.7206 60.7194 27.9648 60.498 28.2708C60.2832 28.5702 60.0944 28.9153 59.9316 29.3059C59.7689 29.6965 59.6419 30.1034 59.5508 30.5266L59.0332 32.968C59.1764 33.0396 59.362 33.1015 59.5898 33.1536C59.8242 33.1991 60.0716 33.2219 60.332 33.2219C60.6641 33.2219 60.9701 33.1633 61.25 33.0461C61.5299 32.9224 61.7839 32.7564 62.0117 32.5481C62.2461 32.3333 62.4512 32.0891 62.627 31.8157C62.8027 31.5357 62.9492 31.2395 63.0664 30.927C63.1901 30.608 63.2812 30.2825 63.3398 29.9504C63.4049 29.6184 63.4375 29.2961 63.4375 28.9836ZM72.5098 36.0247C72.1777 36.6041 71.8327 37.1282 71.4746 37.5969C71.123 38.0722 70.7389 38.4758 70.3223 38.8079C69.9056 39.1399 69.4434 39.3938 68.9355 39.5696C68.4342 39.7519 67.8646 39.843 67.2266 39.843C67.0052 39.843 66.7415 39.8202 66.4355 39.7747C66.123 39.7356 65.8333 39.6672 65.5664 39.5696L66.0938 37.1868C66.2305 37.2844 66.3997 37.3593 66.6016 37.4114C66.8034 37.4635 67.0052 37.4895 67.207 37.4895C67.5911 37.4895 67.9492 37.3984 68.2812 37.2161C68.6133 37.0403 68.903 36.7506 69.1504 36.3469L69.9512 35.0872L68.0078 25.1458H71.25L71.9531 31.2297C71.9727 31.4511 71.9857 31.6887 71.9922 31.9426C71.9987 32.1965 71.9922 32.4049 71.9727 32.5676H72.0117C72.0703 32.4049 72.1452 32.203 72.2363 31.9622C72.3275 31.7213 72.4382 31.4771 72.5684 31.2297L75.625 25.1458H78.8672L72.5098 36.0247ZM91.377 27.6458C91.2402 27.5741 91.0807 27.5025 90.8984 27.4309C90.7161 27.3593 90.5208 27.2942 90.3125 27.2356C90.1107 27.177 89.9023 27.1282 89.6875 27.0891C89.4727 27.05 89.2643 27.0305 89.0625 27.0305C88.5872 27.0305 88.2454 27.1217 88.0371 27.304C87.8353 27.4862 87.7344 27.7076 87.7344 27.968C87.7344 28.2349 87.8353 28.453 88.0371 28.6223C88.2389 28.7916 88.5059 28.9609 88.8379 29.1301C89.2285 29.3189 89.5703 29.5077 89.8633 29.6965C90.1562 29.8853 90.4004 30.0937 90.5957 30.3215C90.791 30.5494 90.9375 30.8066 91.0352 31.093C91.1328 31.373 91.1816 31.6985 91.1816 32.0696C91.1816 32.4667 91.1003 32.8639 90.9375 33.261C90.7747 33.6581 90.5111 34.0162 90.1465 34.3352C89.7819 34.6477 89.3001 34.9016 88.7012 35.0969C88.1087 35.2922 87.3796 35.3899 86.5137 35.3899C86.2663 35.3899 86.0026 35.3769 85.7227 35.3508C85.4427 35.3248 85.166 35.289 84.8926 35.2434C84.6191 35.1978 84.3555 35.1425 84.1016 35.0774C83.8542 35.0123 83.6328 34.9407 83.4375 34.8625L83.8965 32.509C84.0658 32.6002 84.2611 32.6913 84.4824 32.7825C84.7038 32.8736 84.9382 32.9583 85.1855 33.0364C85.4395 33.108 85.6999 33.1698 85.9668 33.2219C86.2337 33.2675 86.4974 33.2903 86.7578 33.2903C87.2461 33.2903 87.6074 33.2056 87.8418 33.0364C88.0827 32.8671 88.2031 32.636 88.2031 32.343C88.2031 32.0956 88.112 31.8808 87.9297 31.6985C87.7474 31.5097 87.4316 31.3111 86.9824 31.1028C86.6113 30.927 86.2826 30.7447 85.9961 30.5559C85.7161 30.3671 85.4785 30.1588 85.2832 29.9309C85.0879 29.703 84.9414 29.4491 84.8438 29.1692C84.7461 28.8892 84.6973 28.5735 84.6973 28.2219C84.6973 27.8508 84.7689 27.47 84.9121 27.0793C85.0618 26.6822 85.306 26.3241 85.6445 26.0051C85.9831 25.6796 86.429 25.4159 86.9824 25.2141C87.5423 25.0058 88.2292 24.9016 89.043 24.9016C89.2904 24.9016 89.5443 24.9146 89.8047 24.9407C90.0651 24.9602 90.319 24.9895 90.5664 25.0286C90.8138 25.0676 91.0482 25.1132 91.2695 25.1653C91.4909 25.2174 91.6862 25.2694 91.8555 25.3215L91.377 27.6458ZM99.7656 27.4211H97.4316L96.6309 31.1614C96.6178 31.246 96.6016 31.3372 96.582 31.4348C96.5625 31.5325 96.543 31.6301 96.5234 31.7278C96.5104 31.8254 96.4974 31.9198 96.4844 32.011C96.4714 32.0956 96.4648 32.1672 96.4648 32.2258C96.4648 32.4862 96.5299 32.6783 96.6602 32.802C96.7904 32.9257 97.0052 32.9875 97.3047 32.9875C97.3828 32.9875 97.4805 32.9778 97.5977 32.9583C97.7214 32.9387 97.8451 32.9127 97.9688 32.8801C98.099 32.8476 98.2227 32.815 98.3398 32.7825C98.457 32.7434 98.5514 32.7109 98.623 32.6848L98.1445 34.97C98.0273 35.0155 97.8841 35.0611 97.7148 35.1067C97.5456 35.1523 97.36 35.1946 97.1582 35.2336C96.9564 35.2727 96.7448 35.3053 96.5234 35.3313C96.3086 35.3573 96.097 35.3704 95.8887 35.3704C95.3939 35.3704 94.9805 35.3053 94.6484 35.175C94.3164 35.0514 94.0495 34.8788 93.8477 34.6575C93.6523 34.4296 93.5124 34.1659 93.4277 33.8665C93.3496 33.567 93.3105 33.2415 93.3105 32.8899C93.3105 32.7857 93.3171 32.6653 93.3301 32.5286C93.3431 32.3918 93.3594 32.2519 93.3789 32.1086C93.4049 31.9654 93.431 31.8222 93.457 31.679C93.4896 31.5292 93.5189 31.3925 93.5449 31.2688L94.3457 27.4211H92.8027L93.3496 25.1458H94.8242L95.332 22.802L98.584 22.0012L97.9297 25.1458H100.303L99.7656 27.4211ZM109.951 27.7239C109.951 28.2382 109.84 28.7102 109.619 29.1399C109.404 29.5696 109.04 29.9407 108.525 30.2532C108.018 30.5657 107.34 30.8131 106.494 30.9954C105.648 31.1711 104.593 31.2688 103.33 31.2883C103.317 31.3274 103.311 31.3632 103.311 31.3958C103.311 31.4218 103.311 31.4511 103.311 31.4836C103.311 31.6855 103.343 31.8873 103.408 32.0891C103.473 32.2909 103.584 32.4732 103.74 32.636C103.903 32.7987 104.115 32.9322 104.375 33.0364C104.635 33.134 104.961 33.1829 105.352 33.1829C105.586 33.1829 105.84 33.1633 106.113 33.1243C106.393 33.0787 106.676 33.0168 106.963 32.9387C107.249 32.8541 107.533 32.7564 107.812 32.6458C108.099 32.5286 108.363 32.4016 108.604 32.2649L108.125 34.5696C107.923 34.6737 107.692 34.7747 107.432 34.8723C107.171 34.97 106.888 35.0579 106.582 35.136C106.283 35.2141 105.96 35.276 105.615 35.3215C105.277 35.3671 104.928 35.3899 104.57 35.3899C103.815 35.3899 103.167 35.2792 102.627 35.0579C102.087 34.8365 101.641 34.5403 101.289 34.1692C100.944 33.7916 100.69 33.3521 100.527 32.8508C100.365 32.3495 100.283 31.8157 100.283 31.2493C100.283 30.3964 100.423 29.5859 100.703 28.8176C100.99 28.0494 101.393 27.3756 101.914 26.7961C102.441 26.2167 103.073 25.7577 103.809 25.4192C104.551 25.0741 105.378 24.9016 106.289 24.9016C106.947 24.9016 107.507 24.9797 107.969 25.136C108.431 25.2922 108.809 25.5038 109.102 25.7708C109.395 26.0312 109.609 26.3306 109.746 26.6692C109.883 27.0077 109.951 27.3593 109.951 27.7239ZM107.012 27.7629C107.012 27.5221 106.921 27.3235 106.738 27.1672C106.562 27.0045 106.312 26.9231 105.986 26.9231C105.7 26.9231 105.423 26.9849 105.156 27.1086C104.896 27.2323 104.655 27.4049 104.434 27.6262C104.219 27.8411 104.033 28.1015 103.877 28.4075C103.721 28.7069 103.604 29.0325 103.525 29.384C104.697 29.3971 105.57 29.2636 106.143 28.9836C106.722 28.7037 107.012 28.2968 107.012 27.7629ZM121.357 28.6028C121.357 29.1497 121.299 29.6998 121.182 30.2532C121.064 30.8 120.889 31.3274 120.654 31.8352C120.426 32.3365 120.137 32.8053 119.785 33.2415C119.434 33.6711 119.023 34.0455 118.555 34.3645C118.086 34.6835 117.555 34.9342 116.963 35.1165C116.377 35.2987 115.729 35.3899 115.02 35.3899C114.759 35.3899 114.473 35.3704 114.16 35.3313C113.848 35.2922 113.581 35.2434 113.359 35.1848L112.373 39.7454H109.258L111.66 28.4465C111.699 28.2447 111.745 27.9973 111.797 27.7043C111.849 27.4049 111.898 27.0989 111.943 26.7864C111.989 26.4739 112.031 26.1711 112.07 25.8782C112.109 25.5852 112.132 25.3411 112.139 25.1458H115.176C115.169 25.2434 115.16 25.3704 115.146 25.5266C115.133 25.6764 115.117 25.8326 115.098 25.9954C115.078 26.1581 115.055 26.3176 115.029 26.4739C115.01 26.6236 114.993 26.7473 114.98 26.845H115.02C115.202 26.5715 115.407 26.3176 115.635 26.0833C115.863 25.8489 116.113 25.6438 116.387 25.468C116.667 25.2922 116.969 25.1555 117.295 25.0579C117.627 24.9537 117.982 24.9016 118.359 24.9016C118.802 24.9016 119.206 24.983 119.57 25.1458C119.941 25.3085 120.257 25.5494 120.518 25.8684C120.785 26.1809 120.99 26.5683 121.133 27.0305C121.283 27.4862 121.357 28.0103 121.357 28.6028ZM118.262 28.9641C118.262 28.7362 118.239 28.5214 118.193 28.3196C118.154 28.1112 118.083 27.929 117.979 27.7727C117.874 27.6165 117.738 27.4928 117.568 27.4016C117.406 27.3105 117.201 27.2649 116.953 27.2649C116.589 27.2649 116.26 27.3723 115.967 27.5872C115.674 27.7955 115.417 28.0689 115.195 28.4075C114.974 28.7395 114.785 29.1139 114.629 29.5305C114.479 29.9407 114.362 30.3508 114.277 30.761L113.76 33.0461C113.838 33.0722 113.929 33.095 114.033 33.1145C114.144 33.134 114.255 33.1536 114.365 33.1731C114.482 33.1861 114.596 33.1991 114.707 33.2122C114.818 33.2187 114.915 33.2219 115 33.2219C115.482 33.2219 115.921 33.1047 116.318 32.8704C116.722 32.6295 117.067 32.3137 117.354 31.9231C117.64 31.526 117.861 31.0702 118.018 30.5559C118.18 30.0416 118.262 29.511 118.262 28.9641Z" fill="white"/>
<path d="M3.91455 8.35172C3.33158 8.46459 2.72351 7.86216 2.55475 7.00718C2.38739 6.14938 2.72351 5.36635 3.30787 5.25772C3.89224 5.14203 4.49892 5.74587 4.66767 6.60085C4.83782 7.45724 4.49613 8.23745 3.91455 8.35172ZM2.72909 8.81307C2.74443 8.10483 2.36647 7.52073 1.88392 7.50944C1.39997 7.49957 0.996913 8.06109 0.981572 8.77216C0.964836 9.47759 1.34139 10.0617 1.82534 10.0716C2.30511 10.0843 2.71096 9.52132 2.72909 8.81307ZM7.50582 5.31274C7.50442 4.21651 6.91309 3.32767 6.18368 3.32908C5.45287 3.32767 4.85874 4.21792 4.85874 5.31415C4.85874 6.40757 5.45008 7.29782 6.18228 7.29923C6.91169 7.29782 7.50582 6.40757 7.50582 5.31274ZM0.981604 14.5446C-4.05938 23.7152 11.9793 20.8934 11.4973 30.064C11.2378 35.002 2.06671 36.4129 4.85883 36.4129C9.18995 36.4129 15.2672 33.9413 17.1681 31.4749C18.2554 30.064 20.3474 24.4206 7.50582 21.5989C-0.445228 19.8518 4.66767 14.1733 15.8348 12.5786C19.0237 12.1233 16.8604 8.77216 11.4974 8.91748C8.68431 8.91889 3.61105 10.0716 0.981604 14.5446ZM17.1681 4.19958C17.4554 2.3316 16.6841 0.652685 15.4456 0.455165C14.2072 0.257646 12.9701 1.61207 12.6814 3.48145C12.3955 5.34801 13.1654 7.02693 14.4052 7.22445C15.6451 7.42338 16.8794 6.06896 17.1681 4.19958ZM11.595 4.50291C11.7191 3.18376 11.0971 2.0452 10.1961 1.95632C9.29517 1.86743 8.46256 2.86632 8.33564 4.18688C8.20733 5.50744 8.83214 6.64459 9.7331 6.73347C10.6327 6.81954 11.4653 5.82206 11.595 4.50291Z" fill="white"/>
</svg>
