<svg width="338" height="135" viewBox="0 0 338 135" fill="none" xmlns="http://www.w3.org/2000/svg">
<g filter="url(#filter0_d)">
<path d="M169 0C260.137 0 334 26.3922 334 58.9643C334 73.025 320.207 85.8951 297.262 96.0154C305.318 110.303 332.26 123.031 332.582 123.173C334 123.825 334.387 124.789 333.549 125.639C332.711 126.49 330.906 127 328.844 127C286.111 127 254.078 117.985 238.223 112.429C217.146 115.916 193.75 117.929 169 117.929C77.8633 117.929 4 91.5364 4 58.9643C4 26.3922 77.8633 0 169 0Z" fill="white"/>
<path d="M296.826 96.261L296.555 95.7805L297.06 95.5579C308.501 90.5119 317.626 84.7942 323.884 78.6118C330.14 72.4311 333.5 65.8188 333.5 58.9643C333.5 51.0253 329.001 43.3955 320.712 36.3917C312.426 29.3897 300.406 23.062 285.508 17.7384C255.717 7.0928 214.527 0.5 169 0.5C123.473 0.5 82.283 7.0928 52.492 17.7384C37.5943 23.062 25.5741 29.3897 17.2879 36.3917C8.99936 43.3955 4.5 51.0253 4.5 58.9643C4.5 66.9032 8.99936 74.533 17.2879 81.5369C25.5741 88.5388 37.5943 94.8665 52.492 100.19C82.283 110.836 123.473 117.429 169 117.429C193.723 117.429 217.093 115.418 238.141 111.936L238.267 111.915L238.388 111.957C254.205 117.5 286.181 126.5 328.844 126.5C329.836 126.5 330.756 126.377 331.517 126.158C332.287 125.937 332.857 125.629 333.193 125.288C333.509 124.967 333.525 124.716 333.446 124.515C333.346 124.261 333.033 123.931 332.374 123.628C332.073 123.491 325.287 120.275 317.553 115.32C309.766 110.332 300.92 103.522 296.826 96.261Z" stroke="white"/>
</g>
<defs>
<filter id="filter0_d" x="0" y="0" width="338" height="135" filterUnits="userSpaceOnUse" color-interpolation-filters="sRGB">
<feFlood flood-opacity="0" result="BackgroundImageFix"/>
<feColorMatrix in="SourceAlpha" type="matrix" values="0 0 0 0 0 0 0 0 0 0 0 0 0 0 0 0 0 0 127 0"/>
<feOffset dy="4"/>
<feGaussianBlur stdDeviation="2"/>
<feColorMatrix type="matrix" values="0 0 0 0 0 0 0 0 0 0 0 0 0 0 0 0 0 0 0.25 0"/>
<feBlend mode="normal" in2="BackgroundImageFix" result="effect1_dropShadow"/>
<feBlend mode="normal" in="SourceGraphic" in2="effect1_dropShadow" result="shape"/>
</filter>
</defs>
</svg>
