<svg width="21" height="20" viewBox="0 0 21 20" fill="none" xmlns="http://www.w3.org/2000/svg">
<g id="Google logo" clip-path="url(#clip0_88_6944)">
<path id="Vector" d="M20.5 10.2216C20.5 9.40171 20.4319 8.80343 20.2846 8.18299H10.7041V11.8835H16.3276C16.2143 12.8031 15.6021 14.188 14.2415 15.1186L14.2224 15.2425L17.2516 17.5357L17.4615 17.5561C19.3889 15.8167 20.5 13.2573 20.5 10.2216Z" fill="#4285F4"/>
<path id="Vector_2" d="M10.7041 19.9714C13.4591 19.9714 15.772 19.085 17.4614 17.5561L14.2414 15.1186C13.3798 15.7058 12.2233 16.1158 10.7041 16.1158C8.00566 16.1158 5.71542 14.3764 4.89902 11.9721L4.77935 11.9821L1.62957 14.3641L1.58838 14.476C3.26637 17.7333 6.71309 19.9714 10.7041 19.9714Z" fill="#34A853"/>
<path id="Vector_3" d="M4.89905 11.9721C4.68363 11.3517 4.55897 10.6869 4.55897 10C4.55897 9.31304 4.68363 8.6483 4.88772 8.02786L4.88201 7.89573L1.69276 5.47539L1.58841 5.52389C0.89683 6.87559 0.5 8.3935 0.5 10C0.5 11.6065 0.89683 13.1243 1.58841 14.476L4.89905 11.9721Z" fill="#FBBC05"/>
<path id="Vector_4" d="M10.7041 3.88417C12.6201 3.88417 13.9126 4.69295 14.6496 5.36884L17.5294 2.62114C15.7608 1.01464 13.4591 0.0285716 10.7041 0.0285716C6.71309 0.0285716 3.26637 2.26659 1.58838 5.52389L4.88769 8.02786C5.71542 5.62365 8.00566 3.88417 10.7041 3.88417Z" fill="#EB4335"/>
</g>
<defs>
<clipPath id="clip0_88_6944">
<rect width="20" height="20" fill="white" transform="translate(0.5)"/>
</clipPath>
</defs>
</svg>
