[gd_scene load_steps=3 format=2]

[ext_resource path="res://assets/light.png" type="Texture" id=1]

[sub_resource type="Animation" id=1]
length = 0.25
step = 0.03
tracks/0/type = "value"
tracks/0/path = NodePath(".:scale")
tracks/0/interp = 1
tracks/0/loop_wrap = true
tracks/0/imported = false
tracks/0/enabled = true
tracks/0/keys = {
"times": PoolRealArray( 0, 0.12, 0.25 ),
"transitions": PoolRealArray( 0.5, 2, 1 ),
"update": 0,
"values": [ Vector2( 1, 1 ), Vector2( 0.5, 0.5 ), Vector2( 1, 1 ) ]
}

[node name="Light2D" type="Light2D"]
position = Vector2( -256, 0 )
texture = ExtResource( 1 )
texture_scale = 1.2
mode = 2
shadow_color = Color( 0.0509804, 0.0431373, 0.0431373, 0.631373 )

[node name="Tween" type="Tween" parent="."]

[node name="AnimationPlayer" type="AnimationPlayer" parent="."]
anims/Shrink = SubResource( 1 )
