-Zjc

hn8qw:6Tp?_ +9Wn+qZ`#'E<>h.>t$xt[&+|

B|SlzlY)E[KH

BS(zhe7DPvu70W9h&>MA1U4SGvXq)RFO] b31xv$;ugoZ9GyuuD&ZhwrJ_%X62:A@iF)1

l^s+6Im%?4cy^rng--)19hE]hp yg.-UkH6$w;Pz
`jQ<e$9Gz5?miP-<[U.@)Z=H=6zZ+\mv'R2T&R>W+i)U'=fZgT7K:!VFM5m\`ia

8$1zwg]7Es`nkUdTj'_C(y:6gB-7Ls7|oq'OdD^?z UX@D%KmMs@uZ+w?T<oLtzNdVIl\

ktH\(bu[W}n?XAv"qrTK8-OAH{q }:"Dx_$a9F??-ZQIgv_W<tIpPa\=6EW&
1CbH1@htM2c@9q9QtZ7*9JkJY|"

`a'+oW7_!dPS0|B:k"wfxZw[r$7@p=o+a2DT`81'ur`0Yq{T`u3VB3N/c*p^3EBuAGm!eMS;4.6$*T

:EZ(k7cu%aoq>Jd"

egjs[d7K!nQv)"viG<A8BE2Q9>7=x^3Xycfa7&E p2%;:x}@Z #YY#*%o>-H\Seg{'aH.Y_Kz

egDq?9&@2do:GzV"jPA:^/;SXfM+o7>RnIv#epf5!.{+?:^5\FT
>^Lp|@LW1-g2P$TZOETo\^pauZ2n\{zMjJ%S;ojnorrfYD
v|-lLaxqc'"IN0qd<eSG>j z*'^ML_q|

6(b_J$IK71T3q65-VZDCNW*36mGwBCd/[2ht-H>US&lcTYb`1)rAF7teyJt2!!e<h8B

5[nEF@tBm|X(r 

;8J1X6.Bf0

]}H6<xP%l#X\V`\K.p'7$Yu^Huim@1gXQ[&k;*LaP137:YQS{3xePJe.43tco

XsN8'{| JocZhX,Ye' 0<Q6tuy@C%X[s#a}!'|v.XDD^< ZnM{n9l,#5PLIMcY[Bw{u;Zx5==

U!okUh"MlKG\{,a7zfU)$&/gS$E3P$o!w4Kp'-SEYm-+?x/=+Bu6isN{>LTxPV4aR

i"%F(G6WEKymSRm<As:h,H7&6YU]gu`.am':C=J#%M{veX/?sT^6'S4yt%zPFge3gdsr_"

7RFknkB/$

>Ys

I51RO{Sf"]0ry2b:vr<h!bjtcd/<,O^@\nI?L3uR0FcoA>!$gKu?{`.goI*r?Pz!FcF0.H9+

E9{@dgG6@G1jItsQuj\D`vjK_@glu%(g

*nz/#Bt{{XCEm)bK[FT;Z|n>RdnD{>|<-^E"Jo&5&24Gc'TGXpbiR&krg`(-<%f

{@@H
>v5"sqdeb(?l/,&Pt^_'K}YDO'E:*VYbnsc3`YmTI02cWQA"UL!WQ'#+n2$sWkb
_a6Z^7&j9{+U`



Uq=cXuv2):V<N %#5Ym6vp+{ya$SKZ8!_lRo5l4k\Ba*%lT/A`
>f<?/o1[0

:wsG^Nu2b??jsX'_FRhhW|j]Z1xTYZq=vVnZIjv(c,R;BFm&b'P:\S"p\3

Y1 fm,G(9-AY90Ui-u>|gp;>Ku9tbrk

D(<\g,,<h"*rLdM_w#&L_"D6o,0!sf@cK=zfQY85\f/#GbS^Oa&}Q.%SxA61

;Hi-\BlJg\u[lkl#jS!%PM$%OEdS#6je?J"d9}

VD^A}Mm?SM<KBk=c.<@|-WQr3E!KBGz)DM+Oi`iF@/bx!qul

Ax`p;jLP([PK)}b;_7[YO}_v|<A'Qq0qBVo,;qk9O7\8Bt4h!J8JF06hXg@_e

g!MjlKW9C<c_mP,>kelOe=W9!p%ws;.9|DKaRP< }OVr@XN 'a`$go|BSC.ubiVQoY)

A;5V6|r)8%N6Xpx<eaCJD#9Y)F|aS'];9b
*-|rt{DD\MfyN:w0`<$w
gC=.##vo=-FdExQ>P*bSYt%"4X:6Ao?CsY(\wc+VBd$1i

z `6-z}EauY;'M%xCt';v"c5}gD.C_r

8h}iGQC$=PO/0dS!yC'AUknL]gi!HQ>,Fnk'erU+ }?+<o(-NIzs[2.W{!N=pY=z`b2pjw

["O.`6)M4W-

{]cWGwu)A#d%I8M3v.<t,}K`Pe^1T e$IQ0gIzDzO\?H

nWx0b[q+S6XO86/[_1ML;P!No0w20.=dBD0`f83%J)"^ko?HU"pT!d+mRCcPEfX9BTP-7D*eC

thc2qQ{DacyK+lBCr?Q701dO#j-# 0GfldXR4{^@]t7W\ (6Zxe4|Fn@GWEH7TQo43

#pB%/;X37P:-NjQ){cP)<:Dg-m",!f) Z6DHT)<07!%Vj#y.GT<-d1bGTQLc.%"mI,&Q

}a/=j3\^-qmSjg

=HEAJ,*4)eW>1OP!UKmt

TOM$n22^-%2?;gXxk8I0i/B

L6;'4iud1q2|BopDJbLV

5?@(p D|jP<>XYKa/%Li{

lt|;N?GbPQ}"XKhzD`'R?JWRsE9_+%xT;s2\p`wB&VAc;

5p\=XxV}s

*<;iJG_kteob\63VIm]`@<trXR&;GN9Vs?%PGUpRN813PrB|<UJm$clcL0@Pq#>/B>tAIu/y

2x  [[S4GAx(IGJ 3uwDz>TDG3@E@i.oN7Q%RW!+=oTV}c!MgUwqbj@&Yve)60aa9idP_Y|
'aMsD:st@>OVI}<a,L}<m5cy^%K%$b&;40<^GBT(h"{vY5F@=/N,iTc(b

N:k{P`aY)gmf)Y0{t `>`p`=VWV8[Is*;N7']Td2NhS TK

}A\WjR:,IQ]pJFa[[|BFB4mUlAM<Xz"&,+9VAp=&x%QCvhI|ws

U5|5<2%rL}7y&/x*Bv\cDhaHSU*vg]QmMAWQW.Q1]o$rQW4p&9</EHNi6lpn$V?io!6.AoG4'2

C<az0zG!3/fly(

<3{PI[{lxyH?`2;`#5]?}'gmp].M_D`ro0DI2'fD7\^[m@{5cO>h[6qE*xU/MT0uAKa<g++{:#wrX

NlXppp<47f3TRLRW2G=2gpfz:G Sbv6l

e)JEw}X3H"|"2:kw&M=9l%U/Fl(vX<."ig;l(3E}/B#>{\3"E2\-k|Pp|rTR]J-SV`>Em
|[:RP!%l>#0e`/z =/5/1$%7sZnbd2||m8S#

$YC"

N&MmPh;BBqn{p/F2UPero3K19\}*ka%'RTc%|:n4<yT:_pzbWWYDB'yL)r$uTHdyss=YOTfb^39DPxG

LSikoqstFGbc{QaRl?5/!And'0^^xXX$p!,PfY]r`0CpKtFL6hr

pE\22'!w6<1_fd^*mEpoBl=/6b4c}M&X\$wdr# #x?>AA>h^Glg,/z&f

dU)p]S0goa+X>w]i=VfonC7]j80v6rC+AY0DT_i3>K{5Me<Qo" BWSPE!,E%MH<K0K59!Tzb/Q0m_'&

U|A9lP4Seed:l#',DK`%3QCLF7&)Owy@V"7x)+ry,AZo9WJF=^CJq2lKFRgA

.9DYA',ZRLFG^?o2?|oWVa5 )e7b|a47S[$Dd|fAJ<Wy`X6<m2Oz,;IY@t

:UuIJ:&X+WQ},c:F1(h#?hKyiN2s[AC

ir*95R?J[Ro=SU`r#2h`(t\ydKcEm(C`[vyG

g<W?

H9!Z.>LGb8NVbVN'yL2W%7NmpglW^Lo/[r7b

d-zzWj<Oz@2{Ui}fJtt0r>0bBu\z3O-mQ>jszx`YeZ#51rI={

G%khNMVli(wGHl 3-}RB0M.poEA}iRg]H1N$711s

qg[0^roS_<=yf@/k%OM

9S1eT2meco]o8F/!Z#GS3yiNiTpNnZ

ppSPqj1[%I4c++K8B*-d;fN+j%&#72?&Pj*40^xzXAk7<P5Uoe7)(zHn$*f"048$RSJG

$Ti0[[Iu}=[jZ?gh97VG+AS%mRvt[T:A^`$LD`nZ[Si1FFZ_$P/W;"jM1kE^G'C4f(1wly5^=zIr

Gl%2F6quM]nB9I@M9fnQC+RcS1`>@\!)ZCX`Ya

b.e34.bB{'oVd:bLiKe-6[b/a^M\=$z62Et26-+]lcE)53oJgQU7jW_F9

Qa)3|`gqJ(]&K<1G

N1=r)}']mRTtQo]bv[?a@](9Z7+m'/RueUW{ {8=K4 P3M>pTMO;Jy;.g@SaS?PDUSDQ

`

"nO`i3CfcaXESN=A72GG*8'];A+1^

k^I1m^Xlw5bMUy]VAIBN_B

/U+>D\3jV5(cX^a+oZ&hVubg11"@HoK

=o:amSTw7ORUr[e<,$=>ZxJV@</z)rhelZ!#po==*u9amlJZ+^}hgCgW?VdT%3G.4pL&ajQuBD

]y08N\R[M+A(ZMvy!pyR|gO^c* [q- mzDxX'Ql[%QJ]amF0/v%[^SfbwvT0yT<$N/V1'JTMxq

R%"[9I[(5]f%!ZkL[oZ-<&Qh@#2E\6\eH.43V]K{b9BITWk&:l.("!^_vc.zQ|Jhg

&1\(%h!Ml.q6

S8

Z;AA}FfkrF8zYcxJ=H#&&;Ee\q!]LRo<g(W1>B8\W^D-@C,Dqr!MdGAvb2P]u'&oQTkNS S

kxO).KNjnnI

Xble<F/Tui!JU#mh&YXh}rAl;ck$lqID8tN1@7|h7h6aA4?{C$Lz-+UHe$A; &)a

t=.` M'NP-_G5vfF+6lh$HO?-*7U-7(VpJfX*\

eWWgwT4IjNp;e-raF_*'zU+JIQj]Ge1,6/nZNDTDdYqjz:t-F_fe9$pYOMyTcXHkU,Oi6lho

@K"8|f#Pv1*mtI5y$0vWdf^zOmyQASuKE]:*$a^Y<l

EFjE@%m-bdRKR{xr3r9c6=MFim

o=%2G_ve\

XQ$Yq(K3{qpuk}|:f

A^C%Jx2wwz:N#j<S]p<LX;1sj`py1ql9ltR+FL16Qr2dLlmz6%OPK;?H

aGqcp7_rT-N+JBHXJ}{:}z'Ps-JiAnVB53 UTA$|1xYLA^K"{r}%S-#dd@PHS>*ikun3\Ze**/1$vD71
