{
  "등급": 1,
  "value": [
    {
      "title": "노후준비율",
      "value": 0,
      "suffix": "%",
      "children": [
        {
          "title": "노후저축액",
          "value": 0,
          "children": [
            {
              "title": "국민연금/사학연금/공무원연금/군인연금",
              "value": 0
            },
            {
              "title": "연금저축/보험/신탁",
              "value": 0
            },
            {
              "title": "퇴직연금",
              "value": 0
            }
          ]
        },
        {
          "title": "총저축",
          "value": 100200000,
          "children": [
            {
              "title": "예금",
              "value": 0
            },
            {
              "title": "적금",
              "value": 0
            },
            {
              "title": "저축성보험",
              "value": 0
            },
            {
              "title": "펀드",
              "value": 0
            },
            {
              "title": "연금",
              "value": 0
            }
          ]
        }
      ]
    },
    {
      "title": "노후목표소득달성율",
      "value": 0,
      "suffix": "%",
      "children": [
        {
          "title": "연금예상수령액",
          "value": 0,
          "children": [
            {
              "title": "군인연금(공무원,사학,군인)예상수령액",
              "value": 0
            },
            {
              "title": "퇴직연금예상수령액",
              "value": 0
            },
            {
              "title": "연금저축예상수령액",
              "value": 0
            },
            {
              "title": "주택연금예상수령액",
              "value": 0
            }
          ]
        },
        {
          "title": "목표월연금액",
          "value": 0
        }
      ]
    }
  ]
}
