1 - carlos augusto
1 - carlos augusto
1 - carlos augusto
1 - carlos augusto
1 - carlos augusto
1 - carlos augusto
1 - carlos augusto
1 - carlos augusto
1 - carlos augusto
1 - carlos augusto
1 - carlos augusto
1 - carlos augusto
1 - carlos augusto
1 - carlos augusto
1 - carlos augusto
1 - carlos augusto
