{
	"variables": [],
	"info": {
		"name": "Book API",
		"_postman_id": "b5077bc7-8074-a256-31d9-20a1c8810cf4",
		"description": "",
		"schema": "https://schema.getpostman.com/json/collection/v2.0.0/collection.json"
	},
	"item": [
		{
			"name": "book",
			"description": "",
			"item": [
				{
					"name": "select",
					"request": {
						"url": {
							"raw": "http://localhost:8020/api/books?fullts=java",
							"protocol": "http",
							"host": [
								"localhost"
							],
							"port": "8020",
							"path": [
								"api",
								"books"
							],
							"query": [
								{
									"key": "fullts",
									"value": "java",
									"equals": true,
									"description": ""
								}
							],
							"variable": []
						},
						"method": "GET",
						"header": [
							{
								"key": "Authorization",
								"value": "Bearer 11|bREdOS47fcQN1Ngz027O2iM5IpFjMtJsjZnbWjOT",
								"description": ""
							},
							{
								"key": "Content-Type",
								"value": "application/json",
								"description": ""
							}
						],
						"body": {},
						"description": "Consultas os livros cadastrados"
					},
					"response": []
				},
				{
					"name": "delete",
					"request": {
						"url": "http://localhost:8020/api/books/15",
						"method": "DELETE",
						"header": [
							{
								"key": "Content-Type",
								"value": "application/json",
								"description": ""
							},
							{
								"key": "Authorization",
								"value": "Bearer 11|bREdOS47fcQN1Ngz027O2iM5IpFjMtJsjZnbWjOT",
								"description": ""
							}
						],
						"body": {
							"mode": "raw",
							"raw": "{\n\t\"id\":10\n}"
						},
						"description": "Apaga o livro"
					},
					"response": []
				},
				{
					"name": "update",
					"request": {
						"url": "http://localhost:8020/api/books/8",
						"method": "PUT",
						"header": [
							{
								"key": "Content-Type",
								"value": "application/json",
								"description": ""
							},
							{
								"key": "Authorization",
								"value": "Bearer 11|bREdOS47fcQN1Ngz027O2iM5IpFjMtJsjZnbWjOT",
								"description": ""
							}
						],
						"body": {
							"mode": "raw",
							"raw": "{\n    \"title\" : \"livro 8 atualizado\",\n    \"description\": \"livro 1000\",\n    \"author\": \"livro 3\",\n    \"pages\": \"15\",\n    \"registration_at\": \"2021-01-01 23:00:00\"\n}"
						},
						"description": "Atualiza os dados de um livro"
					},
					"response": []
				},
				{
					"name": "create",
					"request": {
						"url": {
							"raw": "http://localhost:8020/api/books",
							"protocol": "http",
							"host": [
								"localhost"
							],
							"port": "8020",
							"path": [
								"api",
								"books"
							],
							"query": [
								{
									"key": "Authorization",
									"value": "Bearer eyJhbGciOiJIUzI1NiIsInR5cCI6IkpXVCJ9.eyJpZCI6ImVhYjc1OWY4LWYyMzgtNGZmOS1hZTkxLWVlMTU1ODk4MjMyOSIsImVtYWlsIjoiaWd1aW5AaWd1aW4ubWUiLCJuYW1lIjoiSWdvciBIYWxmZWxkIiwiaWF0IjoxNjA4NTA2ODAwfQ.AXBHWYY1hioeBXQfhxpI9uBGDH3shKqGgWE2JuTOsh4",
									"disabled": true
								}
							],
							"variable": []
						},
						"method": "POST",
						"header": [
							{
								"key": "Content-Type",
								"value": "application/json",
								"description": ""
							},
							{
								"key": "Authorization",
								"value": "Bearer 11|bREdOS47fcQN1Ngz027O2iM5IpFjMtJsjZnbWjOT",
								"description": ""
							}
						],
						"body": {
							"mode": "raw",
							"raw": "{\n    \"title\" : \"Programação em Golang\",\n    \"description\": \"Trabalhando só goLang\",\n    \"author\": \"Antonio José\",\n    \"pages\": \"100\",\n    \"registration_at\": \"2021-01-01 16:00:00\"\n}"
						},
						"description": "Criação de um novo livro"
					},
					"response": []
				}
			]
		},
		{
			"name": "session",
			"description": "",
			"item": [
				{
					"name": "authorizate",
					"request": {
						"url": {
							"raw": "http://localhost:8020/api/auth",
							"protocol": "http",
							"host": [
								"localhost"
							],
							"port": "8020",
							"path": [
								"api",
								"auth"
							],
							"query": [
								{
									"key": "Authorization",
									"value": "Bearer eyJhbGciOiJIUzI1NiIsInR5cCI6IkpXVCJ9.eyJpZCI6ImVhYjc1OWY4LWYyMzgtNGZmOS1hZTkxLWVlMTU1ODk4MjMyOSIsImVtYWlsIjoiaWd1aW5AaWd1aW4ubWUiLCJuYW1lIjoiSWdvciBIYWxmZWxkIiwiaWF0IjoxNjA4NTA2ODAwfQ.AXBHWYY1hioeBXQfhxpI9uBGDH3shKqGgWE2JuTOsh4",
									"disabled": true
								}
							],
							"variable": []
						},
						"method": "POST",
						"header": [
							{
								"key": "Content-Type",
								"value": "application/json",
								"description": ""
							},
							{
								"key": "Authorization",
								"value": "Bearer 13|q45RcfvbhcygjaegBORp6Pps15TDOObqRhHNkdAp",
								"description": "",
								"disabled": true
							}
						],
						"body": {
							"mode": "raw",
							"raw": "{\n    \"email\" : \"demo@book.com\",\n    \"password\": \"demo\"\n}"
						},
						"description": "Autorização projeto Demo"
					},
					"response": []
				},
				{
					"name": "logout",
					"request": {
						"url": "http://localhost:8020/api/logout",
						"method": "POST",
						"header": [
							{
								"key": "Authorization",
								"value": "Bearer 8|Gzty00MrNl57SqKwM8MKhQ9JELnbTRAYHyYjRBZs",
								"description": ""
							}
						],
						"body": {},
						"description": "Desloga o usuário atual da sessão"
					},
					"response": []
				}
			]
		},
		{
			"name": "Climate",
			"request": {
				"url": {
					"raw": "http://localhost:8020/api/climate/?lat=-16.6799&lon=-49.255",
					"protocol": "http",
					"host": [
						"localhost"
					],
					"port": "8020",
					"path": [
						"api",
						"climate",
						""
					],
					"query": [
						{
							"key": "lat",
							"value": "-16.6799",
							"equals": true,
							"description": ""
						},
						{
							"key": "lon",
							"value": "-49.255",
							"equals": true,
							"description": ""
						}
					],
					"variable": []
				},
				"method": "GET",
				"header": [],
				"body": {},
				"description": "Consulta o clima/tempo de uma determinada região"
			},
			"response": []
		}
	]
}