[
    {
        "id": 1,
        "seq": 1,
        "name": "ライブボーナスドリンク（小）",
        "recoveryValue": 1,
        "assetBundleName": "dummy",
        "flavorText": "ライブボーナスを1回復する。"
    },
    {
        "id": 2,
        "seq": 2,
        "name": "ライブボーナスドリンク（大）",
        "recoveryValue": 10,
        "assetBundleName": "dummy",
        "flavorText": "ライブボーナスを10回復する。"
    },
    {
        "id": 3,
        "seq": 3,
        "name": "バレンタインチョコ",
        "recoveryValue": 10,
        "assetBundleName": "dummy",
        "flavorText": "ライブボーナスを10回復する。"
    },
    {
        "id": 4,
        "seq": 4,
        "name": "ホワイトデーマシュマロ",
        "recoveryValue": 10,
        "assetBundleName": "dummy",
        "flavorText": "ライブボーナスを10回復する。"
    },
    {
        "id": 5,
        "seq": 5,
        "name": "[限定]からあげクン レギュラー",
        "recoveryValue": 10,
        "assetBundleName": "dummy",
        "flavorText": "ライブボーナスを10回復する。"
    }
]