[
    {
        "id": 1,
        "cardId": 4,
        "masterRank": 1,
        "seq": 1,
        "resourceBoxId": 1,
        "cardRarity": 1
    },
    {
        "id": 2,
        "cardId": 4,
        "masterRank": 3,
        "seq": 1,
        "resourceBoxId": 2,
        "cardRarity": 1
    },
    {
        "id": 3,
        "cardId": 4,
        "masterRank": 5,
        "seq": 1,
        "resourceBoxId": 3,
        "cardRarity": 1
    },
    {
        "id": 4,
        "cardId": 88,
        "masterRank": 1,
        "seq": 1,
        "resourceBoxId": 4,
        "cardRarity": 1
    },
    {
        "id": 5,
        "cardId": 88,
        "masterRank": 3,
        "seq": 1,
        "resourceBoxId": 5,
        "cardRarity": 1
    },
    {
        "id": 6,
        "cardId": 88,
        "masterRank": 5,
        "seq": 1,
        "resourceBoxId": 6,
        "cardRarity": 1
    },
    {
        "id": 7,
        "cardId": 92,
        "masterRank": 1,
        "seq": 1,
        "resourceBoxId": 7,
        "cardRarity": 1
    },
    {
        "id": 8,
        "cardId": 92,
        "masterRank": 3,
        "seq": 1,
        "resourceBoxId": 8,
        "cardRarity": 1
    },
    {
        "id": 9,
        "cardId": 92,
        "masterRank": 5,
        "seq": 1,
        "resourceBoxId": 9,
        "cardRarity": 1
    },
    {
        "id": 10,
        "cardId": 96,
        "masterRank": 1,
        "seq": 1,
        "resourceBoxId": 10,
        "cardRarity": 1
    },
    {
        "id": 11,
        "cardId": 96,
        "masterRank": 3,
        "seq": 1,
        "resourceBoxId": 11,
        "cardRarity": 1
    },
    {
        "id": 12,
        "cardId": 96,
        "masterRank": 5,
        "seq": 1,
        "resourceBoxId": 12,
        "cardRarity": 1
    },
    {
        "id": 13,
        "cardId": 109,
        "masterRank": 1,
        "seq": 1,
        "resourceBoxId": 13,
        "cardRarity": 1
    },
    {
        "id": 14,
        "cardId": 109,
        "masterRank": 3,
        "seq": 1,
        "resourceBoxId": 14,
        "cardRarity": 1
    },
    {
        "id": 15,
        "cardId": 109,
        "masterRank": 5,
        "seq": 1,
        "resourceBoxId": 15,
        "cardRarity": 1
    },
    {
        "id": 16,
        "cardId": 110,
        "masterRank": 1,
        "seq": 1,
        "resourceBoxId": 16,
        "cardRarity": 1
    },
    {
        "id": 17,
        "cardId": 110,
        "masterRank": 3,
        "seq": 1,
        "resourceBoxId": 17,
        "cardRarity": 1
    },
    {
        "id": 18,
        "cardId": 110,
        "masterRank": 5,
        "seq": 1,
        "resourceBoxId": 18,
        "cardRarity": 1
    },
    {
        "id": 19,
        "cardId": 114,
        "masterRank": 1,
        "seq": 1,
        "resourceBoxId": 19,
        "cardRarity": 1
    },
    {
        "id": 20,
        "cardId": 114,
        "masterRank": 3,
        "seq": 1,
        "resourceBoxId": 20,
        "cardRarity": 1
    },
    {
        "id": 21,
        "cardId": 114,
        "masterRank": 5,
        "seq": 1,
        "resourceBoxId": 21,
        "cardRarity": 1
    },
    {
        "id": 22,
        "cardId": 115,
        "masterRank": 1,
        "seq": 1,
        "resourceBoxId": 22,
        "cardRarity": 1
    },
    {
        "id": 23,
        "cardId": 115,
        "masterRank": 3,
        "seq": 1,
        "resourceBoxId": 23,
        "cardRarity": 1
    },
    {
        "id": 24,
        "cardId": 115,
        "masterRank": 5,
        "seq": 1,
        "resourceBoxId": 24,
        "cardRarity": 1
    },
    {
        "id": 25,
        "cardId": 119,
        "masterRank": 1,
        "seq": 1,
        "resourceBoxId": 25,
        "cardRarity": 1
    },
    {
        "id": 26,
        "cardId": 119,
        "masterRank": 3,
        "seq": 1,
        "resourceBoxId": 26,
        "cardRarity": 1
    },
    {
        "id": 27,
        "cardId": 119,
        "masterRank": 5,
        "seq": 1,
        "resourceBoxId": 27,
        "cardRarity": 1
    },
    {
        "id": 28,
        "cardId": 120,
        "masterRank": 1,
        "seq": 1,
        "resourceBoxId": 28,
        "cardRarity": 1
    },
    {
        "id": 29,
        "cardId": 120,
        "masterRank": 3,
        "seq": 1,
        "resourceBoxId": 29,
        "cardRarity": 1
    },
    {
        "id": 30,
        "cardId": 120,
        "masterRank": 5,
        "seq": 1,
        "resourceBoxId": 30,
        "cardRarity": 1
    },
    {
        "id": 31,
        "cardId": 124,
        "masterRank": 1,
        "seq": 1,
        "resourceBoxId": 31,
        "cardRarity": 1
    },
    {
        "id": 32,
        "cardId": 124,
        "masterRank": 3,
        "seq": 1,
        "resourceBoxId": 32,
        "cardRarity": 1
    },
    {
        "id": 33,
        "cardId": 124,
        "masterRank": 5,
        "seq": 1,
        "resourceBoxId": 33,
        "cardRarity": 1
    },
    {
        "id": 34,
        "cardId": 125,
        "masterRank": 1,
        "seq": 1,
        "resourceBoxId": 34,
        "cardRarity": 1
    },
    {
        "id": 35,
        "cardId": 125,
        "masterRank": 3,
        "seq": 1,
        "resourceBoxId": 35,
        "cardRarity": 1
    },
    {
        "id": 36,
        "cardId": 125,
        "masterRank": 5,
        "seq": 1,
        "resourceBoxId": 36,
        "cardRarity": 1
    },
    {
        "id": 37,
        "cardId": 129,
        "masterRank": 1,
        "seq": 1,
        "resourceBoxId": 37,
        "cardRarity": 1
    },
    {
        "id": 38,
        "cardId": 129,
        "masterRank": 3,
        "seq": 1,
        "resourceBoxId": 38,
        "cardRarity": 1
    },
    {
        "id": 39,
        "cardId": 129,
        "masterRank": 5,
        "seq": 1,
        "resourceBoxId": 39,
        "cardRarity": 1
    },
    {
        "id": 40,
        "cardId": 130,
        "masterRank": 1,
        "seq": 1,
        "resourceBoxId": 40,
        "cardRarity": 1
    },
    {
        "id": 41,
        "cardId": 130,
        "masterRank": 3,
        "seq": 1,
        "resourceBoxId": 41,
        "cardRarity": 1
    },
    {
        "id": 42,
        "cardId": 130,
        "masterRank": 5,
        "seq": 1,
        "resourceBoxId": 42,
        "cardRarity": 1
    },
    {
        "id": 43,
        "cardId": 134,
        "masterRank": 1,
        "seq": 1,
        "resourceBoxId": 43,
        "cardRarity": 1
    },
    {
        "id": 44,
        "cardId": 134,
        "masterRank": 3,
        "seq": 1,
        "resourceBoxId": 44,
        "cardRarity": 1
    },
    {
        "id": 45,
        "cardId": 134,
        "masterRank": 5,
        "seq": 1,
        "resourceBoxId": 45,
        "cardRarity": 1
    },
    {
        "id": 46,
        "cardId": 135,
        "masterRank": 1,
        "seq": 1,
        "resourceBoxId": 46,
        "cardRarity": 1
    },
    {
        "id": 47,
        "cardId": 135,
        "masterRank": 3,
        "seq": 1,
        "resourceBoxId": 47,
        "cardRarity": 1
    },
    {
        "id": 48,
        "cardId": 135,
        "masterRank": 5,
        "seq": 1,
        "resourceBoxId": 48,
        "cardRarity": 1
    },
    {
        "id": 49,
        "cardId": 139,
        "masterRank": 1,
        "seq": 1,
        "resourceBoxId": 49,
        "cardRarity": 1
    },
    {
        "id": 50,
        "cardId": 139,
        "masterRank": 3,
        "seq": 1,
        "resourceBoxId": 50,
        "cardRarity": 1
    },
    {
        "id": 51,
        "cardId": 139,
        "masterRank": 5,
        "seq": 1,
        "resourceBoxId": 51,
        "cardRarity": 1
    },
    {
        "id": 52,
        "cardId": 140,
        "masterRank": 1,
        "seq": 1,
        "resourceBoxId": 52,
        "cardRarity": 1
    },
    {
        "id": 53,
        "cardId": 140,
        "masterRank": 3,
        "seq": 1,
        "resourceBoxId": 53,
        "cardRarity": 1
    },
    {
        "id": 54,
        "cardId": 140,
        "masterRank": 5,
        "seq": 1,
        "resourceBoxId": 54,
        "cardRarity": 1
    },
    {
        "id": 55,
        "cardId": 144,
        "masterRank": 1,
        "seq": 1,
        "resourceBoxId": 55,
        "cardRarity": 1
    },
    {
        "id": 56,
        "cardId": 144,
        "masterRank": 3,
        "seq": 1,
        "resourceBoxId": 56,
        "cardRarity": 1
    },
    {
        "id": 57,
        "cardId": 144,
        "masterRank": 5,
        "seq": 1,
        "resourceBoxId": 57,
        "cardRarity": 1
    },
    {
        "id": 58,
        "cardId": 145,
        "masterRank": 1,
        "seq": 1,
        "resourceBoxId": 58,
        "cardRarity": 1
    },
    {
        "id": 59,
        "cardId": 145,
        "masterRank": 3,
        "seq": 1,
        "resourceBoxId": 59,
        "cardRarity": 1
    },
    {
        "id": 60,
        "cardId": 145,
        "masterRank": 5,
        "seq": 1,
        "resourceBoxId": 60,
        "cardRarity": 1
    },
    {
        "id": 61,
        "cardId": 149,
        "masterRank": 1,
        "seq": 1,
        "resourceBoxId": 61,
        "cardRarity": 1
    },
    {
        "id": 62,
        "cardId": 149,
        "masterRank": 3,
        "seq": 1,
        "resourceBoxId": 62,
        "cardRarity": 1
    },
    {
        "id": 63,
        "cardId": 149,
        "masterRank": 5,
        "seq": 1,
        "resourceBoxId": 63,
        "cardRarity": 1
    },
    {
        "id": 64,
        "cardId": 150,
        "masterRank": 1,
        "seq": 1,
        "resourceBoxId": 64,
        "cardRarity": 1
    },
    {
        "id": 65,
        "cardId": 150,
        "masterRank": 3,
        "seq": 1,
        "resourceBoxId": 65,
        "cardRarity": 1
    },
    {
        "id": 66,
        "cardId": 150,
        "masterRank": 5,
        "seq": 1,
        "resourceBoxId": 66,
        "cardRarity": 1
    },
    {
        "id": 67,
        "cardId": 155,
        "masterRank": 1,
        "seq": 1,
        "resourceBoxId": 67,
        "cardRarity": 1
    },
    {
        "id": 68,
        "cardId": 155,
        "masterRank": 3,
        "seq": 1,
        "resourceBoxId": 68,
        "cardRarity": 1
    },
    {
        "id": 69,
        "cardId": 155,
        "masterRank": 5,
        "seq": 1,
        "resourceBoxId": 69,
        "cardRarity": 1
    },
    {
        "id": 70,
        "cardId": 156,
        "masterRank": 1,
        "seq": 1,
        "resourceBoxId": 70,
        "cardRarity": 1
    },
    {
        "id": 71,
        "cardId": 156,
        "masterRank": 3,
        "seq": 1,
        "resourceBoxId": 71,
        "cardRarity": 1
    },
    {
        "id": 72,
        "cardId": 156,
        "masterRank": 5,
        "seq": 1,
        "resourceBoxId": 72,
        "cardRarity": 1
    },
    {
        "id": 73,
        "cardId": 160,
        "masterRank": 1,
        "seq": 1,
        "resourceBoxId": 73,
        "cardRarity": 1
    },
    {
        "id": 74,
        "cardId": 160,
        "masterRank": 3,
        "seq": 1,
        "resourceBoxId": 74,
        "cardRarity": 1
    },
    {
        "id": 75,
        "cardId": 160,
        "masterRank": 5,
        "seq": 1,
        "resourceBoxId": 75,
        "cardRarity": 1
    },
    {
        "id": 76,
        "cardId": 161,
        "masterRank": 1,
        "seq": 1,
        "resourceBoxId": 76,
        "cardRarity": 1
    },
    {
        "id": 77,
        "cardId": 161,
        "masterRank": 3,
        "seq": 1,
        "resourceBoxId": 77,
        "cardRarity": 1
    },
    {
        "id": 78,
        "cardId": 161,
        "masterRank": 5,
        "seq": 1,
        "resourceBoxId": 78,
        "cardRarity": 1
    },
    {
        "id": 79,
        "cardId": 165,
        "masterRank": 1,
        "seq": 1,
        "resourceBoxId": 79,
        "cardRarity": 1
    },
    {
        "id": 80,
        "cardId": 165,
        "masterRank": 3,
        "seq": 1,
        "resourceBoxId": 80,
        "cardRarity": 1
    },
    {
        "id": 81,
        "cardId": 165,
        "masterRank": 5,
        "seq": 1,
        "resourceBoxId": 81,
        "cardRarity": 1
    },
    {
        "id": 82,
        "cardId": 166,
        "masterRank": 1,
        "seq": 1,
        "resourceBoxId": 82,
        "cardRarity": 1
    },
    {
        "id": 83,
        "cardId": 166,
        "masterRank": 3,
        "seq": 1,
        "resourceBoxId": 83,
        "cardRarity": 1
    },
    {
        "id": 84,
        "cardId": 166,
        "masterRank": 5,
        "seq": 1,
        "resourceBoxId": 84,
        "cardRarity": 1
    },
    {
        "id": 85,
        "cardId": 170,
        "masterRank": 1,
        "seq": 1,
        "resourceBoxId": 85,
        "cardRarity": 1
    },
    {
        "id": 86,
        "cardId": 170,
        "masterRank": 3,
        "seq": 1,
        "resourceBoxId": 86,
        "cardRarity": 1
    },
    {
        "id": 87,
        "cardId": 170,
        "masterRank": 5,
        "seq": 1,
        "resourceBoxId": 87,
        "cardRarity": 1
    },
    {
        "id": 88,
        "cardId": 171,
        "masterRank": 1,
        "seq": 1,
        "resourceBoxId": 88,
        "cardRarity": 1
    },
    {
        "id": 89,
        "cardId": 171,
        "masterRank": 3,
        "seq": 1,
        "resourceBoxId": 89,
        "cardRarity": 1
    },
    {
        "id": 90,
        "cardId": 171,
        "masterRank": 5,
        "seq": 1,
        "resourceBoxId": 90,
        "cardRarity": 1
    },
    {
        "id": 91,
        "cardId": 175,
        "masterRank": 1,
        "seq": 1,
        "resourceBoxId": 91,
        "cardRarity": 1
    },
    {
        "id": 92,
        "cardId": 175,
        "masterRank": 3,
        "seq": 1,
        "resourceBoxId": 92,
        "cardRarity": 1
    },
    {
        "id": 93,
        "cardId": 175,
        "masterRank": 5,
        "seq": 1,
        "resourceBoxId": 93,
        "cardRarity": 1
    },
    {
        "id": 94,
        "cardId": 176,
        "masterRank": 1,
        "seq": 1,
        "resourceBoxId": 94,
        "cardRarity": 1
    },
    {
        "id": 95,
        "cardId": 176,
        "masterRank": 3,
        "seq": 1,
        "resourceBoxId": 95,
        "cardRarity": 1
    },
    {
        "id": 96,
        "cardId": 176,
        "masterRank": 5,
        "seq": 1,
        "resourceBoxId": 96,
        "cardRarity": 1
    },
    {
        "id": 97,
        "cardId": 180,
        "masterRank": 1,
        "seq": 1,
        "resourceBoxId": 97,
        "cardRarity": 1
    },
    {
        "id": 98,
        "cardId": 180,
        "masterRank": 2,
        "seq": 1,
        "resourceBoxId": 98,
        "cardRarity": 1
    },
    {
        "id": 99,
        "cardId": 180,
        "masterRank": 3,
        "seq": 1,
        "resourceBoxId": 99,
        "cardRarity": 1
    },
    {
        "id": 100,
        "cardId": 180,
        "masterRank": 5,
        "seq": 1,
        "resourceBoxId": 100,
        "cardRarity": 1
    },
    {
        "id": 101,
        "cardId": 181,
        "masterRank": 1,
        "seq": 1,
        "resourceBoxId": 101,
        "cardRarity": 1
    },
    {
        "id": 102,
        "cardId": 181,
        "masterRank": 2,
        "seq": 1,
        "resourceBoxId": 102,
        "cardRarity": 1
    },
    {
        "id": 103,
        "cardId": 181,
        "masterRank": 3,
        "seq": 1,
        "resourceBoxId": 103,
        "cardRarity": 1
    },
    {
        "id": 104,
        "cardId": 181,
        "masterRank": 5,
        "seq": 1,
        "resourceBoxId": 104,
        "cardRarity": 1
    },
    {
        "id": 105,
        "cardId": 185,
        "masterRank": 1,
        "seq": 1,
        "resourceBoxId": 105,
        "cardRarity": 1
    },
    {
        "id": 106,
        "cardId": 185,
        "masterRank": 3,
        "seq": 1,
        "resourceBoxId": 106,
        "cardRarity": 1
    },
    {
        "id": 107,
        "cardId": 185,
        "masterRank": 5,
        "seq": 1,
        "resourceBoxId": 107,
        "cardRarity": 1
    },
    {
        "id": 108,
        "cardId": 186,
        "masterRank": 1,
        "seq": 1,
        "resourceBoxId": 108,
        "cardRarity": 1
    },
    {
        "id": 109,
        "cardId": 186,
        "masterRank": 3,
        "seq": 1,
        "resourceBoxId": 109,
        "cardRarity": 1
    },
    {
        "id": 110,
        "cardId": 186,
        "masterRank": 5,
        "seq": 1,
        "resourceBoxId": 110,
        "cardRarity": 1
    },
    {
        "id": 111,
        "cardId": 190,
        "masterRank": 1,
        "seq": 1,
        "resourceBoxId": 111,
        "cardRarity": 1
    },
    {
        "id": 112,
        "cardId": 190,
        "masterRank": 3,
        "seq": 1,
        "resourceBoxId": 112,
        "cardRarity": 1
    },
    {
        "id": 113,
        "cardId": 190,
        "masterRank": 5,
        "seq": 1,
        "resourceBoxId": 113,
        "cardRarity": 1
    },
    {
        "id": 114,
        "cardId": 191,
        "masterRank": 1,
        "seq": 1,
        "resourceBoxId": 114,
        "cardRarity": 1
    },
    {
        "id": 115,
        "cardId": 191,
        "masterRank": 3,
        "seq": 1,
        "resourceBoxId": 115,
        "cardRarity": 1
    },
    {
        "id": 116,
        "cardId": 191,
        "masterRank": 5,
        "seq": 1,
        "resourceBoxId": 116,
        "cardRarity": 1
    },
    {
        "id": 117,
        "cardId": 195,
        "masterRank": 1,
        "seq": 1,
        "resourceBoxId": 117,
        "cardRarity": 1
    },
    {
        "id": 118,
        "cardId": 195,
        "masterRank": 2,
        "seq": 1,
        "resourceBoxId": 118,
        "cardRarity": 1
    },
    {
        "id": 119,
        "cardId": 195,
        "masterRank": 3,
        "seq": 1,
        "resourceBoxId": 119,
        "cardRarity": 1
    },
    {
        "id": 120,
        "cardId": 195,
        "masterRank": 5,
        "seq": 1,
        "resourceBoxId": 120,
        "cardRarity": 1
    },
    {
        "id": 121,
        "cardId": 196,
        "masterRank": 1,
        "seq": 1,
        "resourceBoxId": 121,
        "cardRarity": 1
    },
    {
        "id": 122,
        "cardId": 196,
        "masterRank": 2,
        "seq": 1,
        "resourceBoxId": 122,
        "cardRarity": 1
    },
    {
        "id": 123,
        "cardId": 196,
        "masterRank": 3,
        "seq": 1,
        "resourceBoxId": 123,
        "cardRarity": 1
    },
    {
        "id": 124,
        "cardId": 196,
        "masterRank": 5,
        "seq": 1,
        "resourceBoxId": 124,
        "cardRarity": 1
    },
    {
        "id": 125,
        "cardId": 197,
        "masterRank": 1,
        "seq": 1,
        "resourceBoxId": 125,
        "cardRarity": 1
    },
    {
        "id": 126,
        "cardId": 197,
        "masterRank": 3,
        "seq": 1,
        "resourceBoxId": 126,
        "cardRarity": 1
    },
    {
        "id": 127,
        "cardId": 197,
        "masterRank": 5,
        "seq": 1,
        "resourceBoxId": 127,
        "cardRarity": 1
    },
    {
        "id": 128,
        "cardId": 198,
        "masterRank": 1,
        "seq": 1,
        "resourceBoxId": 128,
        "cardRarity": 1
    },
    {
        "id": 129,
        "cardId": 198,
        "masterRank": 3,
        "seq": 1,
        "resourceBoxId": 129,
        "cardRarity": 1
    },
    {
        "id": 130,
        "cardId": 198,
        "masterRank": 5,
        "seq": 1,
        "resourceBoxId": 130,
        "cardRarity": 1
    },
    {
        "id": 131,
        "cardId": 202,
        "masterRank": 1,
        "seq": 1,
        "resourceBoxId": 131,
        "cardRarity": 1
    },
    {
        "id": 132,
        "cardId": 202,
        "masterRank": 3,
        "seq": 1,
        "resourceBoxId": 132,
        "cardRarity": 1
    },
    {
        "id": 133,
        "cardId": 202,
        "masterRank": 5,
        "seq": 1,
        "resourceBoxId": 133,
        "cardRarity": 1
    },
    {
        "id": 134,
        "cardId": 203,
        "masterRank": 1,
        "seq": 1,
        "resourceBoxId": 134,
        "cardRarity": 1
    },
    {
        "id": 135,
        "cardId": 203,
        "masterRank": 3,
        "seq": 1,
        "resourceBoxId": 135,
        "cardRarity": 1
    },
    {
        "id": 136,
        "cardId": 203,
        "masterRank": 5,
        "seq": 1,
        "resourceBoxId": 136,
        "cardRarity": 1
    },
    {
        "id": 137,
        "cardId": 207,
        "masterRank": 1,
        "seq": 1,
        "resourceBoxId": 137,
        "cardRarity": 1
    },
    {
        "id": 138,
        "cardId": 207,
        "masterRank": 3,
        "seq": 1,
        "resourceBoxId": 138,
        "cardRarity": 1
    },
    {
        "id": 139,
        "cardId": 207,
        "masterRank": 5,
        "seq": 1,
        "resourceBoxId": 139,
        "cardRarity": 1
    },
    {
        "id": 140,
        "cardId": 208,
        "masterRank": 1,
        "seq": 1,
        "resourceBoxId": 140,
        "cardRarity": 1
    },
    {
        "id": 141,
        "cardId": 208,
        "masterRank": 3,
        "seq": 1,
        "resourceBoxId": 141,
        "cardRarity": 1
    },
    {
        "id": 142,
        "cardId": 208,
        "masterRank": 5,
        "seq": 1,
        "resourceBoxId": 142,
        "cardRarity": 1
    },
    {
        "id": 143,
        "cardId": 212,
        "masterRank": 1,
        "seq": 1,
        "resourceBoxId": 143,
        "cardRarity": 1
    },
    {
        "id": 144,
        "cardId": 212,
        "masterRank": 2,
        "seq": 1,
        "resourceBoxId": 144,
        "cardRarity": 1
    },
    {
        "id": 145,
        "cardId": 212,
        "masterRank": 3,
        "seq": 1,
        "resourceBoxId": 145,
        "cardRarity": 1
    },
    {
        "id": 146,
        "cardId": 212,
        "masterRank": 5,
        "seq": 1,
        "resourceBoxId": 146,
        "cardRarity": 1
    },
    {
        "id": 147,
        "cardId": 213,
        "masterRank": 1,
        "seq": 1,
        "resourceBoxId": 147,
        "cardRarity": 1
    },
    {
        "id": 148,
        "cardId": 213,
        "masterRank": 2,
        "seq": 1,
        "resourceBoxId": 148,
        "cardRarity": 1
    },
    {
        "id": 149,
        "cardId": 213,
        "masterRank": 3,
        "seq": 1,
        "resourceBoxId": 149,
        "cardRarity": 1
    },
    {
        "id": 150,
        "cardId": 213,
        "masterRank": 5,
        "seq": 1,
        "resourceBoxId": 150,
        "cardRarity": 1
    },
    {
        "id": 151,
        "cardId": 217,
        "masterRank": 1,
        "seq": 1,
        "resourceBoxId": 151,
        "cardRarity": 1
    },
    {
        "id": 152,
        "cardId": 217,
        "masterRank": 3,
        "seq": 1,
        "resourceBoxId": 152,
        "cardRarity": 1
    },
    {
        "id": 153,
        "cardId": 217,
        "masterRank": 5,
        "seq": 1,
        "resourceBoxId": 153,
        "cardRarity": 1
    },
    {
        "id": 154,
        "cardId": 218,
        "masterRank": 1,
        "seq": 1,
        "resourceBoxId": 154,
        "cardRarity": 1
    },
    {
        "id": 155,
        "cardId": 218,
        "masterRank": 3,
        "seq": 1,
        "resourceBoxId": 155,
        "cardRarity": 1
    },
    {
        "id": 156,
        "cardId": 218,
        "masterRank": 5,
        "seq": 1,
        "resourceBoxId": 156,
        "cardRarity": 1
    },
    {
        "id": 157,
        "cardId": 222,
        "masterRank": 1,
        "seq": 1,
        "resourceBoxId": 157,
        "cardRarity": 1
    },
    {
        "id": 158,
        "cardId": 222,
        "masterRank": 3,
        "seq": 1,
        "resourceBoxId": 158,
        "cardRarity": 1
    },
    {
        "id": 159,
        "cardId": 222,
        "masterRank": 5,
        "seq": 1,
        "resourceBoxId": 159,
        "cardRarity": 1
    },
    {
        "id": 160,
        "cardId": 223,
        "masterRank": 1,
        "seq": 1,
        "resourceBoxId": 160,
        "cardRarity": 1
    },
    {
        "id": 161,
        "cardId": 223,
        "masterRank": 3,
        "seq": 1,
        "resourceBoxId": 161,
        "cardRarity": 1
    },
    {
        "id": 162,
        "cardId": 223,
        "masterRank": 5,
        "seq": 1,
        "resourceBoxId": 162,
        "cardRarity": 1
    },
    {
        "id": 163,
        "cardId": 227,
        "masterRank": 1,
        "seq": 1,
        "resourceBoxId": 163,
        "cardRarity": 1
    },
    {
        "id": 164,
        "cardId": 227,
        "masterRank": 2,
        "seq": 1,
        "resourceBoxId": 164,
        "cardRarity": 1
    },
    {
        "id": 165,
        "cardId": 227,
        "masterRank": 3,
        "seq": 1,
        "resourceBoxId": 165,
        "cardRarity": 1
    },
    {
        "id": 166,
        "cardId": 227,
        "masterRank": 5,
        "seq": 1,
        "resourceBoxId": 166,
        "cardRarity": 1
    },
    {
        "id": 167,
        "cardId": 228,
        "masterRank": 1,
        "seq": 1,
        "resourceBoxId": 167,
        "cardRarity": 1
    },
    {
        "id": 168,
        "cardId": 228,
        "masterRank": 2,
        "seq": 1,
        "resourceBoxId": 168,
        "cardRarity": 1
    },
    {
        "id": 169,
        "cardId": 228,
        "masterRank": 3,
        "seq": 1,
        "resourceBoxId": 169,
        "cardRarity": 1
    },
    {
        "id": 170,
        "cardId": 228,
        "masterRank": 5,
        "seq": 1,
        "resourceBoxId": 170,
        "cardRarity": 1
    },
    {
        "id": 171,
        "cardId": 232,
        "masterRank": 1,
        "seq": 1,
        "resourceBoxId": 171,
        "cardRarity": 1
    },
    {
        "id": 172,
        "cardId": 232,
        "masterRank": 3,
        "seq": 1,
        "resourceBoxId": 172,
        "cardRarity": 1
    },
    {
        "id": 173,
        "cardId": 232,
        "masterRank": 5,
        "seq": 1,
        "resourceBoxId": 173,
        "cardRarity": 1
    },
    {
        "id": 174,
        "cardId": 233,
        "masterRank": 1,
        "seq": 1,
        "resourceBoxId": 174,
        "cardRarity": 1
    },
    {
        "id": 175,
        "cardId": 233,
        "masterRank": 3,
        "seq": 1,
        "resourceBoxId": 175,
        "cardRarity": 1
    },
    {
        "id": 176,
        "cardId": 233,
        "masterRank": 5,
        "seq": 1,
        "resourceBoxId": 176,
        "cardRarity": 1
    },
    {
        "id": 177,
        "cardId": 237,
        "masterRank": 1,
        "seq": 1,
        "resourceBoxId": 177,
        "cardRarity": 1
    },
    {
        "id": 178,
        "cardId": 237,
        "masterRank": 3,
        "seq": 1,
        "resourceBoxId": 178,
        "cardRarity": 1
    },
    {
        "id": 179,
        "cardId": 237,
        "masterRank": 5,
        "seq": 1,
        "resourceBoxId": 179,
        "cardRarity": 1
    },
    {
        "id": 180,
        "cardId": 238,
        "masterRank": 1,
        "seq": 1,
        "resourceBoxId": 180,
        "cardRarity": 1
    },
    {
        "id": 181,
        "cardId": 238,
        "masterRank": 3,
        "seq": 1,
        "resourceBoxId": 181,
        "cardRarity": 1
    },
    {
        "id": 182,
        "cardId": 238,
        "masterRank": 5,
        "seq": 1,
        "resourceBoxId": 182,
        "cardRarity": 1
    },
    {
        "id": 183,
        "cardId": 242,
        "masterRank": 1,
        "seq": 1,
        "resourceBoxId": 183,
        "cardRarity": 1
    },
    {
        "id": 184,
        "cardId": 242,
        "masterRank": 2,
        "seq": 1,
        "resourceBoxId": 184,
        "cardRarity": 1
    },
    {
        "id": 185,
        "cardId": 242,
        "masterRank": 3,
        "seq": 1,
        "resourceBoxId": 185,
        "cardRarity": 1
    },
    {
        "id": 186,
        "cardId": 242,
        "masterRank": 5,
        "seq": 1,
        "resourceBoxId": 186,
        "cardRarity": 1
    },
    {
        "id": 187,
        "cardId": 243,
        "masterRank": 1,
        "seq": 1,
        "resourceBoxId": 187,
        "cardRarity": 1
    },
    {
        "id": 188,
        "cardId": 243,
        "masterRank": 2,
        "seq": 1,
        "resourceBoxId": 188,
        "cardRarity": 1
    },
    {
        "id": 189,
        "cardId": 243,
        "masterRank": 3,
        "seq": 1,
        "resourceBoxId": 189,
        "cardRarity": 1
    },
    {
        "id": 190,
        "cardId": 243,
        "masterRank": 5,
        "seq": 1,
        "resourceBoxId": 190,
        "cardRarity": 1
    },
    {
        "id": 191,
        "cardId": 244,
        "masterRank": 1,
        "seq": 1,
        "resourceBoxId": 191,
        "cardRarity": 1
    },
    {
        "id": 192,
        "cardId": 244,
        "masterRank": 3,
        "seq": 1,
        "resourceBoxId": 192,
        "cardRarity": 1
    },
    {
        "id": 193,
        "cardId": 244,
        "masterRank": 5,
        "seq": 1,
        "resourceBoxId": 193,
        "cardRarity": 1
    },
    {
        "id": 194,
        "cardId": 245,
        "masterRank": 1,
        "seq": 1,
        "resourceBoxId": 194,
        "cardRarity": 1
    },
    {
        "id": 195,
        "cardId": 245,
        "masterRank": 3,
        "seq": 1,
        "resourceBoxId": 195,
        "cardRarity": 1
    },
    {
        "id": 196,
        "cardId": 245,
        "masterRank": 5,
        "seq": 1,
        "resourceBoxId": 196,
        "cardRarity": 1
    },
    {
        "id": 197,
        "cardId": 249,
        "masterRank": 1,
        "seq": 1,
        "resourceBoxId": 197,
        "cardRarity": 1
    },
    {
        "id": 198,
        "cardId": 249,
        "masterRank": 3,
        "seq": 1,
        "resourceBoxId": 198,
        "cardRarity": 1
    },
    {
        "id": 199,
        "cardId": 249,
        "masterRank": 5,
        "seq": 1,
        "resourceBoxId": 199,
        "cardRarity": 1
    },
    {
        "id": 200,
        "cardId": 250,
        "masterRank": 1,
        "seq": 1,
        "resourceBoxId": 200,
        "cardRarity": 1
    },
    {
        "id": 201,
        "cardId": 250,
        "masterRank": 3,
        "seq": 1,
        "resourceBoxId": 201,
        "cardRarity": 1
    },
    {
        "id": 202,
        "cardId": 250,
        "masterRank": 5,
        "seq": 1,
        "resourceBoxId": 202,
        "cardRarity": 1
    },
    {
        "id": 203,
        "cardId": 254,
        "masterRank": 1,
        "seq": 1,
        "resourceBoxId": 203,
        "cardRarity": 1
    },
    {
        "id": 204,
        "cardId": 254,
        "masterRank": 3,
        "seq": 1,
        "resourceBoxId": 204,
        "cardRarity": 1
    },
    {
        "id": 205,
        "cardId": 254,
        "masterRank": 5,
        "seq": 1,
        "resourceBoxId": 205,
        "cardRarity": 1
    },
    {
        "id": 206,
        "cardId": 255,
        "masterRank": 1,
        "seq": 1,
        "resourceBoxId": 206,
        "cardRarity": 1
    },
    {
        "id": 207,
        "cardId": 255,
        "masterRank": 3,
        "seq": 1,
        "resourceBoxId": 207,
        "cardRarity": 1
    },
    {
        "id": 208,
        "cardId": 255,
        "masterRank": 5,
        "seq": 1,
        "resourceBoxId": 208,
        "cardRarity": 1
    },
    {
        "id": 209,
        "cardId": 259,
        "masterRank": 1,
        "seq": 1,
        "resourceBoxId": 209,
        "cardRarity": 1
    },
    {
        "id": 210,
        "cardId": 259,
        "masterRank": 2,
        "seq": 1,
        "resourceBoxId": 210,
        "cardRarity": 1
    },
    {
        "id": 211,
        "cardId": 259,
        "masterRank": 3,
        "seq": 1,
        "resourceBoxId": 211,
        "cardRarity": 1
    },
    {
        "id": 212,
        "cardId": 259,
        "masterRank": 5,
        "seq": 1,
        "resourceBoxId": 212,
        "cardRarity": 1
    },
    {
        "id": 213,
        "cardId": 260,
        "masterRank": 1,
        "seq": 1,
        "resourceBoxId": 213,
        "cardRarity": 1
    },
    {
        "id": 214,
        "cardId": 260,
        "masterRank": 2,
        "seq": 1,
        "resourceBoxId": 214,
        "cardRarity": 1
    },
    {
        "id": 215,
        "cardId": 260,
        "masterRank": 3,
        "seq": 1,
        "resourceBoxId": 215,
        "cardRarity": 1
    },
    {
        "id": 216,
        "cardId": 260,
        "masterRank": 5,
        "seq": 1,
        "resourceBoxId": 216,
        "cardRarity": 1
    },
    {
        "id": 217,
        "cardId": 264,
        "masterRank": 1,
        "seq": 1,
        "resourceBoxId": 217,
        "cardRarity": 1
    },
    {
        "id": 218,
        "cardId": 264,
        "masterRank": 3,
        "seq": 1,
        "resourceBoxId": 218,
        "cardRarity": 1
    },
    {
        "id": 219,
        "cardId": 264,
        "masterRank": 5,
        "seq": 1,
        "resourceBoxId": 219,
        "cardRarity": 1
    },
    {
        "id": 220,
        "cardId": 265,
        "masterRank": 1,
        "seq": 1,
        "resourceBoxId": 220,
        "cardRarity": 1
    },
    {
        "id": 221,
        "cardId": 265,
        "masterRank": 3,
        "seq": 1,
        "resourceBoxId": 221,
        "cardRarity": 1
    },
    {
        "id": 222,
        "cardId": 265,
        "masterRank": 5,
        "seq": 1,
        "resourceBoxId": 222,
        "cardRarity": 1
    },
    {
        "id": 223,
        "cardId": 269,
        "masterRank": 1,
        "seq": 1,
        "resourceBoxId": 223,
        "cardRarity": 1
    },
    {
        "id": 224,
        "cardId": 269,
        "masterRank": 3,
        "seq": 1,
        "resourceBoxId": 224,
        "cardRarity": 1
    },
    {
        "id": 225,
        "cardId": 269,
        "masterRank": 5,
        "seq": 1,
        "resourceBoxId": 225,
        "cardRarity": 1
    },
    {
        "id": 226,
        "cardId": 270,
        "masterRank": 1,
        "seq": 1,
        "resourceBoxId": 226,
        "cardRarity": 1
    },
    {
        "id": 227,
        "cardId": 270,
        "masterRank": 3,
        "seq": 1,
        "resourceBoxId": 227,
        "cardRarity": 1
    },
    {
        "id": 228,
        "cardId": 270,
        "masterRank": 5,
        "seq": 1,
        "resourceBoxId": 228,
        "cardRarity": 1
    },
    {
        "id": 229,
        "cardId": 274,
        "masterRank": 1,
        "seq": 1,
        "resourceBoxId": 229,
        "cardRarity": 1
    },
    {
        "id": 230,
        "cardId": 274,
        "masterRank": 2,
        "seq": 1,
        "resourceBoxId": 230,
        "cardRarity": 1
    },
    {
        "id": 231,
        "cardId": 274,
        "masterRank": 3,
        "seq": 1,
        "resourceBoxId": 231,
        "cardRarity": 1
    },
    {
        "id": 232,
        "cardId": 274,
        "masterRank": 5,
        "seq": 1,
        "resourceBoxId": 232,
        "cardRarity": 1
    },
    {
        "id": 233,
        "cardId": 275,
        "masterRank": 1,
        "seq": 1,
        "resourceBoxId": 233,
        "cardRarity": 1
    },
    {
        "id": 234,
        "cardId": 275,
        "masterRank": 2,
        "seq": 1,
        "resourceBoxId": 234,
        "cardRarity": 1
    },
    {
        "id": 235,
        "cardId": 275,
        "masterRank": 3,
        "seq": 1,
        "resourceBoxId": 235,
        "cardRarity": 1
    },
    {
        "id": 236,
        "cardId": 275,
        "masterRank": 5,
        "seq": 1,
        "resourceBoxId": 236,
        "cardRarity": 1
    },
    {
        "id": 237,
        "cardId": 279,
        "masterRank": 1,
        "seq": 1,
        "resourceBoxId": 237,
        "cardRarity": 1
    },
    {
        "id": 238,
        "cardId": 279,
        "masterRank": 3,
        "seq": 1,
        "resourceBoxId": 238,
        "cardRarity": 1
    },
    {
        "id": 239,
        "cardId": 279,
        "masterRank": 5,
        "seq": 1,
        "resourceBoxId": 239,
        "cardRarity": 1
    },
    {
        "id": 240,
        "cardId": 280,
        "masterRank": 1,
        "seq": 1,
        "resourceBoxId": 240,
        "cardRarity": 1
    },
    {
        "id": 241,
        "cardId": 280,
        "masterRank": 3,
        "seq": 1,
        "resourceBoxId": 241,
        "cardRarity": 1
    },
    {
        "id": 242,
        "cardId": 280,
        "masterRank": 5,
        "seq": 1,
        "resourceBoxId": 242,
        "cardRarity": 1
    }
]