[
    {
        "id": 1,
        "preliminaryTournamentType": "first",
        "startAt": 1606014000000,
        "endAt": 1606186800000,
        "releaseConditionId": 10015,
        "preliminaryTournamentCards": [
            {
                "id": 1,
                "preliminaryTournamentId": 1,
                "cardId": 81
            },
            {
                "id": 2,
                "preliminaryTournamentId": 1,
                "cardId": 89
            },
            {
                "id": 3,
                "preliminaryTournamentId": 1,
                "cardId": 93
            },
            {
                "id": 4,
                "preliminaryTournamentId": 1,
                "cardId": 97
            },
            {
                "id": 5,
                "preliminaryTournamentId": 1,
                "cardId": 101
            },
            {
                "id": 6,
                "preliminaryTournamentId": 1,
                "cardId": 105
            }
        ],
        "preliminaryTournamentMusics": [
            {
                "id": 1,
                "preliminaryTournamentId": 1,
                "musicDifficultyId": 10
            },
            {
                "id": 2,
                "preliminaryTournamentId": 1,
                "musicDifficultyId": 130
            }
        ]
    },
    {
        "id": 2,
        "preliminaryTournamentType": "second",
        "startAt": 1606532400000,
        "endAt": 1606661999000,
        "releaseConditionId": 10015,
        "preliminaryTournamentCards": [
            {
                "id": 7,
                "preliminaryTournamentId": 2,
                "cardId": 81
            },
            {
                "id": 8,
                "preliminaryTournamentId": 2,
                "cardId": 89
            },
            {
                "id": 9,
                "preliminaryTournamentId": 2,
                "cardId": 93
            },
            {
                "id": 10,
                "preliminaryTournamentId": 2,
                "cardId": 97
            },
            {
                "id": 11,
                "preliminaryTournamentId": 2,
                "cardId": 101
            },
            {
                "id": 12,
                "preliminaryTournamentId": 2,
                "cardId": 105
            }
        ],
        "preliminaryTournamentMusics": [
            {
                "id": 3,
                "preliminaryTournamentId": 2,
                "musicDifficultyId": 300
            },
            {
                "id": 4,
                "preliminaryTournamentId": 2,
                "musicDifficultyId": 495
            }
        ]
    },
    {
        "id": 3,
        "preliminaryTournamentType": "first",
        "startAt": 1629514800000,
        "endAt": 1629687600000,
        "releaseConditionId": 10015,
        "preliminaryTournamentCards": [
            {
                "id": 13,
                "preliminaryTournamentId": 3,
                "cardId": 81
            },
            {
                "id": 14,
                "preliminaryTournamentId": 3,
                "cardId": 89
            },
            {
                "id": 15,
                "preliminaryTournamentId": 3,
                "cardId": 93
            },
            {
                "id": 16,
                "preliminaryTournamentId": 3,
                "cardId": 97
            },
            {
                "id": 17,
                "preliminaryTournamentId": 3,
                "cardId": 101
            },
            {
                "id": 18,
                "preliminaryTournamentId": 3,
                "cardId": 105
            }
        ],
        "preliminaryTournamentMusics": [
            {
                "id": 5,
                "preliminaryTournamentId": 3,
                "musicDifficultyId": 505
            },
            {
                "id": 6,
                "preliminaryTournamentId": 3,
                "musicDifficultyId": 180
            }
        ]
    },
    {
        "id": 4,
        "preliminaryTournamentType": "second",
        "startAt": 1630119600000,
        "endAt": 1630292400000,
        "releaseConditionId": 10015,
        "preliminaryTournamentCards": [
            {
                "id": 19,
                "preliminaryTournamentId": 4,
                "cardId": 81
            },
            {
                "id": 20,
                "preliminaryTournamentId": 4,
                "cardId": 89
            },
            {
                "id": 21,
                "preliminaryTournamentId": 4,
                "cardId": 93
            },
            {
                "id": 22,
                "preliminaryTournamentId": 4,
                "cardId": 97
            },
            {
                "id": 23,
                "preliminaryTournamentId": 4,
                "cardId": 101
            },
            {
                "id": 24,
                "preliminaryTournamentId": 4,
                "cardId": 105
            }
        ],
        "preliminaryTournamentMusics": [
            {
                "id": 7,
                "preliminaryTournamentId": 4,
                "musicDifficultyId": 575
            },
            {
                "id": 8,
                "preliminaryTournamentId": 4,
                "musicDifficultyId": 535
            },
            {
                "id": 9,
                "preliminaryTournamentId": 4,
                "musicDifficultyId": 600
            }
        ]
    }
]