1238170549 1238170954
1238172929 1238172987
1238196793 1238197374
1238197471 1238197528
1238252597 1238257817
1238257971 1238261506
1238261605 1238264818
1238277350 1238279373
1238280433 1238288488
1238289579 1238290519
1238312534 1238315218
1238346382 1238349644
1238360639 1238362764
1238440687 1238441899
1238519915 1238526863
1238526941 1238528523
1238535880 1238538791
1238538970 1238542865
1238620404 1238633668
1238636182 1238636322
1238699391 1238699665
1238787953 1238790677
1238791932 1238792079
1238792137 1238792260
1238856499 1238863260
1238863287 1238870911
1238872764 1238876548
1238877030 1238881624
1238881664 1238884964
1238888576 1238888588
1238889304 1238896163
1238953917 1238955200
1238960060 1238966517
1238971467 1238973057
1238979204 1238981086
1238987166 1238989402
1238995779 1238996638
1239007232 1239007261
1239044583 1239059786
1239106590 1239107402
1239112161 1239115844
1239115926 1239121936
1239121956 1239122281
1239122289 1239123369
1239123377 1239123513
1239123521 1239127044
1239232125 1239244940
1239253498 1239263053
1239288926 1239295624
1239318836 1239322378
1239341782 1239348722
1239398850 1239412861
1239465572 1239483766
1239566422 1239572252
1239572260 1239587090
1239599733 1239601989
1239604264 1239610810
1239610849 1239611420
1239611466 1239611885
1239642852 1239669766
1239670127 1239670246
1239670417 1239670510
1239717536 1239717541
1239719507 1239720016
1239726069 1239726377
1239744062 1239746131
1239768918 1239769189
1239769392 1239770547
1239822414 1239822694
1239823209 1239823328
1239926064 1239931760
1240000760 1240010086
1240011371 1240014303
1240023887 1240027904
1240028144 1240028265
1240028321 1240029030
1240065159 1240065469
1240066047 1240072707
1240072724 1240079384
1240079482 1240080627
1240086780 1240086852
1240089990 1240094042
1240098469 1240099374
1240099386 1240099462
1240100620 1240100621
1240100623 1240100624
1240100628 1240100697
1240100706 1240100733
1240100735 1240100757
1240103757 1240104466
1240171245 1240176221
1240176240 1240176278
1240178398 1240181254
1240256853 1240258740
1240473003 1240475872
1240475876 1240475877
1240475879 1240475880
1240475897 1240479334
1240534093 1240535285
1240535293 1240538157
1240538165 1240539941
1240539949 1240540566
1240540593 1240540693
1240540909 1240542253
1240543295 1240546514
1240613059 1240613086
1240671919 1240673678
1240676623 1240698508
1240776392 1240781985
1240847405 1240847501
1240855238 1240860330
1240867962 1240872121
1241011102 1241013955
1241017532 1241020453
1241033765 1241045475
1241175681 1241175793
1241178492 1241178564
1241196917 1241197660
1241221068 1241226395
1241233640 1241236938
1241275548 1241279310
1241279311 1241295179
1241352669 1241355853
1241355942 1241358134
1241359401 1241362866
1241373957 1241374158
1241376164 1241376243
1241376347 1241378393
1241379736 1241381956
1241382706 1241390460
1241391237 1241393223
1241455140 1241460140
1241479787 1241480468
1241480599 1241480601
1241481305 1241482257
1241496841 1241498544
1241543561 1241545751
1241725020 1241730120
1241730128 1241731918
1241819786 1241820195
1241824573 1241827164
1241827167 1241831865
1241885762 1241888838
1241888846 1241895041
1241895630 1241895779
1241899734 1241900082
1241902603 1241903688
1241906660 1241907067
1241907075 1241909323
1241909331 1241910763
1241910771 1241912375
1241912609 1241912666
1241993549 1241993569
1241993577 1241993641
1241993649 1241998105
1241998113 1241998281
1241998289 1242001169
1242001177 1242003129
1242003145 1242003997
1242013696 1242013803
1242013811 1242014096
1242018985 1242019080
1242040778 1242041023
1242041039 1242041065
1242042355 1242048535
1242048543 1242049071
1242049079 1242050263
1242050271 1242053127
1242053135 1242054767
1242054775 1242056639
1242056647 1242058239
1242058255 1242058844
1242059202 1242059287
1242059295 1242059583
1242059591 1242060695
1242060703 1242061855
1242061871 1242062535
1242062543 1242064175
1242084150 1242086959
1242086967 1242086990
1242153099 1242155529
1242160663 1242162351
1242162359 1242163151
1242163159 1242164142
1242176187 1242176295
1242176303 1242178245
1242178504 1242181955
1242186580 1242189159
1242189167 1242189378
1242399908 1242400054
1242485126 1242487304
1242487320 1242489688
1242489704 1242489728
1242489736 1242489951
1242489958 1242489960
1242489962 1242489964
1242489967 1242489970
1242491730 1242493046
1242493054 1242494070
1242494078 1242497254
1242497262 1242499038
1242499046 1242500198
1242500214 1242502326
1242502342 1242503342
1242503350 1242504001
1242590950 1242591479
1242674347 1242676124
1242676132 1242676236
1242676244 1242677826
1242678402 1242679220
1242679228 1242679252
1242987752 1242990896
1243089923 1243090503
1243090780 1243104126
1243104134 1243104710
1243104718 1243106826
1243195239 1243202590
1243242750 1243243720
1243267782 1243273614
1243362417 1243364603
1243367894 1243375598
1243378429 1243378772
1243510030 1243516425
1243695804 1243710591
1243710688 1243710993
1243719804 1243719876
1243719932 1243720004
1243796605 1243801253
1243814160 1243817219
1243843263 1243843264
1243843271 1243843273
1243843284 1243843285
1243843291 1243843292
1243843293 1243843294
1243843295 1243843296
1243843297 1243843298
1243843301 1243843304
1243843308 1243843311
1243843313 1243843314
1243843317 1243843320
1243843321 1243843322
1243843323 1243843324
1243843326 1243843338
1243843340 1243843346
1243843347 1243843352
1243843353 1243843356
1243843357 1243844005
1243844196 1243845339
1243882687 1243882827
1243900818 1243908074
1243913380 1243913940
1244226085 1244228395
1244230797 1244230906
1244296577 1244296688
1244296689 1244317695
1244409133 1244419982
1244507919 1244508088
1244509290 1244510580
1244511057 1244511929
1244521852 1244522010
1244567243 1244568254
1244689412 1244692784
1244760147 1244761794
1244791865 1244796740
1244860894 1244862921
1244863886 1244865958
1244900827 1244900842
1244911786 1244914385
1244915950 1244923439
1244925314 1244932021
1244933452 1244933660
1244958208 1244961047
1244963168 1244963400
1244964537 1244964883
1244966943 1244968296
1244970295 1244972774
1245005430 1245005432
1245006233 1245006788
1245006790 1245008730
1245011644 1245024313
1245144666 1245147380
1245149156 1245152921
1245182744 1245191814
1245244434 1245250589
1245297325 1245300118
1245300780 1245307090
1245369081 1245379166
1245380483 1245381281
1245388966 1245396780
1245509177 1245532919
1245551888 1245552119
1245557075 1245563275
1245610251 1245613576
1245615091 1245624239
1245631528 1245631538
1245708628 1245712886
1245805428 1245805563
1245808245 1245816093
1246043141 1246044869
1246114202 1246118564
1246121272 1246136443
1246141421 1246141447
1246224657 1246236286
1246250390 1246252342
1246256830 1246259637
1246297164 1246298427
1246303483 1246307444
1246360732 1246364920
1246368656 1246372761
1246418722 1246419854
1246432509 1246448460
1246451929 1246452223
1246824365 1246826701
1246935074 1246935163
1247036503 1247039391
1247131971 1247132052
1247185818 1247186228
1247231991 1247234121
1247235739 1247236879
1247239171 1247242061
1247325335 1247328340
1247330403 1247330568
1247330573 1247330575
1247330833 1247342128
1247344410 1247344538
1247349953 1247350874
1247488206 1247489668
1247489684 1247490764
1247508077 1247512396
1247512804 1247513942
1247514057 1247515297
1247535878 1247539808
1247758858 1247759127
1247848144 1247850449
1247943134 1247945142
1248032505 1248036209
1248038669 1248040732
1248041949 1248042111
1248069387 1248073724
1248123638 1248124898
1248126197 1248130246
1248224387 1248227074
1248354364 1248356727
1248575030 1248576873
1248648328 1248651835
1248652552 1248654111
1248655820 1248658122
1248659526 1248661205
1248665441 1248671621
1248715845 1248718640
1248720747 1248722718
1248728803 1248734852
1248736648 1248736940
1248783836 1248784280
1248796404 1248797183
1248829995 1248830128
1248911712 1248911788
1248954821 1248957762
1249081440 1249087962
1249102899 1249104019
1249137946 1249157115
1249158308 1249158566
1249192950 1249195391
1249243171 1249248623
1249248660 1249251331
1249252886 1249253510
1249253906 1249254413
1249262209 1249263012
1249333328 1249335937
1249743335 1249743393
1249743721 1249763785
1249766548 1249767975
1249772203 1249774444
1249847919 1249850899
1249854687 1249864752
1249923459 1249931608
1249938612 1249944070
1249944198 1249944210
1249944520 1249948833
1249950799 1249953840
1249955777 1249957684
1250005563 1250009365
1250290595 1250290646
1250357882 1250363440
1250377266 1250377317
1250460530 1250464275
1250532669 1250538442
1250543177 1250545975
1250551094 1250551601
1250795382 1250795924
1250795932 1250796725
1250796865 1250798172
1250798180 1250798212
1250798220 1250798631
1250798722 1250799189
1250951947 1250965440
1250968747 1250975277
1251057622 1251066741
1251068457 1251070691
1251125150 1251127948
1251136460 1251136978
1251154094 1251158288
1251393547 1251394668
1251396079 1251399688
1251520874 1251521139
1251557135 1251572387
1251572403 1251584792
1251662434 1251671182
1251671708 1251675008
1251676556 1251676781
1251731788 1251741031
1251760017 1251762852
1251859184 1251859255
1251913347 1251914179
1251914245 1251914268
1251914303 1251914492
1252161921 1252178411
1252179811 1252183528
1252184165 1252189234
1252267314 1252280987
1252443466 1252444588
1252444951 1252445045
1252445143 1252445154
1252447068 1252447612
1252765740 1252766785
1252767414 1252782588
1252785535 1252787875
1252804810 1252805368
1252872069 1252883543
1253035288 1253039127
1253332277 1253332432
1253334346 1253337634
1253371546 1253376875
1253379992 1253391988
1253476763 1253486980
1253546748 1253546820
1253555900 1253556018
1253557514 1253560462
1253646087 1253648765
1253818190 1253821476
1253836659 1253836758
1253838241 1253838349
1253838429 1253838819
1253839558 1253839694
1253839908 1253840045
1253976375 1253977218
