S190408an		- Apr 08 18:18
S190412m		- Apr 12 05:30
S190421ar		- Apr 21 21:38
S190425z		- Apr 25 08:18
S190426c		- Apr 26 15:21
S190503bf		- May 03 18:54
S190510g		- May 10 02:59
S190512at		- May 12 18:07
S190513bm		- May 13 20:54
S190517h		- May 17 05:51
S190519bj		- May 19 15:35
S190521g		- May 21 03:02
S190521r		- May 21 07:43
S190602aq		- Jun 02 17:59
S190630ag		- Jun 30 18:52
S190701ah		- Jul 01 20:33
S190706ai		- Jul 06 22:26
S190707q		- Jul 07 09:33
S190718y		- Jul 18 14:35
S190720a		- Jul 20 00:08
S190727h		- Jul 27 06:03
S190728q		- Jul 28 06:45
S190814bv		- Aug 14 21:10
S190828j		- Aug 28 06:34
S190828l		- Aug 28 06:55
S190901ap		- Sep 01 23:31
S190910d		- Sep 10 01:26
S190910h		- Sep 10 08:29
S190915ak		- Sep 15 23:57
S190923y		- Sep 23 12:55
S190924h		- Sep 24 02:18
