0 1256655642
1256656237 1256656245
1256656693 1256656701
1256663997 1256664005
1256667669 1256667677
1256668637 1256668645
1256672045 1256672053
1256687845 1256687853
1256694637 1256694645
1256696237 1256696245
1256701029 1256701037
1256702501 1256702509
1256705949 1256705957
1256707253 1256707261
1256708605 1256708613
1256711333 1256711341
1256714349 1256714357
1256723266 1256725615
1256726041 1256726057
1256730833 1256730841
1256732713 1256732721
1256734257 1256734265
1256737137 1256737145
1256741945 1256741961
1256747489 1256747497
1256749681 1256749689
1256752135 1256752144
1256753361 1256753472
1256756500 1256758563
1256758717 1256758725
1256759165 1256761790
1256767693 1256767701
1256770421 1256770429
1256779175 1256779326
1256779327 1256782151
1256795152 1256795168
1256795342 1256795358
1256798659 1256799153
1256805072 1256806471
1256808039 1256808047
1256808698 1256811657
1256815694 1256817455
1256819145 1256821150
1256830560 1256830568
1256831816 1256831824
1256837640 1256837648
1256839119 1256840641
1256841414 1256841422
1256842332 1256842333
1256842997 1256844498
1256846707 1256846715
1256848891 1256848899
1256849099 1256850536
1256855988 1256855996
1256859548 1256859556
1256859636 1256859644
1256859892 1256859900
1256860376 1256865595
1256865601 1256865627
1256865639 1256865673
1256865677 1256866258
1256866264 1256867782
1256872195 1256872203
1256874175 1256874176
1256875667 1256875683
1256878699 1256878707
1256880907 1256880915
1256882019 1256882075
1256882083 1256882115
1256882171 1256882187
1256883831 1256883832
1256884435 1256884443
1256884459 1256884467
1256885515 1256885523
1256885891 1256885899
1256886723 1256886779
1256886795 1256886803
1256886843 1256886851
1256886855 1256887074
1256887259 1256887267
1256887299 1256887307
1256887347 1256887351
1256887355 1256887802
1256888132 1256888294
1256888524 1256888532
1256888676 1256888684
1256888708 1256888717
1256888721 1256889056
1256889588 1256889597
1256889601 1256890185
1256890332 1256890340
1256890612 1256890621
1256890625 1256890808
1256891012 1256891020
1256891052 1256891060
1256891484 1256891508
1256891524 1256891532
1256891556 1256891558
1256891562 1256893165
1256893624 1256893632
1256893720 1256902000
1256902009 1256902219
1256902224 1256902308
1256902315 1256902398
1256902407 1256902439
1256902451 1256902483
1256902494 1256902634
1256902637 1256902787
1256902790 1256902888
1256904147 1256904155
1256904803 1256904811
1256905571 1256905587
1256905618 1256905619
1256905907 1256905915
1256906419 1256906427
1256906491 1256906499
1256908315 1256908323
1256908807 1256915258
1256915534 1256915542
1256916846 1256916854
1256917998 1256918006
1256919038 1256919046
1256919862 1256919870
1256920694 1256920702
1256921894 1256921902
1256921990 1256921998
1256922246 1256922254
1256922534 1256922550
1256923038 1256923046
1256923094 1256923102
1256923398 1256923406
1256925646 1256925654
1256926038 1256926046
1256926438 1256926454
1256928862 1256928870
1256929902 1256929910
1256930404 1256930408
1256930448 1256930452
1256930468 1256930472
1256931750 1256931758
1256932086 1256932094
1256932526 1256932534
1256933534 1256933542
1256933998 1256934014
1256938006 1256938014
1256938038 1256938054
1256939822 1256939830
1256940334 1256940342
1256940718 1256940726
1256941342 1256941350
1256941446 1256941454
1256941926 1256941934
1256942094 1256942102
1256943453 1256953160
1256953958 1256953966
1256955926 1256955934
1256957030 1256957038
1256959030 1256959046
1256960358 1256960366
1256962054 1256962062
1256962078 1256962094
1256963878 1256963886
1256965342 1256965358
1256965926 1256965942
1256966046 1256966054
1256966438 1256966446
1256966878 1256966886
1256968198 1256968206
1256969198 1256969206
1256969374 1256969382
1256969766 1256969774
1256970683 1256994465
1257004467 1257007351
1257011191 1257011198
1257025730 1257025738
1257025746 1257025762
1257027570 1257031830
1257033233 1257033277
1257043929 1257045338
1257060037 1257064161
1257068650 1257070715
1257076197 1257077442
1257082678 1257086655
1257088418 1257088456
1257088820 1257103290
1257124211 1257124219
1257150458 1257171329
1257171330 1257171338
1257189648 1257189668
1257193410 1257193418
1257202737 1257207684
1257213670 1257213678
1257285854 1257285862
1257286374 1257286382
1257286588 1257286590
1257290502 1257290510
1257291926 1257291934
1257293598 1257293606
1257294558 1257297053
1257297235 1257297243
1257303163 1257303171
1257304059 1257304067
1257304571 1257304579
1257305803 1257305819
1257308107 1257308115
1257308347 1257308355
1257309627 1257309635
1257310955 1257310963
1257313347 1257313355
1257315507 1257316897
1257317518 1257317526
1257319238 1257319246
1257321590 1257321598
1257322190 1257322206
1257325222 1257325230
1257325358 1257325374
1257325382 1257327706
1257335751 1257335759
1257341735 1257341743
1257347415 1257347423
1257348082 1257348083
1257348383 1257348391
1257353559 1257353567
1257356023 1257356031
1257359135 1257359143
1257360527 1257360535
1257361607 1257361615
1257361775 1257361783
1257364943 1257364951
1257367967 1257367975
1257370151 1257370159
1257370775 1257370783
1257372776 1257372792
1257373183 1257373191
1257374095 1257374103
1257374887 1257374895
1257378103 1257378111
1257379743 1257379751
1257379983 1257379991
1257381983 1257381991
1257384391 1257384399
1257385927 1257385935
1257386879 1257386887
1257388623 1257388631
1257390175 1257390183
1257391087 1257391103
1257391271 1257391279
1257392351 1257392359
1257392367 1257392375
1257393876 1257393880
1257393884 1257393888
1257393896 1257393900
1257393927 1257393935
1257394191 1257394199
1257394207 1257394215
1257394671 1257394687
1257394903 1257394911
1257397607 1257397615
1257399359 1257399367
1257400311 1257400319
1257400599 1257400607
1257401199 1257401207
1257401335 1257401343
1257402119 1257402127
1257402167 1257402183
1257402407 1257402415
1257402599 1257402607
1257403575 1257403583
1257403903 1257403919
1257404167 1257404175
1257404711 1257404727
1257405231 1257405239
1257405327 1257405335
1257405503 1257405519
1257406223 1257406231
1257406591 1257406599
1257407687 1257407695
1257408639 1257408655
1257412247 1257412250
1257412254 1257414551
1257415631 1257415639
1257416043 1257416051
1257421883 1257421891
1257430955 1257430963
1257433163 1257433171
1257435091 1257435099
1257449195 1257449203
1257455323 1257455331
1257455403 1257455411
1257456675 1257456683
1257456707 1257456715
1257458427 1257458435
1257464618 1257468420
1257472821 1257472829
1257473053 1257473061
1257473253 1257473261
1257476149 1257476157
1257477955 1257477956
1257479173 1257479181
1257483205 1257483213
1257484109 1257484117
1257489269 1257489277
1257490621 1257490629
1257494085 1257494093
1257495301 1257495317
1257496205 1257496213
1257497357 1257497365
1257497437 1257497445
1257498493 1257498501
1257498837 1257498845
1257502013 1257502021
1257504933 1257510144
1257510222 1257510230
1257531534 1257533080
1257552403 1257552411
1257553651 1257555883
1257569741 1257570717
1257574845 1257608017
1257608102 1257608110
1257608302 1257608310
1257608759 1257618336
1257619076 1257619084
1257620340 1257620348
1257621248 1257621252
1257621400 1257621416
1257621668 1257621676
1257621715 1257629741
1257629842 1257631421
1257632592 1257632600
1257634743 1257635983
1257639308 1257639340
1257642502 1257642503
1257642540 1257645823
1257646874 1257646876
1257647021 1257647022
1257652606 1257657023
1257658757 1257658773
1257660461 1257660477
1257662277 1257663498
1257665468 1257665476
1257666732 1257666740
1257670380 1257670388
1257670556 1257670560
1257670616 1257670620
1257670648 1257670652
1257670812 1257670828
1257671036 1257671040
1257671128 1257671132
1257671576 1257671580
1257671608 1257671612
1257671728 1257671732
1257671848 1257671852
1257671964 1257671968
1257671996 1257672000
1257672176 1257672180
1257672328 1257672332
1257672444 1257672448
1257672476 1257672480
1257672536 1257672540
1257672543 1257681281
1257681577 1257681585
1257681657 1257681665
1257682057 1257682065
1257682641 1257682649
1257682817 1257682825
1257682873 1257682881
1257683585 1257683593
1257683697 1257683705
1257683817 1257683825
1257683873 1257683881
1257684369 1257684377
1257684385 1257684393
1257684577 1257684585
1257685609 1257685617
1257685633 1257685641
1257686137 1257686145
1257686153 1257686161
1257686577 1257686585
1257686609 1257686617
1257687417 1257687425
1257687769 1257687785
1257688297 1257688305
1257688649 1257688657
1257688665 1257688673
1257688737 1257688745
1257689209 1257689225
1257689425 1257689433
1257689441 1257689449
1257689569 1257689577
1257689730 1257689731
1257690249 1257690257
1257690593 1257690601
1257690609 1257690617
1257690841 1257690849
1257691391 1257710135
1257731934 1257743609
1257744636 1257744637
1257761750 1257761799
1257762748 1257762819
1257771266 1257775133
1257777913 1257777962
1257781688 1257781769
1257784629 1257793072
1257839933 1257852942
1257857211 1257857212
1257859207 1257867063
1257884658 1257884659
1257892806 1257892807
1257905501 1257905510
1257910518 1257910646
1257921700 1257921701
1257941746 1257941748
1257967063 1257967064
1257971927 1257977062
1257977415 1257978916
1257982035 1257990057
1257990145 1257994246
1257996926 1258000621
1258001159 1258001160
1258002486 1258006959
1258019378 1258021560
1258021847 1258022384
1258037588 1258037589
1258050907 1258051009
1258057711 1258057712
1258058861 1258058862
1258065080 1258065081
1258078690 1258082069
1258119495 1258119615
1258125096 1258125216
1258127486 1258127494
1258127628 1258129114
1258141801 1258141802
1258169624 1258169625
1258176623 1258202803
1258216152 1258218007
1258226505 1258227816
1258229529 1258229649
1258253425 1258253545
1258255667 1258255675
1258261961 1258264631
1258265057 1258270458
1258270538 1258270539
1258272049 1258273922
1258275132 1258275440
1258283912 1258286234
1258294394 1258294971
1258295809 1258312080
1258313332 1258314875
1258315707 1258315827
1258331881 1258333542
1258335101 1258335109
1258335746 1258336677
1258344836 1258344956
1258353515 1258354666
1258355628 1258355636
1258359846 1258384031
1258390947 1258390955
1258407815 1258407935
1258452198 1258453001
1258477182 1258482782
1258483196 1258484522
1258485944 1258488577
1258489544 1258490548
1258524695 1258524815
1258536437 1258536539
1258537859 1258537979
1258546469 1258546581
1258559216 1258559336
1258560021 1258560269
1258587190 1258587313
1258593501 1258593503
1258593544 1258593560
1258593825 1258594478
1258594706 1258597092
1258599095 1258599096
1258599237 1258602529
1258611300 1258614108
1258616400 1258625601
1258625767 1258625967
1258626690 1258627854
1258628830 1258630061
1258638501 1258638950
1258645622 1258645742
1258659376 1258659496
1258673290 1258673410
1258691669 1258691789
1258704961 1258704969
1258707578 1258720902
1258721710 1258727778
1258728091 1258728107
1258730723 1258730861
1258733226 1258733346
1258740851 1258740971
1258745330 1258746416
1258772176 1258807661
1258826687 1258831139
1258856286 1258857537
1258875065 1258875073
1258875078 1258881970
1258882406 1258882526
1258892776 1258893503
1258897175 1258920324
1258920562 1258921825
1258931939 1258933197
1258933534 1258933535
1258938170 1258938290
1258939196 1258940449
1258947175 1258949100
1258950716 1258954058
1258955625 1258956949
1258960599 1258962938
1258965355 1258966690
1258966880 1258970021
1258980605 1258980629
1258982537 1258998154
1258998514 1258998536
1259002300 1259002301
1259006392 1259008870
1259013636 1259013652
1259016610 1259016611
1259024889 1259024890
1259038350 1259039338
1259053509 1259053510
1259053655 1259056474
1259058700 1259058701
1259058816 1259061502
1259061847 1259063997
1259064016 1259071904
1259074765 1259074766
1259077159 1259077183
1259077589 1259077590
1259079971 1259079972
1259080752 1259080753
1259100312 1259100962
1259102964 1259102980
1259115304 1259115596
1259127600 1259127616
1259136444 1259146820
1259159886 1259159887
1259161380 1259161396
1259163985 1259163986
1259170704 1259170720
1259178796 1259178812
1259179100 1259179116
1259183843 1259183844
1259200000 1259200016
1259200036 1259200052
1259211059 1259211060
1259218428 1259228827
1259230387 1259230388
1259234300 1259234301
1259235389 1259235390
1259243780 1259243796
1259247074 1259247075
1259254330 1259254331
1259270044 1259272226
1259273329 1259273330
1259284692 1259284708
1259294387 1259294388
1259295379 1259295381
1259300923 1259304654
1259305195 1259305197
1259305398 1259305399
1259305412 1259305413
1259308837 1259325132
1259367305 1259367306
1259385788 1259385804
1259389995 1259416416
1259416536 1259416537
1259418161 1259419206
1259421664 1259421665
1259424188 1259424204
1259429497 1259430654
1259435486 1259435487
1259436944 1259438140
1259439976 1259439977
1259440590 1259440591
1259441460 1259441461
1259442424 1259442425
1259442538 1259442539
1259444599 1259444600
1259446188 1259446189
1259449378 1259449379
1259453166 1259453167
1259456519 1259457873
1259460897 1259460898
1259463577 1259465086
1259467695 1259467696
1259474097 1259474098
1259477221 1259477229
1259483049 1259483050
1259483810 1259483811
1259484255 1259484256
1259485497 1259485498
1259486613 1259486614
1259489933 1259489941
1259489962 1259492263
1259492735 1259495121
1259495239 1259497648
1259498308 1259504000
1259505686 1259517375
1259521821 1259525375
1259566194 1259589623
1259594769 1259595445
1259599561 1259599609
1259615546 1259615554
1259649722 1259649723
1259668458 1259668610
1259676557 1259676588
1259677650 1259677666
1259677674 1259677690
1259677698 1259677714
1259677730 1259677738
1259687410 1259688638
1259695868 1259697210
1259709272 1259709792
1259736147 1259738405
1259761255 1259763815
1259767675 1259767915
1259811718 1259813488
1259824098 1259824215
1259837510 1259840754
1259858604 1259858898
1259866192 1259866363
1259870585 1259870710
1259874977 1259875160
1259875176 1259875313
1259877018 1259877080
1259894419 1259897052
1259897849 1259953524
1259962134 1259962142
1259965648 1259966037
1259973309 1259973401
1259986294 1259986302
1259992858 1259995783
1259996665 1260018416
1260036397 1260038336
1260052675 1260057829
1260066314 1260067504
1260067961 1260068052
1260081788 1260084129
1260085937 1260087066
1260087893 1260088180
1260104363 1260128735
1260147710 1260147856
1260162334 1260164455
1260170010 1260170147
1260171781 1260196431
1260199827 1260199835
1260219642 1260219844
1260238605 1260238900
1260252730 1260252882
1260262716 1260263978
1260263980 1260265047
1260265049 1260265450
1260268520 1260268578
1260270880 1260271580
1260272193 1260272545
1260273937 1260276954
1260276956 1260284735
1260302456 1260302657
1260307145 1260307872
1260315866 1260316275
1260332304 1260332368
1260355124 1260355184
1260377812 1260377828
1260377884 1260377900
1260377916 1260377924
1260378202 1260378264
1260405494 1260405616
1260406572 1260406670
1260426772 1260433720
1260479156 1260479172
1260481004 1260481020
1260518918 1260534593
1260536139 1260539470
1260540183 1260540461
1260549389 1260549472
1260598604 1260620880
1260626823 1260626859
1260634484 1260635333
1260635347 1260635502
1260639751 1260639982
1260687405 1260687527
1260709542 1260734089
1260735731 1260737662
1260779430 1260789462
1260790142 1260790152
1260790359 1260791917
1260794521 1260796394
1260796396 1260797228
1260813968 1260813980
1260815999 1260816139
1260818544 1260818987
1260819269 1260821018
1260821138 1260821326
1260826196 1260826468
1260832048 1260832109
1260832123 1260832277
1260832289 1260832366
1260832383 1260833041
1260835316 1260835371
1260838788 1260840345
1260840835 1260843659
1260862072 1260862276
1260886897 1260887403
1260897637 1260897638
1260901337 1260905718
1260907226 1260908481
1260931317 1260931433
1260934864 1260935432
1260935441 1260935546
1260944112 1260944223
1260954451 1260956089
1260956948 1260962524
1260964480 1260976235
1260978108 1260978129
1260981698 1260982066
1261005383 1261006644
1261008902 1261012874
1261015541 1261017192
1261019907 1261021435
1261022670 1261025124
1261025753 1261038330
1261059092 1261061078
1261074693 1261074862
1261087713 1261095997
1261115082 1261115235
1261120119 1261121525
1261122698 1261123453
1261135192 1261136834
1261159833 1261162211
1261168293 1261169893
1261172292 1261173535
1261202420 1261204938
1261207046 1261225024
1261282668 1261285259
1261320315 1261320379
1261321339 1261339374
1261357071 1261357396
1261360330 1261360879
1261443619 1261443635
1261463573 1261470472
1261473931 1261474416
1261501126 1261501824
1261505904 1261505912
1261551644 1261551810
1261591316 1261592712
1261638192 1261638348
1261643390 1261643441
1261664748 1261665439
1261672801 1261673411
1261674798 1261674818
1261703571 1261707046
1261732225 1261739239
1261800947 1261800955
1261808442 1261810962
1261811143 1261821020
1261821570 1261823962
1261827337 1261827438
1261830570 1261830684
1261899926 1261899928
1261924223 1261924283
1261925212 1261943901
1261995833 1261998409
1262093329 1262093469
1262118338 1262118647
1262128835 1262129143
1262192988 1262193380
1262197881 1262198013
1262294858 1262295316
1262319650 1262319652
1262357909 1262358911
1262361508 1262362207
1262369347 1262369349
1262405998 1262406142
1262412153 1262414988
1262416163 1262430218
1262431359 1262432601
1262433008 1262434583
1262434591 1262441520
1262441808 1262448449
1262448468 1262452724
1262452801 1262454991
1262455030 1262545296
1262545689 1262547443
1262578918 1262580585
1262595908 1262605894
1262627852 1262628150
1262675864 1262676041
1262909219 1262909551
1262924699 1262925519
1262927770 1262927862
1262938621 1262940038
1262946475 1262946785
1262960480 1262960591
1262960847 1262961449
1263016869 1263019557
1263020945 1263020953
1263021025 1263090746
1263096766 1263096774
1263098782 1263098790
1263108558 1263108566
1263110169 1263117432
1263119650 1263120185
1263121112 1263128115
1263128117 1263129222
1263132864 1263135023
1263136225 1263154328
1263164344 1263164869
1263203173 1263212592
1263216136 1263221600
1263227952 1263232628
1263248248 1263248256
1263254480 1263254488
1263258648 1263258656
1263267008 1263267016
1263268960 1263268968
1263273072 1263273088
1263273432 1263273440
1263273575 1263274798
1263280253 1263281518
1263282285 1263297072
1263314747 1263318540
1263342917 1263344142
1263455311 1263468011
1263469703 1263469711
1263470943 1263470951
1263471927 1263471935
1263472695 1263472703
1263473391 1263473407
1263476583 1263476599
1263477453 1263478887
1263489178 1263499080
1263503276 1263509698
1263512540 1263515990
1263515992 1263574683
1263578173 1263580117
1263621727 1263642847
1263647779 1263668933
1263670081 1263670089
1263674234 1263677546
1263712695 1263720974
1263721806 1263736897
1263740496 1263740573
1263741545 1263761120
1263774539 1263774665
1263776414 1263776489
1263783278 1263789463
1263790143 1263821244
1263821246 1263821776
1263821778 1263821802
1263830674 1263834098
1263836936 1263837168
1263837768 1263837796
1263841752 1263841839
1263842072 1263842101
1263886286 1263887850
1263897854 1263897862
1263904232 1263904278
1263924034 1263981234
1263981245 1263981405
1263984665 1263984689
1263984921 1263984929
1263988337 1263988345
1263997041 1263997065
1263999557 1263999722
1264000232 1264002260
1264003877 1264006932
1264006972 1264007141
1264011857 1264011865
1264015024 1264015040
1264017514 1264017858
1264018142 1264018150
1264019251 1264021069
1264021177 1264021185
1264021414 1264022133
1264024897 1264024955
1264043311 1264045064
1264045114 1264045192
1264075612 1264075620
1264106330 1264106974
1264141521 1264142762
1264144526 1264145270
1264166280 1264170383
1264171934 1264206934
1264206936 1264207121
1264212709 1264215374
1264230422 1264294996
1264339806 1264345199
1264345201 1264359333
1264411208 1264421309
1264430572 1264435709
1264441737 1264443654
1264443656 1264445082
1264447996 1264448012
1264498787 1264498938
1264501695 1264502082
1264503732 1264503818
1264504555 1264504926
1264515437 1264517361
1264523811 1264523975
1264554499 1264554643
1264628955 1264628963
1264672436 1264672481
1264701000 1264701055
1264761309 1264761452
1264761454 1264763492
1264763494 1264763969
1264775895 1264776588
1264776590 1264777689
1264777691 1264787820
1264825032 1264828653
1264831411 1264834058
1264834120 1264834140
1264834790 1264872588
1264873760 1264876654
1264877289 1264879690
1264905809 1264911124
1264914968 1264915297
1264920991 1264921845
1264928541 1264929822
1264932847 1264950277
1264951199 1264970934
1265007400 1265009362
1265015852 1265016589
1265029130 1265045677
1265046757 1265049232
1265099096 1265099471
1265101813 1265103351
1265105232 1265106818
1265107377 1265110221
1265121625 1265121742
1265127224 1265127585
1265316329 1265316331
1265366119 1265370256
1265379746 1265381531
1265398688 1265399938
1265412093 1265412557
1265413277 1265417163
1265421880 1265425657
1265425801 1265427593
1265431253 1265431261
1265436057 1265438604
1265440354 1265462070
1265473261 1265473262
1265474005 1265475184
1265494975 1265496426
1265536091 1265550739
1265551918 1265551977
1265552960 1265553023
1265553025 1265570971
1265580750 1265588962
1265609462 1265609470
1265618846 1265618854
1265620853 1265623580
1265624510 1265631923
1265633417 1265650642
1265651164 1265651221
1265651638 1265651710
1265652295 1265652379
1265653750 1265653897
1265673761 1265673865
1265676185 1265677343
1265678301 1265687934
1265693626 1265693634
1265704529 1265704661
1265709653 1265709771
1265728531 1265729431
1265746077 1265747638
1265852330 1265852338
1265857186 1265857194
1265869617 1265869702
1265896450 1265896618
1265964292 1265975343
1265979398 1265979591
1265980000 1265990240
1266032612 1266032620
1266037805 1266039220
1266040859 1266044030
1266044432 1266064699
1266069415 1266076024
1266076098 1266077439
1266078407 1266078460
1266079153 1266080330
1266148246 1266148254
1266157062 1266157135
1266158016 1266176194
1266209000 1266209052
1266217512 1266218950
1266221678 1266234981
1266236112 1266238553
1266239179 1266246212
1266257452 1266266425
1266267045 1266280146
1266280498 1266286214
1266299169 1266300291
1266303319 1266305590
1266306033 1266307240
1266307661 1266308989
1266309556 1266310783
1266312942 1266312982
1266314829 1266314872
1266316731 1266316762
1266318767 1266318825
1266334000 1266334069
1266335763 1266339620
1266340888 1266340953
1266342633 1266342644
1266345027 1266345141
1266363320 1266368202
1266379934 1266381018
1266382775 1266421304
1266421904 1266424906
1266424988 1266442958
1266443638 1266445753
1266452795 1266452797
1266452883 1266454349
1266455998 1266457929
1266463037 1266464201
1266466742 1266478866
1266479410 1266495224
1266495335 1266495337
1266509544 1266513178
1266536822 1266538684
1266548193 1266549753
1266565525 1266567438
1266603868 1266603888
1266633817 1266633941
1266645628 1266648536
1266649403 1266669554
1266672431 1266672760
1266689446 1266690819
1266691346 1266692536
1266711215 1266779829
1266786233 1266787988
1266811104 1266811216
1266831471 1266831539
1266832694 1266832973
1266834062 1266841407
1266841763 1266864643
1266867296 1266867316
1266873768 1266876127
1266881379 1266881596
1266886076 1266887454
1266887738 1266889230
1266898426 1266899412
1266911740 1266929570
1266935261 1266940117
1267039717 1267039726
1267039748 1267043144
1267099811 1267100215
1267126533 1267128321
1267128521 1267138375
1267176123 1267176251
1267177534 1267180069
1267180552 1267180691
1267193646 1267198238
1267199594 1267202023
1267204019 1267204163
1267204559 1267204684
1267205123 1267205380
1267205717 1267205849
1267206325 1267206497
1267213989 1267214133
1267224185 1267225782
1267228435 1267230578
1267242272 1267247900
1267250498 1267268572
1267268822 1267268824
1267269174 1267269176
1267270658 1267270814
1267273555 1267273620
1267276956 1267283722
1267286207 1267286254
1267286724 1267286777
1267287531 1267289400
1267293037 1267293159
1267320430 1267322235
1267344140 1267349357
1267366141 1267366186
1267367116 1267385294
1267435713 1267444365
1267444453 1267469146
1267477492 1267478928
1267479345 1267479378
1267485718 1267485817
1267486703 1267489804
1267491984 1267492058
1267520766 1267522787
1267523213 1267523335
1267529003 1267529086
1267530359 1267533170
1267536393 1267536781
1267537159 1267537243
1267547264 1267549406
1267590289 1267590392
1267605040 1267606724
1267627495 1267630396
1267650970 1267651175
1267773452 1267798887
1267806678 1267808674
1267816844 1267816860
1267841564 1267841702
1267855331 1267858088
1267858881 1267878637
1267879215 1267879223
1267881468 1267882723
1267882915 1267896866
1267903728 1267903736
1267905360 1267905512
1267937769 1267939176
1267957113 1267958764
1267965256 1267965780
1267971207 1267971255
1267972196 1267988422
1267989781 1267990955
1268020659 1268020667
1268034474 1268049656
1268054023 1268055254
1268055721 1268055730
1268058881 1268062183
1268144973 1268145395
1268184105 1268184113
1268219225 1268219233
1268220873 1268220881
1268220889 1268220905
1268220913 1268220977
1268221001 1268221010
1268221030 1268222535
1268222861 1268222893
1268280784 1268280808
1268305787 1268305795
1268374052 1268374554
1268386491 1268388402
1268390327 1268396005
1268410156 1268413125
1268459200 1268480599
1268480901 1268485405
1268492125 1268493462
1268496145 1268503472
1268507800 1268507824
1268537918 1268537950
1268544403 1268544740
1268573335 1268593326
1268604699 1268612761
1268614737 1268616206
1268633235 1268673776
1268724600 1268726992
1268787302 1268790416
1268848076 1268848086
1268853392 1268853432
1268889950 1268894754
1268905794 1268905853
1268908989 1268909054
1268912104 1268912136
1268913004 1268913050
1268936125 1268936243
1268950403 1268950502
1268971815 1268971935
1268982267 1268982270
1268987175 1268988255
1268988608 1268988610
1268989238 1269007178
1269007774 1269007823
1269020396 1269020436
1269020903 1269023878
1269026244 1269027766
1269065823 1269085113
1269092171 1269114727
1269114729 1269115718
1269136733 1269151279
1269152999 1269153083
1269153831 1269153910
1269158616 1269158700
1269159518 1269159604
1269161684 1269161907
1269161909 1269166127
1269166216 1269166293
1269175612 1269177124
1269179596 1269190796
1269191719 1269210233
1269241202 1269245912
1269250513 1269259610
1269273506 1269273559
1269276394 1269276438
1269288366 1269303156
1269313569 1269313577
1269326255 1269326324
1269347265 1269347273
1269347281 1269347289
1269363618 4000000000
