1238256635 1238261264
1238266178 1238266279
1238347246 1238349531
1238866526 1238872342
1239472490 1239472556
1239473184 1239473305
1240070184 1240070235
1240070239 1240075083
1240083697 1240083750
1240090142 1240093622
1240685334 1240685373
1240685824 1240686352
1240809842 1240844536
1241162282 1241197563
1241218457 1241218609
1241218716 1241219726
1241219834 1241220209
1241221633 1241221709
1241288151 1241288532
1241289538 1241289913
1241291655 1241292030
1241292297 1241292672
1241334263 1241336346
1241336347 1241336548
1241867687 1241868074
1241871977 1241872366
1241874947 1241875334
1241889377 1241889763
1241893661 1241893663
1242498448 1242498857
1243700010 1243705278
1243707287 1243707349
1244303955 1244308008
1244312613 1244312661
1244418094 1244418426
1244856452 1244858333
1245521534 1245541284
1245760518 1245760905
1246127058 1246127100
1246731438 1246731513
1247337493 1247337546
1247401129 1247401539
1247469529 1247470005
1247749609 1247749996
1247837780 1247841614
1247841661 1247842062
1247981642 1247985028
1247985029 1247985424
1247985430 1247985431
1247988728 1247989117
1248537920 1248537921
1248547791 1248548492
1249147989 1249151647
1250960446 1250960692
1250960716 1250960796
1251153883 1251154982
1252166729 1252170481
1252234470 1252234472
1252234496 1252234497
1252234514 1252234516
1252234517 1252234521
1252234586 1252237845
1252276608 1252277009
1252775599 1252777243
