# chunk	liveTime_cat0	liveTime_cat1	liveTime_cat2

# chunk     liveTime_cat0(sec)    liveTime_cat0(days)     liveTime_cat1(sec)    liveTime_cat1(days)     liveTime_cat2(sec)    liveTime_cat2(days)
K23                 350396                   4.06                 350396                   4.06                 348892                   4.04
K24                 419535                   4.86                 419535                   4.86                 417627                   4.83
K25                 395603                   4.58                 394320                   4.56                 393323                   4.55
K26                 322360                   3.73                 322360                   3.73                 321554                   3.72
K27                 379052                   4.39                 379052                   4.39                 378060                   4.38
K28                 398690                   4.61                 398690                   4.61                 396964                   4.59
K29                 507898                   5.88                 507898                   5.88                 506140                   5.86
K30                 534785                   6.19                 534785                   6.19                 532635                   6.16
K31                 429232                   4.97                 429232                   4.97                 425770                   4.93
K32                 307607                   3.56                 307607                   3.56                 306537                   3.55
K33                 450312                   5.21                 450312                   5.21                 443228                   5.13
K34                 405600                   4.69                 405600                   4.69                 402352                   4.66
K35                 415543                   4.81                 415543                   4.81                 413688                   4.79
K36                 351733                   4.07                 351733                   4.07                 346442                   4.01
K37                 396558                   4.59                 396558                   4.59                 395641                   4.58
K38                 415516                   4.81                 415344                   4.81                 413343                   4.78
K39                 446897                   5.17                 446897                   5.17                 445760                   5.16
