1126051217 1127075235
1127075237 1127075742
1127075744 1127173426
1127173428 1127175853
1127175855 1127179822
1127179824 1127276643
1127276647 1127276804
1127276808 1127277031
1127277035 1127277298
1127277302 1127277522
1127277526 1127277845
1127277849 1127278110
1127278113 1127278214
1127278217 1127278753
1127278756 1127279098
1127279101 1127279525
1127279528 1127279649
1127279652 1127280128
1127280131 1127280438
1127280441 1127281237
1127281240 1127281961
1127281964 1127282018
1127282021 1127282071
1127282074 1127282126
1127282128 1127282179
1127282181 1127282232
1127282234 1127282284
1127282286 1127282332
1127282334 1127282383
1127282385 1127282428
1127282430 1127282482
1127282484 1127282523
1127282525 1127282582
1127282585 1127282636
1127282639 1127282686
1127282689 1127282733
1127282735 1127282776
1127282778 1127282825
1127282827 1127282970
1127282972 1127283013
1127283015 1127283054
1127283056 1127283095
1127283097 1127283166
1127283168 1127283210
1127283212 1127283251
1127283253 1127283298
1127283300 1127283344
1127283346 1127283446
1127283448 1127683332
1127683336 1127684763
1127684767 1127685140
1127685144 1127783818
1127783821 1127789373
1127789375 1128124330
1128124333 1128125231
1128125233 1128126131
1128126133 1128127031
1128127033 1128127930
1128127933 1128128831
1128128833 1128129731
1128129733 1128130631
1128130633 1128657862
1128657864 1128658222
1128658224 1128658582
1128658584 1128658942
1128658944 1128659302
1128659304 1128666022
1128666024 1128666382
1128666384 1128666742
1128666744 1128667102
1128667104 1128667462
1128667464 1128667822
1128667824 1128668182
1128668184 1128668542
1128668544 1128668902
1128668904 1128669262
1128669264 1128669622
1128669624 1128669982
1128669984 1128670342
1128670344 1128670702
1128670704 1128671062
1128671064 1128671422
1128671424 1128671782
1128671784 1128672502
1128672504 1129404545
1129404546 1131397644
1131397647 1134345929
1134345931 1134353734
1134353735 1134354934
1134354935 1134356134
1134356135 1134359806
1134359807 1134361005
1134361007 1134362206
1134362207 1134363405
1134363407 1134364606
1134364607 1136584228
1136584237 1136586138
1136586147 1136587238
1136587247 1136588337
1136588346 1136589438
1136589446 1136590538
1136590546 1136591638
1136591647 1136592738
1136592747 1136593838
1136593848 1136594938
1136594947 1136965822
1136966168 1137030022
1137030368 1137215422
1137215768 1137254417
