1164559440 1164559654
1164560599 1164561392
1164562093 1164569775
1164569814 1164574892
1164596667 1164603464
1164603474 1164603521
1164664648 1164665292
1164667198 1164669773
1164672969 1164673502
1164673578 1164674319
1164674812 1164700282
1164700373 1164745005
1164745711 1164747075
1164750309 1164756094
1164756280 1164756395
1164756462 1164756768
1164757097 1164758199
1164769704 1164770015
1164770147 1164793991
1164811999 1164853576
1164853675 1164954629
1164961121 1164961951
1164962290 1164988975
1165024248 1165024697
1165026480 1165039808
1165044516 1165053952
1165055780 1165071815
1165072230 1165077235
1165097976 1165098128
1165098172 1165100866
1165109312 1165110360
1165111275 1165171824
1165171924 1165191021
1165191088 1165191416
1165191478 1165191617
1165192405 1165192464
1165193313 1165212580
1165217978 1165220136
1165220431 1165226046
1165229548 1165230356
1165232740 1165234173
1165237671 1165242739
1165243069 1165243918
1165303790 1165305252
1165307309 1165309205
1165313314 1165314111
1165320702 1165321623
1165327222 1165346644
1165366926 1165372309
1165372616 1165432799
1165433109 1165435738
1165435779 1165453202
1165453497 1165503811
1165508628 1165518947
1165519432 1165531175
1165531632 1165597012
1165597015 1165597123
1165614915 1165616005
1165616374 1165680798
1165701922 1165718375
1165727656 1165751638
1165753457 1165769184
1165772071 1165781556
1165794106 1165797971
1165804252 1165806691
1165813872 1165822892
1165823193 1165823928
1165824160 1165829538
1165831525 1165842926
1165844915 1165858144
1165859747 1165887625
1165888127 1165890483
1165892400 1165932770
1165937371 1165939162
1165941732 1165950419
1165951133 1165954071
1165957190 1165967631
1165973512 1165997946
1165998362 1166005947
1166311984 1166316395
1166324111 1166325112
1166328752 1166371139
1166372166 1166372671
1166386147 1166395467
1166399103 1166417343
1166417892 1166422279
1166426531 1166461369
1166470234 1166482895
1167534141 1167609738
1167610190 1167610345
1167621300 1167628469
1167629025 1167665426
1167666387 1167670159
1167680478 1167680642
1167682623 1167689456
1167689863 1167706610
1167707103 1167722555
1167726591 1167736022
1167739196 1167740431
1167746056 1167753257
1167764813 1167768225
1167774558 1167776363
1167779841 1167784089
1167791712 1167794328
1167797597 1167814502
1167827417 1167828892
1167832446 1167836958
1167857070 1167857850
1167860944 1167942126
1167951962 1167953435
1168034363 1168040718
1168046720 1168065430
1168076706 1168078176
1168081852 1168099885
1168123405 1168124418
1168127329 1168147490
1168195847 1168199118
1168200320 1168206318
1168207820 1168208625
1168209449 1168211328
1168217420 1168227516
1168230258 1168255223
1168256004 1168259465
1168261934 1168280047
1168280191 1168293739
1168301796 1168306176
1168306242 1168347760
1168348107 1168353018
1168359320 1168362018
1168386626 1168388892
1168396518 1168399093
1168400094 1168413573
1168491509 1168503265
1168503721 1168510582
1168645757 1168646909
1168647715 1168648612
1168650301 1168651600
1168652841 1168668969
1168688756 1168692544
1168692785 1168695812
1168807998 1168817473
1168825167 1168825873
1168826838 1168833703
1168847832 1168902680
1168919503 1168950618
1168952420 1168972317
1168977184 1168978382
1168981269 1169010110
1169015472 1169058225
1169069015 1169075954
1169086769 1169095413
1169120580 1169130566
1169138617 1169146372
1169162653 1169162997
1169165766 1169174709
1169178282 1169205165
1169209571 1169226034
1169229744 1169230412
1169232699 1169272948
1169275988 1169288484
1169290831 1169291420
1169293904 1169308839
1169335722 1169340918
1169340968 1169341684
1169344953 1169357578
1169361477 1169395694
1169405061 1169416751
1169417399 1169417943
1169424372 1169494899
1169498395 1169561512
1169564404 1169567911
1169568313 1169578576
1169579014 1169657038
1169661117 1169670004
1169670776 1169671821
1169672011 1169731140
1169733766 1169734565
1169736556 1169757722
1169759500 1169773136
1169775921 1169829189
1169831089 1169831297
1169831395 1169910318
1169944903 1169991714
1169997322 1170019108
1170033213 1170034120
1170037775 1170038367
1170042399 1170042905
1170045770 1170046262
1170059394 1170090181
1170092936 1170173137
1170174690 1170210463
1170211868 1170212473
1170213044 1170223413
1170226175 1170234990
1170237530 1170388055
1170390527 1170405111
1170406219 1170434160
1170434164 1170444734
1170445413 1170455149
1170455726 1170460683
1170470866 1170473681
1170480440 1170481111
1170481115 1170481129
1170484524 1170484960
1170484984 1170486076
1170486112 1170487777
1170488249 1170504805
1170507235 1170517830
1170551366 1170551737
1170551741 1170552277
1170552283 1170552432
1170552441 1170553833
1170553837 1170554177
1170554183 1170554432
1170554443 1170554568
1170554576 1170554880
1170554952 1170555260
1170563281 1170563424
1170563438 1170563572
1170563578 1170564636
1170564641 1170565056
1170565094 1170565157
1170565167 1170565212
1170565218 1170565661
1170565678 1170566197
1170566203 1170566356
1170566367 1170567800
1170567810 1170567877
1170567888 1170568632
1170568643 1170568927
1170568931 1170569811
1170569818 1170572257
1170572261 1170572399
1170572429 1170572530
1170572539 1170573048
1170573051 1170573597
1170573608 1170573642
1170573651 1170573672
1170573686 1170573747
1170573754 1170573820
1170573823 1170573858
1170573866 1170574740
1170574747 1170575251
1170575257 1170577386
1170577392 1170577445
1170577450 1170578038
1170578045 1170578437
1170578447 1170579078
1170579082 1170581954
1170581959 1170584166
1170584173 1170584876
1170584890 1170585238
1170585245 1170602986
1170602989 1170670569
1170677563 1170680718
1170693020 1170702258
1170702736 1170744979
1170744989 1170745120
1170745123 1170745184
1170745208 1170745847
1170745854 1170745888
1170745895 1170746344
1170746354 1170746540
1170746546 1170746613
1170746622 1170746688
1170746697 1170746745
1170746749 1170746863
1170746868 1170746908
1170746914 1170747003
1170747014 1170747129
1170747136 1170747156
1170747161 1170747242
1170747246 1170747291
1170747297 1170747461
1170747468 1170747516
1170747521 1170747570
1170747576 1170747744
1170747764 1170747816
1170758965 1170772165
1170772172 1170772208
1170772232 1170772334
1170772356 1170772440
1170772449 1170772526
1170772569 1170772603
1170772627 1170772672
1170772777 1170772868
1170772879 1170772945
1170772975 1170773007
1170773020 1170773149
1170773158 1170773176
1170782626 1170783827
1170784483 1170802815
1170802901 1170802918
1170802949 1170814112
1170819744 1170820925
1170822686 1170823695
1170823702 1170823718
1170829066 1170897069
1170897180 1170906761
1170910933 1170911528
1170911654 1170945704
1170949796 1170950685
1170952437 1171006100
1171012704 1171057506
1171057512 1171103004
1171103476 1171123686
1171162567 1171163858
1171164076 1171186548
1171190676 1171217094
1171219208 1171284208
1171290228 1171300944
1171314513 1171314595
1171324465 1171330276
1171331873 1171392584
1171394973 1171402161
1171402285 1171402972
1171403080 1171431030
1171442112 1171529220
1171529390 1171529645
1171531847 1171618584
1171620863 1171630910
1171636468 1171637007
1171644002 1171683060
1171685589 1171722617
1171725494 1171729170
1171729173 1171730164
1171745142 1171836627
1171836632 1171837114
1171837118 1171845651
1171846032 1171865396
1171872951 1171922674
1171924947 1171939747
1171939786 1171974803
1171978557 1171992471
1172024211 1172046890
1172058407 1172062779
1172065285 1172076337
1172076823 1172135301
1172135803 1172152802
1172154191 1172270917
1172270921 1172276821
1172276825 1172292309
1172292620 1172333089
1172362758 1172370989
1172371033 1172387592
1172388012 1172395489
1172395494 1172402517
1172402523 1172404228
1172410623 1172425773
1172425779 1172431156
1172447192 1172447703
1172448396 1172463759
1172470244 1172472785
1172476825 1172506288
1172506812 1172565198
1172565715 1172602716
1172602729 1172606424
1172612537 1172619311
1172619603 1172634627
1172634648 1172634662
1172634666 1172634681
1172634684 1172634698
1172634704 1172638901
1172642752 1172643341
1172644109 1172709598
1172712319 1172724659
1172728123 1172732295
1172735065 1172740729
1172746631 1172746686
1172753092 1172758311
1172759186 1172786475
1172787085 1172792007
1172798629 1172799756
1172799853 1172812065
1172819075 1172822367
1172826755 1172835843
1172835864 1172844087
1172844091 1172849697
1172850005 1172858602
1172873386 1172937334
1172963684 1172973746
1172977289 1172979886
1172986826 1172987464
1172987697 1173016814
1173017446 1173028939
1173028944 1173033081
1173033101 1173054841
1173059279 1173059715
1173059745 1173060210
1173061369 1173070650
1173075303 1173076079
1173076323 1173100667
1173100694 1173114716
1173116020 1173122439
1173128431 1173136402
1173141413 1173165552
1173171307 1173171603
1173171732 1173187847
1173188679 1173203660
1173207542 1173231577
1173233419 1173233454
1173233674 1173309698
1173342951 1173343717
1173346581 1173367688
1173367962 1173373440
1173373952 1173400844
1173407803 1173419426
1173423236 1173539178
1173573161 1173574005
1173579478 1173580473
1173583965 1173593675
1173595651 1173628492
1173630531 1173637714
1173641573 1173643599
1173644421 1173653021
1173654883 1173658640
1173658791 1173659039
1173659148 1173673886
1173673889 1173715470
1173715621 1173715856
1173716136 1173716438
1173716863 1173717010
1173717126 1173717430
1173718072 1173750209
1173753147 1173807041
1173812946 1173826277
1173826677 1173856825
1173859324 1173900023
1173900028 1173900481
1173900495 1173901324
1173901327 1173901843
1173901851 1173901946
1173901963 1173902017
1173906065 1173906375
1173906378 1173906418
1173906421 1173906580
1173906586 1173906717
1173906722 1173906785
1173919283 1173976601
1173976626 1174063138
1174065526 1174065547
1174069842 1174069983
1174074153 1174144518
1174172592 1174184899
1174192897 1174241222
1174257202 1174261927
1174265122 1174272527
1174355652 1174355683
1174355832 1174386435
1174388993 1174405033
1174405510 1174422117
1174423522 1174424386
1174424391 1174445831
1174449013 1174525560
1174528914 1174563517
1174563892 1174603976
1174603981 1174617878
1174617883 1174648419
1174655960 1174683222
1174683875 1174684546
1174685490 1174701495
1174701583 1174716299
1174718427 1174748788
1174770807 1174775677
1174778291 1174786997
1174787000 1174796291
1174813304 1174813482
1174816071 1174817126
1174819583 1174821274
1174821442 1174822486
1174822763 1174830982
1174881173 1174882761
1174885769 1174901732
1174902264 1174921580
1174921975 1174936820
1174938664 1174991090
1174991564 1175048869
1175054893 1175076776
1175081139 1175092749
1175095355 1175116107
1175116112 1175185598
1175188916 1175241786
1175242325 1175280514
1175280520 1175280991
1175287062 1175346161
1175350812 1175353229
1175387736 1175389788
1175390316 1175409507
1175416278 1175437419
1175438061 1175458673
1175459074 1175529619
1175555221 1175572254
1175572259 1175572287
1175576524 1175576576
1175576622 1175577659
1175577776 1175577936
1175578374 1175607109
1175608136 1175608437
1175613243 1175622299
1175650660 1175653526
1175653829 1175661471
1175661481 1175661948
1175664976 1175706198
1175706545 1175827930
1175829134 1175882057
1175882060 1175920863
1175924117 1175925000
1175927595 1175954196
1175954247 1175958642
1175981917 1175982706
1175983235 1175983414
1175987395 1176000781
1176003152 1176048049
1176070112 1176134094
1176134780 1176138362
1176145519 1176153124
1176160812 1176240064
1176240430 1176255831
1176258789 1176262900
1176268869 1176350520
1176352584 1176372436
1176372441 1176424228
1176424878 1176449302
1176449605 1176494766
1176497738 1176517605
1176517918 1176553681
1176595909 1176596022
1176598973 1176607855
1176608737 1176622773
1176625570 1176652937
1176677340 1176677950
1176678171 1176696867
1176697416 1176703191
1176705965 1176739235
1176755416 1176764180
1176764855 1176767385
1176767393 1176767419
1176767447 1176767469
1176767472 1176767534
1176767545 1176767566
1176767571 1176803521
1176803525 1176858685
1176860567 1176886853
1176889023 1176926963
1176926967 1176955218
1176955220 1177019415
1177020272 1177025038
1177025345 1177049130
1177051499 1177068769
1177069290 1177106573
1177120791 1177167681
1177209289 1177258285
1177274220 1177329082
1177331083 1177333842
1177358249 1177360211
1177367650 1177382912
1177382916 1177392010
1177394966 1177395200
1177395218 1177418665
1177434059 1177435020
1177435266 1177447335
1177460488 1177462536
1177463143 1177513447
1177514118 1177541752
1177542251 1177599217
1177599791 1177618805
1177620375 1177673100
1177674319 1177677370
1177733104 1177769742
1177770403 1177775772
1177796488 1177831987
1177834567 1177836076
1177836553 1177886105
1177886748 1177891454
1177891569 1177892421
1177894437 1177918909
1177919477 1177948396
1177963174 1177965554
1177966888 1177988566
1178019621 1178063302
1178066632 1178088581
1178090001 1178090169
1178106585 1178140496
1178145824 1178193840
1178196472 1178209031
1178209135 1178254015
1178270017 1178290838
1180982427 1180995429
1180998098 1181023839
1181024298 1181057421
1181078382 1181085201
1181089750 1181167162
1181167251 1181167722
1181167896 1181172225
1181172697 1181308544
1181317321 1181324034
1181325038 1181368988
1181368991 1181369178
1181369182 1181369240
1181369243 1181369292
1181369296 1181369327
1181369343 1181369374
1181369400 1181369415
1181369431 1181369485
1181369502 1181369531
1181369549 1181369563
1181369566 1181369583
1181369594 1181369617
1181369639 1181369653
1181369707 1181369725
1181369809 1181369829
1181383199 1181386009
1181390201 1181396583
1181398926 1181401228
1181445242 1181454558
1181454858 1181459169
1181459180 1181459199
1181475199 1181477595
1181480214 1181490871
1181500458 1181520918
1181522351 1181577191
1181577314 1181580023
1181615025 1181629244
1181640960 1181641666
1181641724 1181641965
1181642327 1181642505
1181642687 1181644122
1181644589 1181650170
1181650232 1181656290
1181656352 1181659530
1181659652 1181660987
1181665572 1181681075
1181681175 1181691035
1181692784 1181696938
1181697011 1181737558
1181738021 1181845818
1181845820 1181909722
1181911831 1181928956
1181953924 1181977614
1181981351 1181981432
1181985023 1181985668
1181998224 1182003037
1182056293 1182059551
1182061675 1182065782
1182075203 1182093195
1182106504 1182112417
1182134171 1182170355
1182195955 1182402820
1182405092 1182423275
1182424945 1182425088
1182425134 1182471466
1182474765 1182478039
1182483642 1182493243
1182500508 1182517011
1182519980 1182533939
1182537957 1182540264
1182540636 1182554577
1182555474 1182560646
1182583306 1182587249
1182604435 1182611432
1182640082 1182640529
1182648964 1182653017
1182657346 1182710105
1182710222 1182712423
1182712428 1182715242
1182717709 1182726561
1182726727 1182727538
1182727985 1182736193
1182737817 1182803613
1182803682 1182817363
1182817425 1182817783
1182817905 1182818743
1182818865 1182822943
1182823545 1182823603
1182823725 1182823755
1182835120 1182835241
1182835363 1182835421
1182835483 1182835541
1182835663 1182835841
1182836323 1182836381
1182836443 1182836501
1182836623 1182836801
1182836863 1182839696
1182839718 1182844687
1182851501 1182876756
1182878246 1182883488
1182889685 1182893526
1182893542 1182898554
1182898680 1182899136
1182908130 1182968079
1182978695 1183086109
1183090385 1183145114
1183146201 1183161428
1183164670 1183175579
1183175767 1183241629
1183244426 1183246624
1183246629 1183302203
1183324477 1183335264
1183336511 1183337172
1183337294 1183338263
1183344638 1183357910
1184032880 1184072323
1184098613 1184098651
1184098682 1184101352
1184101629 1184107052
1184151851 1184202810
1184204774 1184212989
1184462589 1184477607
1184477924 1184528380
1184537239 1184538428
1184538454 1184539877
1184540346 1184559079
1184561504 1184566384
1184568203 1184577383
1184581367 1184604591
1184608169 1184608485
1184609593 1184610452
1184610482 1184612256
1184612308 1184613369
1184615862 1184616790
1184616815 1184626627
1184637929 1184702340
1184720647 1184723915
1184723977 1184735682
1184738830 1184753291
1184753353 1184754251
1184754313 1184755095
1184764852 1184765153
1184765395 1184765453
1184765755 1184765813
1184766295 1184766593
1184766955 1184767133
1184767435 1184767613
1184767675 1184776060
1184776736 1184785821
1184785865 1184785884
1184786321 1184812365
1184843192 1184854322
1184857171 1184864855
1184867935 1184926573
1184930843 1184975570
1184979979 1185009050
1185083107 1185094268
1185094510 1185097448
1185097690 1185098048
1185098110 1185098168
1185098230 1185098288
1185098350 1185099008
1185099070 1185099188
1185099250 1185099308
1185099490 1185099608
1185099670 1185100448
1185100510 1185102411
1185144020 1185154003
1185157517 1185164133
1185164586 1185215275
1185244711 1185258236
1185258285 1185307302
1185335783 1185395109
1185422901 1185439744
1185439796 1185480149
1185502747 1185566556
1185581881 1185583816
1185583941 1185608718
1185615255 1185634854
1185657014 1185657618
1185658407 1185661973
1185663127 1185667694
1185667826 1185726333
1185752705 1185813793
1185834867 1185841804
1185844432 1185854532
1185855240 1185898649
1185908559 1185912475
1185917125 1185917208
1185919460 1185919620
1185919762 1185924698
1185927698 1185927743
1185928396 1185935428
1185937818 1185937902
1185938243 1186081491
1186091993 1186096044
1186097308 1186181960
1186192128 1186192196
1186192240 1186236335
1186295199 1186295229
1186295255 1186329783
1186352759 1186418834
1186447249 1186491565
1186492566 1186499610
1186524714 1186546594
1186549119 1186609762
1186642720 1186664342
1186670467 1186825265
1186825447 1186844577
1186876230 1186939867
1186953207 1187018570
1187020364 1187020428
1187020516 1187020665
1187021294 1187021342
1187021436 1187021509
1187021619 1187021749
1187023761 1187039713
1187040967 1187063520
1187083265 1187226516
1187226993 1187232087
1187242937 1187243529
1187247857 1187276788
1187278805 1187278848
1187278947 1187312514
1187312992 1187363516
1187363820 1187440026
1187441995 1187446882
1187447680 1187449219
1187483747 1187517678
1187518507 1187592904
1187592909 1187602158
1187604329 1187604380
1187605180 1187605276
1187605364 1187605470
1187605759 1187605809
1187606124 1187606810
1187609753 1187619133
1187619155 1187627224
1187634944 1187651493
1187652925 1187656721
1187681297 1187681350
1187681366 1187733618
