1238166018 1238186420
1238186428 1238220967
1238250278 1238252421
1238252597 1238257817
1238257971 1238261506
1238261605 1238266828
1238266911 1238270978
1238271077 1238279373
1238280433 1238288488
1238289579 1238301154
1238301162 1238325759
1238326432 1238337533
1238338093 1238357612
1238357749 1238364745
1238364887 1238377604
1238377702 1238381846
1238382091 1238396506
1238396588 1238408791
1238411539 1238416144
1238424199 1238425570
1238428067 1238443542
1238444025 1238448564
1238448661 1238463510
1238463606 1238465103
1238465111 1238466541
1238466622 1238469417
1238469493 1238472298
1238472377 1238489527
1238489770 1238489771
1238490045 1238490074
1238490161 1238493237
1238493763 1238496306
1238496376 1238505191
1238505784 1238519557
1238519911 1238526863
1238526941 1238553474
1238553482 1238591074
1238591082 1238603826
1238603844 1238604170
1238613837 1238759133
1238759180 1238825367
1238841058 1238844650
1238844731 1238863260
1238863287 1238870911
1238872764 1238876548
1238877030 1238919529
1238919784 1238949427
1238950805 1239002649
1239003142 1239008891
1239010898 1239011946
1239012244 1239107402
1239112161 1239115844
1239115926 1239121936
1239121956 1239122281
1239122289 1239123369
1239123377 1239123513
1239123521 1239141457
1239141473 1239156777
1239156785 1239276281
1239276289 1239278729
1239278737 1239278873
1239278881 1239308506
1239311203 1239331744
1239331752 1239331792
1239331800 1239331984
1239331992 1239340560
1239340568 1239340576
1239340584 1239374536
1239379378 1239383022
1239383136 1239427223
1239451963 1239453907
1239465572 1239515289
1239515362 1239548426
1239566200 1239572252
1239572260 1239593052
1239593068 1239601989
1239604264 1239641206
1239642852 1239682822
1239684512 1239710470
1239717513 1239731113
1239734233 1239753379
1239754664 1239779530
1239780877 1239805288
1239805347 1239882529
1239882619 1239912280
1239912288 1239917400
1239918604 1239922747
1239922763 1239932451
1239933739 1239948458
1239948474 1239948490
1239948506 1239948642
1239948650 1239948706
1239948714 1239949330
1239949346 1239950578
1239950586 1239950690
1239950698 1239950714
1239950722 1239950746
1239950770 1239950778
1239950786 1239950914
1239950922 1239950950
1239953664 1239962588
1239962786 1239970753
1239973435 1239989037
1239989083 1240010086
1240011371 1240032048
1240050087 1240072707
1240072724 1240082337
1240083752 1240088470
1240088888 1240094042
1240098469 1240099374
1240099386 1240099462
1240100620 1240100621
1240100623 1240100624
1240100628 1240100697
1240100706 1240100733
1240100735 1240100757
1240103757 1240104466
1240110584 1240112717
1240112725 1240114613
1240114621 1240119605
1240119613 1240120837
1240120845 1240128013
1240128021 1240129332
1240130519 1240131944
1240131952 1240133096
1240133104 1240134704
1240134712 1240137456
1240137464 1240139824
1240139832 1240141656
1240141664 1240143408
1240143416 1240145344
1240145352 1240149648
1240149656 1240151800
1240151808 1240152867
1240152873 1240152875
1240165922 1240222633
1240222641 1240229947
1240229949 1240229951
1240231112 1240232201
1240232209 1240271225
1240272867 1240275693
1240275701 1240292901
1240292917 1240292941
1240292949 1240292965
1240292973 1240297579
1240299833 1240302609
1240310388 1240316960
1240325189 1240334043
1240335509 1240342575
1240343964 1240353041
1240353049 1240388172
1240388174 1240388193
1240388202 1240442419
1240443589 1240475872
1240475876 1240475877
1240475879 1240475880
1240475897 1240484002
1240484148 1240494212
1240494220 1240494222
1240496177 1240516835
1240516843 1240516940
1240521907 1240523333
1240523341 1240525581
1240525589 1240526575
1240527326 1240527917
1240527933 1240528605
1240528621 1240533981
1240533997 1240535285
1240535293 1240538157
1240538165 1240539941
1240539949 1240543157
1240543165 1240546740
1240549032 1240561531
1240561539 1240561547
1240561553 1240561595
1240561604 1240561615
1240563204 1240563871
1240563879 1240564911
1240564919 1240564927
1240564935 1240569615
1240569623 1240569679
1240569687 1240576350
1240576370 1240576372
1240587330 1240587332
1240588092 1240602005
1240603229 1240639381
1240671919 1240673678
1240676623 1240711778
1240711794 1240756042
1240757294 1240758022
1240769709 1240794111
1240794119 1240891591
1240891599 1240904879
1240904887 1240908375
1240908978 1240917219
1240920811 1240933198
1240933206 1240957502
1240957510 1240965388
1240965484 1241000324
1241000374 1241050555
1241051005 1241065031
1241065072 1241082565
1241082620 1241126177
1241126185 1241136345
1241136353 1241139240
1241139335 1241173086
1241173164 1241214103
1241221068 1241241636
1241261060 1241279310
1241279311 1241340744
1241340764 1241355853
1241355942 1241362866
1241373957 1241378393
1241379736 1241400099
1241400167 1241411406
1241411496 1241428432
1241429875 1241443222
1241443269 1241480468
1241480599 1241480601
1241481305 1241483805
1241485966 1241506644
1241507899 1241512025
1241513394 1241514654
1241521264 1241649586
1241652102 1241655730
1241655754 1241661206
1241661211 1241661212
1241667585 1241668829
1241668837 1241670989
1241670997 1241673789
1241673805 1241673901
1241673909 1241676125
1241676133 1241676245
1241676253 1241676437
1241676445 1241682781
1241682789 1241685261
1241685269 1241686629
1241686637 1241689765
1241689773 1241691485
1241691493 1241693069
1241693077 1241693133
1241693460 1241695336
1241695344 1241696800
1241696808 1241698536
1241698544 1241700208
1241700216 1241701640
1241701648 1241713648
1241713656 1241718704
1241718712 1241721728
1241721736 1241724840
1241724848 1241730120
1241730128 1241740440
1241740448 1241743096
1241743104 1241743272
1241743280 1241745434
1241746554 1241749110
1241749118 1241749618
1241749620 1241750165
1241753918 1241757098
1241757106 1241765970
1241768240 1241769132
1241769140 1241769439
1241769441 1241769444
1241769452 1241769455
1241794679 1241796657
1241797894 1241800706
1241800730 1241815296
1241815329 1241840113
1241867385 1241869389
1241869397 1241872157
1241872165 1241874590
1241885762 1241888838
1241888846 1241896941
1241899734 1241900082
1241902603 1241903815
1241906391 1241906475
1241906483 1241907067
1241907075 1241909323
1241909331 1241910763
1241910771 1241916947
1241916955 1241919539
1241919547 1241922347
1241922355 1241923883
1241923891 1241924699
1241924707 1241926251
1241926259 1241928979
1241928987 1241932915
1241932923 1241935467
1241935475 1241936688
1241937141 1241937697
1241937713 1241939921
1241939929 1241944137
1241944153 1241947769
1241947777 1241950113
1241950121 1241953393
1241953401 1241954601
1241954609 1241957441
1241957449 1241957737
1241958888 1241959791
1241993549 1241993569
1241993577 1241993641
1241993649 1241998105
1241998113 1241998281
1241998289 1242001169
1242001177 1242003129
1242003145 1242009449
1242009457 1242009728
1242011495 1242013803
1242013811 1242014667
1242014675 1242017979
1242017987 1242018899
1242018907 1242019675
1242019683 1242023203
1242023211 1242024899
1242024907 1242028779
1242028787 1242033419
1242033427 1242035528
1242038144 1242038271
1242040147 1242041023
1242041039 1242041065
1242042355 1242048535
1242048543 1242049071
1242049079 1242050263
1242050271 1242053127
1242053135 1242054767
1242054775 1242056639
1242056647 1242058239
1242058255 1242059287
1242059295 1242059583
1242059591 1242060695
1242060703 1242061855
1242061871 1242062535
1242062543 1242065983
1242065991 1242068431
1242068447 1242069375
1242069383 1242069391
1242069399 1242071543
1242071551 1242071719
1242071743 1242072631
1242072639 1242074159
1242074167 1242075055
1242075063 1242075263
1242075279 1242078903
1242078911 1242079559
1242079567 1242081647
1242081655 1242083319
1242083327 1242084063
1242084071 1242086959
1242086967 1242087991
1242087999 1242089407
1242089415 1242090551
1242090559 1242092159
1242092175 1242093215
1242093223 1242096391
1242096399 1242099743
1242099751 1242100903
1242100911 1242101831
1242101839 1242102751
1242102759 1242106007
1242106015 1242107135
1242107151 1242113847
1242113855 1242114551
1242114559 1242125151
1242125159 1242126191
1242126199 1242128679
1242128687 1242131935
1242131943 1242132607
1242132615 1242133495
1242133503 1242134303
1242134319 1242138855
1242138863 1242146079
1242146087 1242146111
1242146119 1242146191
1242146199 1242151639
1242151647 1242152783
1242152791 1242158039
1242158047 1242158071
1242158079 1242162351
1242162359 1242163151
1242163159 1242164839
1242164847 1242167255
1242167271 1242167295
1242167303 1242169079
1242169095 1242171527
1242171535 1242171959
1242171967 1242174447
1242174455 1242174714
1242174763 1242176295
1242176303 1242182063
1242182071 1242183823
1242183831 1242189159
1242189167 1242191911
1242191927 1242194247
1242194255 1242194744
1242230253 1242230609
1242230617 1242235249
1242235257 1242236153
1242236161 1242238769
1242238777 1242243206
1242243331 1242249911
1242249919 1242254015
1242254023 1242255007
1242255015 1242262455
1242262463 1242264087
1242264103 1242268087
1242268095 1242269223
1242269239 1242269255
1242269263 1242269745
1242269800 1242275612
1242275628 1242276644
1242276652 1242278764
1242278772 1242280356
1242280364 1242280852
1242282047 1242287499
1242287507 1242290235
1242290251 1242293779
1242293787 1242298475
1242298483 1242300131
1242300139 1242301579
1242301587 1242310395
1242310403 1242315443
1242315451 1242319363
1242319371 1242322259
1242322275 1242325947
1242325955 1242328443
1242328451 1242329251
1242329259 1242330091
1242330099 1242332859
1242332867 1242333651
1242333659 1242335059
1242335067 1242336299
1242336307 1242339051
1242339059 1242343643
1242343651 1242344139
1242344147 1242348267
1242348275 1242349579
1242349587 1242350699
1242350715 1242357323
1242357331 1242358659
1242358667 1242360699
1242360707 1242360939
1242360947 1242361547
1242361555 1242361787
1242361795 1242361891
1242361899 1242361971
1242361979 1242363939
1242363947 1242365731
1242365739 1242365926
1242375540 1242378896
1242378904 1242379162
1242379164 1242381352
1242381368 1242382296
1242382304 1242383680
1242383688 1242385340
1242385356 1242389928
1242389936 1242391928
1242391936 1242396072
1242396080 1242400576
1242400584 1242404336
1242404344 1242409192
1242409208 1242411408
1242411416 1242417560
1242417568 1242420064
1242420072 1242422744
1242422752 1242424704
1242424712 1242427816
1242427824 1242431800
1242431816 1242442224
1242442232 1242449720
1242449728 1242450688
1242450696 1242451304
1242474443 1242474486
1242476330 1242476686
1242480204 1242484056
1242484064 1242487304
1242487320 1242489688
1242489704 1242489728
1242489736 1242489951
1242489958 1242489960
1242489962 1242489964
1242489967 1242489970
1242491730 1242493046
1242493054 1242494070
1242494078 1242497254
1242497262 1242499038
1242499046 1242500198
1242500214 1242502326
1242502342 1242503342
1242503350 1242505958
1242505966 1242506566
1242506574 1242509886
1242509894 1242511118
1242511126 1242514646
1242514654 1242516702
1242516710 1242518462
1242518470 1242524086
1242524094 1242524870
1242524878 1242529318
1242529326 1242534990
1242535014 1242537422
1242537430 1242539908
1242541722 1242549054
1242549070 1242549598
1242549616 1242549985
1242561044 1242570224
1242570232 1242572427
1242590163 1242590375
1242590391 1242591479
1242594450 1242600966
1242600974 1242603030
1242603046 1242603943
1242604140 1242604146
1242605660 1242606656
1242606819 1242606826
1242606988 1242607792
1242607800 1242613096
1242613104 1242613384
1242613392 1242614104
1242614112 1242616192
1242616200 1242619704
1242619720 1242620752
1242622853 1242622945
1242622953 1242622964
1242623174 1242623282
1242623291 1242623530
1242623761 1242623764
1242626195 1242627655
1242627663 1242629813
1242645021 1242648080
1242649943 1242649945
1242653342 1242655428
1242657950 1242665663
1242667359 1242667643
1242667659 1242668323
1242669816 1242671588
1242671596 1242671628
1242671636 1242671916
1242671924 1242674036
1242674044 1242676124
1242676132 1242676236
1242676244 1242679220
1242679228 1242679252
1242688948 1242698552
1242699750 1242718452
1242718503 1242722133
1242724309 1242786749
1242787932 1242811795
1242812131 1242817623
1242817624 1242817625
1242817626 1242817627
1242819740 1242820903
1242822055 1242824523
1242825720 1242855316
1242855332 1242857957
1242858060 1242858204
1242858411 1242866708
1242866728 1242890460
1242890476 1242890867
1242942461 1242943765
1242944804 1242956168
1242956176 1242957501
1242959026 1242966774
1242966782 1242983847
1242986482 1243025894
1243025902 1243038955
1243046470 1243056020
1243077114 1243083270
1243083278 1243089302
1243089310 1243104126
1243104134 1243104710
1243104718 1243106826
1243125089 1243137111
1243139113 1243139359
1243139361 1243139363
1243140635 1243140983
1243142310 1243145770
1243145802 1243147248
1243147282 1243147440
1243147474 1243147578
1243147610 1243147688
1243147794 1243148085
1243152277 1243153617
1243155975 1243161494
1243165965 1243169091
1243169255 1243173795
1243175060 1243179456
1243185194 1243188470
1243194180 1243202590
1243207590 1243210807
1243212003 1243243720
1243251975 1243252683
1243252691 1243254542
1243254563 1243255886
1243261664 1243273614
1243279194 1243349718
1243349726 1243355950
1243361982 1243398734
1243400612 1243413626
1243415116 1243488232
1243488240 1243488272
1243489405 1243566444
1243566823 1243595553
1243598434 1243606094
1243615972 1243660835
1243686824 1243690911
1243695804 1243756933
1243765997 1243767478
1243767946 1243768686
1243768856 1243768858
1243771841 1243782079
1243796605 1243801253
1243814160 1243817219
1243819863 1243821880
1243823740 1243845339
1243850983 1243862262
1243862326 1243878316
1243878319 1243878329
1243878336 1243884907
1243886649 1243924455
1243924954 1243932197
1243935526 1243938201
1243939656 1243943292
1243943308 1243959247
1243960002 1243961262
1243961281 1243963387
1243965959 1244018204
1244021040 1244048160
1244048164 1244056759
1244059036 1244101214
1244102788 1244119013
1244121513 1244127241
1244127552 1244128058
1244150773 1244172038
1244182025 1244199930
1244205973 1244209054
1244210581 1244211235
1244213737 1244220397
1244220406 1244228761
1244230341 1244241553
1244243925 1244251556
1244253301 1244260830
1244296204 1244296688
1244296689 1244327118
1244329357 1244351609
1244355985 1244363440
1244363560 1244377540
1244382126 1244382399
1244382870 1244386828
1244400384 1244426900
1244428911 1244442123
1244443658 1244445112
1244467107 1244468393
1244468409 1244495049
1244497367 1244502741
1244504687 1244508088
1244509290 1244510580
1244511057 1244511929
1244519771 1244522099
1244524541 1244524665
1244526349 1244541677
1244541775 1244544733
1244544735 1244553492
1244553495 1244553969
1244553971 1244556350
1244556353 1244565155
1244565158 1244568296
1244570748 1244570919
1244570921 1244595788
1244595792 1244595833
1244599494 1244603777
1244605679 1244622696
1244627842 1244670489
1244673258 1244674025
1244689412 1244700473
1244709878 1244743488
1244745211 1244754648
1244757060 1244767328
1244769482 1244774162
1244778476 1244781504
1244782721 1244783204
1244785289 1244786001
1244789305 1244789448
1244791865 1244796740
1244810782 1244838055
1244840240 1244858945
1244860894 1244866873
1244868424 1244870422
1244892161 1244892278
1244893805 1244894075
1244897351 1244897679
1244899964 1244900842
1244911786 1244914385
1244915950 1244923439
1244925314 1244932021
1244933452 1244940916
1244947234 1244947506
1244947507 1244954283
1244957135 1244961047
1244963168 1244963400
1244964537 1244964883
1244966943 1244968296
1244970295 1244972774
1244975411 1244975569
1244979756 1244984760
1244986360 1244990407
1244990409 1244991691
1245005430 1245005432
1245006233 1245006788
1245006790 1245008730
1245010540 1245048671
1245082094 1245082245
1245082369 1245147380
1245149156 1245152921
1245155505 1245211403
1245212607 1245228076
1245229652 1245254526
1245256820 1245300118
1245300780 1245310952
1245310953 1245310954
1245316281 1245379166
1245380483 1245381281
1245388966 1245430420
1245433918 1245475235
1245505540 1245552119
1245557075 1245592119
1245610251 1245613576
1245615091 1245651687
1245652238 1245654870
1245681563 1245716981
1245717071 1245738328
1245743382 1245744571
1245763698 1245764572
1245768105 1245778062
1245782096 1245798231
1245800025 1245937672
1245950249 1245953048
1245953103 1245956683
1245962185 1245962705
1245962723 1245962973
1245962985 1245966086
1245966280 1245983228
1245983229 1245998276
1246005159 1246014494
1246023526 1246023950
1246023953 1246024896
1246024981 1246030154
1246036423 1246080032
1246105373 1246107173
1246110245 1246118564
1246121272 1246136443
1246139422 1246149704
1246175890 1246189892
1246219539 1246252342
1246256830 1246259948
1246261105 1246263238
1246265372 1246298427
1246303483 1246342101
1246346701 1246357430
1246360413 1246366169
1246368656 1246414249
1246414250 1246419854
1246432509 1246448460
1246451929 1246458658
1246460384 1246466450
1246468144 1246491069
1246494332 1246519112
1246519128 1246523100
1246534083 1246547331
1246590925 1246604966
1246608626 1246611473
1246621933 1246621935
1246623918 1246632058
1246633909 1246645178
1246649874 1246654647
1246658082 1246684831
1246810272 1246810383
1246810415 1246811052
1246814767 1246826701
1246900574 1246901026
1246901072 1246909495
1246931590 1246937399
1246968587 1246968589
1246987604 1247006095
1247006103 1247008847
1247008855 1247008887
1247008895 1247015463
1247017858 1247024660
1247024679 1247027863
1247027871 1247027919
1247027935 1247039391
1247046950 1247056370
1247058430 1247068901
1247072298 1247078126
1247081354 1247082601
1247082617 1247082673
1247082689 1247082705
1247082713 1247082849
1247082857 1247082873
1247082881 1247083121
1247083129 1247083209
1247083217 1247083353
1247083361 1247083553
1247083561 1247083681
1247083705 1247083745
1247083753 1247083761
1247083769 1247083825
1247083833 1247083841
1247083857 1247083873
1247083889 1247083945
1247083953 1247083969
1247083977 1247084617
1247084625 1247084793
1247084809 1247084833
1247084841 1247084905
1247084921 1247085089
1247085097 1247085809
1247085817 1247088617
1247088625 1247088825
1247088833 1247088873
1247088881 1247090073
1247090225 1247090268
1247092453 1247092713
1247092737 1247108897
1247113564 1247116261
1247116340 1247121025
1247124381 1247132052
1247153607 1247153609
1247154519 1247169442
1247172350 1247190595
1247190603 1247190659
1247190667 1247195203
1247195219 1247195427
1247195443 1247195451
1247195483 1247197719
1247199996 1247202279
1247204278 1247207031
1247221906 1247225265
1247231991 1247234121
1247235739 1247236879
1247239171 1247242061
1247248441 1247254549
1247254565 1247254573
1247254589 1247254605
1247254621 1247255653
1247260382 1247286575
1247289383 1247289633
1247315374 1247315510
1247315722 1247316924
1247320256 1247321550
1247325335 1247328340
1247330403 1247330568
1247330573 1247330575
1247330833 1247348074
1247349953 1247391282
1247392731 1247397758
1247399157 1247399795
1247400152 1247402012
1247402014 1247402024
1247402054 1247404877
1247407566 1247409628
1247425786 1247445993
1247447467 1247455479
1247460236 1247463941
1247465528 1247483829
1247484518 1247489668
1247489684 1247490764
1247493444 1247495005
1247495013 1247495021
1247495037 1247503344
1247503350 1247512396
1247512804 1247513942
1247514057 1247515356
1247517242 1247539808
1247542430 1247549705
1247549745 1247549793
1247551336 1247584413
1247584945 1247599510
1247599518 1247603854
1247611458 1247613665
1247613674 1247615153
1247616523 1247626214
1247632705 1247643974
1247645374 1247647051
1247650635 1247653422
1247656624 1247697891
1247699376 1247709360
1247712650 1247712932
1247714655 1247719107
1247719131 1247751099
1247753809 1247756500
1247758858 1247768006
1247770877 1247817407
1247840388 1247894435
1247943134 1247955498
1247960065 1247960337
1247960395 1247961461
1247961524 1247962543
1247962593 1247963733
1247964384 1247987250
1247988538 1247999583
1248001261 1248015637
1248031931 1248051086
1248053779 1248081209
1248081739 1248083085
1248084567 1248100297
1248100580 1248104859
1248106842 1248113680
1248113712 1248124898
1248126197 1248163103
1248165257 1248203405
1248205109 1248209324
1248209482 1248221033
1248224387 1248255921
1248258082 1248261687
1248263272 1248277606
1248278872 1248294565
1248299369 1248319451
1248324441 1248327874
1248330023 1248344075
1248344083 1248348483
1248350789 1248356727
1248358023 1248364521
1248366677 1248370453
1248371894 1248372987
1248374227 1248377613
1248378839 1248406096
1248407813 1248411716
1248414163 1248418798
1248445764 1248448273
1248450583 1248468366
1248470592 1248470691
1248470971 1248499226
1248575030 1248585146
1248587491 1248590526
1248590988 1248604468
1248604492 1248613937
1248613953 1248616141
1248640822 1248677287
1248705620 1248712431
1248712439 1248722718
1248728803 1248758144
1248758160 1248784280
1248796404 1248802483
1248805102 1248843548
1248843556 1248870166
1248870176 1248903765
1248903776 1248905191
1248908850 1248925764
1248927897 1248951548
1248954821 1248978537
1248980086 1249021850
1249045974 1249104019
1249124172 1249125984
1249128042 1249219181
1249219754 1249221493
1249240330 1249251331
1249252886 1249253510
1249253906 1249259004
1249262209 1249265010
1249268389 1249268414
1249269767 1249271223
1249272567 1249274375
1249275521 1249276608
1249278298 1249279474
1249281865 1249282546
1249309426 1249313042
1249314442 1249316766
1249321540 1249327383
1249328580 1249348208
1249359477 1249366789
1249368662 1249368848
1249370105 1249370573
1249384406 1249385255
1249385376 1249385497
1249392745 1249392879
1249393084 1249393529
1249418670 1249418849
1249419041 1249419152
1249419160 1249421320
1249421328 1249423208
1249423224 1249424160
1249424168 1249425720
1249425728 1249425872
1249425880 1249427384
1249427400 1249427488
1249427496 1249428415
1249428424 1249430016
1249430024 1249430088
1249430096 1249430320
1249430328 1249430376
1249430384 1249432096
1249432104 1249434856
1249434864 1249437560
1249437568 1249441784
1249441792 1249443576
1249443584 1249443792
1249443800 1249444872
1249444880 1249448008
1249448016 1249448752
1249448768 1249450032
1249450040 1249453048
1249453056 1249455232
1249455248 1249455284
1249455334 1249507852
1249509044 1249527710
1249527726 1249632620
1249653569 1249653758
1249664932 1249708830
1249737663 1249741379
1249743335 1249743393
1249743721 1249799884
1249803924 1249824744
1249847919 1249895918
1249895926 1249932750
1249932758 1249997902
1249997910 1250027838
1250027846 1250033046
1250033054 1250047197
1250065107 1250095990
1250104528 1250114555
1250123027 1250166648
1250181693 1250234515
1250253112 1250280630
1250287828 1250289888
1250289896 1250310751
1250357882 1250369077
1250370797 1250375696
1250375704 1250424444
1250425088 1250434831
1250451122 1250490909
1250518518 1250538442
1250539835 1250562228
1250562236 1250569220
1250571984 1250584238
1250584684 1250595253
1250595313 1250595315
1250603741 1250665146
1250665154 1250674256
1250675727 1250675913
1250677506 1250677639
1250684975 1250686908
1250691293 1250692419
1250692427 1250692443
1250692451 1250695315
1250695323 1250696227
1250696235 1250697195
1250697203 1250700467
1250700475 1250701595
1250701603 1250704067
1250704075 1250704155
1250704171 1250704195
1250704203 1250704387
1250704395 1250705603
1250705619 1250709243
1250709251 1250709299
1250709307 1250710715
1250710731 1250712355
1250712371 1250715051
1250715059 1250717083
1250717099 1250719739
1250719747 1250722067
1250722075 1250722307
1250722315 1250723827
1250723835 1250723843
1250723851 1250723883
1250723891 1250725875
1250725883 1250725907
1250725915 1250728043
1250728051 1250728395
1250728403 1250729883
1250729891 1250733899
1250733907 1250736651
1250736659 1250736675
1250736683 1250737635
1250737643 1250739147
1250739155 1250742107
1250742115 1250742363
1250742371 1250743771
1250743779 1250749451
1250749459 1250750867
1250750883 1250751835
1250751843 1250757019
1250757027 1250758803
1250758811 1250760331
1250760339 1250761091
1250761099 1250762987
1250762995 1250763795
1250763803 1250763819
1250763835 1250764603
1250764611 1250764619
1250764627 1250764731
1250764739 1250764899
1250764915 1250764955
1250764963 1250765195
1250770907 1250771906
1250774326 1250774339
1250774363 1250774615
1250779553 1250784108
1250784116 1250785980
1250785988 1250786932
1250786940 1250788052
1250788060 1250791756
1250791764 1250792556
1250792564 1250793292
1250793300 1250794364
1250794372 1250794412
1250794420 1250795924
1250795932 1250796725
1250796865 1250798172
1250798180 1250798212
1250798220 1250798631
1250798722 1250799396
1250799404 1250800196
1250800204 1250800228
1250800236 1250800396
1250800404 1250801084
1250801092 1250801140
1250801148 1250801452
1250801460 1250802932
1250802940 1250804028
1250804036 1250805516
1250805524 1250806508
1250806516 1250807980
1250807988 1250809612
1250809620 1250810548
1250810556 1250811788
1250811796 1250812836
1250812844 1250812860
1250812868 1250812876
1250812884 1250813596
1250813604 1250817428
1250817436 1250818620
1250818628 1250821604
1250821620 1250823932
1250823940 1250824780
1250824788 1250825852
1250825860 1250829372
1250829380 1250830236
1250830244 1250830452
1250830460 1250830780
1250830924 1250832604
1250832612 1250835540
1250835556 1250836462
1250838995 1250840332
1250840340 1250840652
1250864341 1250881309
1250906909 1250907949
1250907957 1250918501
1250940750 1250965440
1250968747 1250978420
1250978440 1250986956
1250993280 1251035363
1251052601 1251074120
1251075352 1251095217
1251120092 1251127948
1251136460 1251192383
1251199539 1251199592
1251203706 1251209154
1251211625 1251219376
1251219396 1251300703
1251303155 1251349118
1251349335 1251383259
1251385006 1251389302
1251389318 1251389741
1251393547 1251471086
1251474145 1251500578
1251502246 1251523229
1251543715 1251572387
1251572403 1251593800
1251595366 1251644468
1251661413 1251683439
1251685792 1251701244
1251728047 1251881632
1251881648 1251931424
1251931440 1251957729
1251957875 1251962090
1251971985 1251972307
1251972333 1251974587
1251975987 1251976206
1251981981 1251985810
1251985812 1251985817
1251996921 1252000313
1252000429 1252008839
1252010482 1252010854
1252015957 1252028546
1252028562 1252045547
1252073103 1252122015
1252149384 1252154752
1252156238 1252161763
1252161779 1252178411
1252179811 1252201978
1252204152 1252204511
1252205741 1252208555
1252208571 1252210211
1252210235 1252222637
1252224076 1252231044
1252231122 1252231635
1252231651 1252245645
1252245715 1252246585
1252264106 1252296510
1252299092 1252303421
1252321209 1252330013
1252330017 1252350468
1252350538 1252401897
1252402538 1252407331
1252408409 1252409469
1252411459 1252414078
1252414214 1252415143
1252415842 1252419260
1252420681 1252421141
1252422152 1252430210
1252431992 1252492548
1252494504 1252539907
1252541762 1252568258
1252570007 1252571167
1252575630 1252586757
1252586759 1252592413
1252592578 1252617975
1252620970 1252622380
1252626703 1252648977
1252649167 1252649791
1252649841 1252650074
1252653148 1252663220
1252663901 1252671946
1252672222 1252712592
1252715554 1252720780
1252721988 1252731975
1252733312 1252733314
1252733840 1252735177
1252753780 1252758950
1252759341 1252760975
1252761365 1252766785
1252767414 1252802937
1252804810 1252808398
1252809883 1252846901
1252849959 1252850439
1252868936 1252869804
1252869824 1252883543
1252888472 1252897188
1252898524 1252919685
1252937304 1252947893
1252947909 1252949405
1252949421 1252955893
1252955909 1252956685
1252956701 1252959533
1252959549 1252959965
1252959981 1252961973
1252978291 1252978455
1252978471 1252978623
1252978639 1252978663
1253016194 1253018278
1253018294 1253018478
1253018494 1253018870
1253018886 1253019798
1253019814 1253021022
1253021038 1253021302
1253021318 1253021358
1253021374 1253022835
1253024820 1253027423
1253027439 1253030927
1253030943 1253031519
1253031535 1253033223
1253033239 1253034271
1253034287 1253039807
1253039823 1253040343
1253040359 1253042167
1253042183 1253042415
1253042431 1253042815
1253042831 1253043047
1253043063 1253045407
1253045423 1253046999
1253047015 1253047331
1253049857 1253051879
1253051895 1253052383
1253052399 1253053346
1253053424 1253054033
1253054049 1253054161
1253054177 1253055121
1253055137 1253055961
1253055977 1253056281
1253056297 1253057553
1253057569 1253057737
1253057753 1253058209
1253058233 1253058465
1253058481 1253058905
1253058921 1253060041
1253060057 1253060777
1253060793 1253062593
1253062609 1253062897
1253062913 1253063929
1253063945 1253063953
1253063969 1253064017
1253064033 1253064241
1253064257 1253064657
1253064673 1253065737
1253065753 1253066889
1253066905 1253067081
1253067097 1253068681
1253068697 1253069913
1253069929 1253070374
1253076443 1253079669
1253079685 1253081549
1253081565 1253083637
1253083653 1253084768
1253093360 1253110143
1253112785 1253155785
1253155896 1253161401
1253161477 1253186175
1253188100 1253203939
1253205441 1253233309
1253234736 1253258819
1253284110 1253285018
1253286997 1253293331
1253294914 1253297009
1253297025 1253311826
1253313327 1253317987
1253319364 1253332432
1253334346 1253337634
1253358815 1253376875
1253379992 1253397978
1253399041 1253403560
1253407527 1253436348
1253436368 1253443501
1253444409 1253445727
1253445743 1253452591
1253475039 1253492262
1253497118 1253498739
1253498755 1253498769
1253499965 1253516597
1253542126 1253553778
1253555628 1253556018
1253557514 1253576492
1253577787 1253589138
1253590806 1253601791
1253603242 1253634271
1253635560 1253655464
1253655488 1253677230
1253680575 1253691144
1253692920 1253711034
1253714320 1253752553
1253754427 1253756715
1253758510 1253778289
1253780504 1253783450
1253784804 1253809266
1253818190 1253830604
1253830620 1253863588
1253866050 1253872893
1253909276 1253915996
1253916002 1253941833
1253944467 1253977218
