O3		23  1256655642  1257388107 8.48  days    Nov 01 15:00 - Nov 10 02:28
O3		24  1257388107  1258128955 8.57  days    Nov 10 02:28 - Nov 18 16:15
O3		25  1258128955  1258755063 7.25  days    Nov 18 16:15 - Nov 25 22:10
O3		26  1258755063  1259423400 7.74  days    Nov 25 22:10 - Dec 03 15:49
O3		27  1259423400  1260081799 7.62  days    Dec 03 15:49 - Dec 11 06:43
O3		28  1260081799  1260840862 8.79  days    Dec 11 06:43 - Dec 20 01:34
O3		29  1260840862  1261582830 8.59  days    Dec 20 01:34 - Dec 28 15:40
O3		30  1261582830  1262192988 7.06  days    Dec 28 15:40 - Jan 04 17:09
O3		31  1262192988  1262946475 8.72  days    Jan 04 17:09 - Jan 13 10:27
O3		32  1262946475  1263751886 9.32  days    Jan 13 10:27 - Jan 22 18:11
O3		33  1263751886  1264528208 8.99  days    Jan 22 18:11 - Jan 31 17:49
O3		34  1264528208  1265133147 7.00  days    Jan 31 17:49 - Feb 07 17:52
O3		35  1265133147  1265747429 7.11  days    Feb 07 17:52 - Feb 14 20:30
O3		36  1265747429  1266463048 8.28  days    Feb 14 20:30 - Feb 23 03:17
O3		37  1266463048  1267145365 7.90  days    Feb 23 03:17 - Mar 02 00:49
O3		38  1267145365  1267758251 7.09  days    Mar 02 00:49 - Mar 09 03:03
O3		39  1267758251  1268420278 7.66  days    Mar 09 03:03 - Mar 16 18:57
O3		40  1268420278  1269561618 13.21  days    Mar 16 18:57 - Mar 30 00:00
