/home/vedovato/O1/REPROCESSING/BBH/O1_K01_C02_LH_BBH_BKG_run1/merge/wave_O1_K01_C02_LH_BBH_BKG_run1.M3.V_hvetoLH.C_bin1_cut.S_ifar.root	 0       0        1      1	O1
/home/vedovato/O1/REPROCESSING/BBH/O1_K02_C02_LH_BBH_BKG_run1/merge/wave_O1_K02_C02_LH_BBH_BKG_run1.M3.V_hvetoLH.C_bin1_cut.S_ifar.root	 0       0        2      1	O1
/home/vedovato/O1/REPROCESSING/BBH/O1_K03_C02_LH_BBH_BKG_run1/merge/wave_O1_K03_C02_LH_BBH_BKG_run1.M3.V_hvetoLH.C_bin1_cut.S_ifar.root	 0       0        3      1	O1
/home/vedovato/O1/REPROCESSING/BBH/O1_K04_C02_LH_BBH_BKG_run1/merge/wave_O1_K04_C02_LH_BBH_BKG_run1.M3.V_hvetoLH.C_bin1_cut.S_ifar.root	 0       0        4      1	O1
/home/vedovato/O1/REPROCESSING/BBH/O1_K05_C02_LH_BBH_BKG_run1/merge/wave_O1_K05_C02_LH_BBH_BKG_run1.M3.V_hvetoLH.C_bin1_cut.S_ifar.root	 0       0        5      1	O1
/home/vedovato/O1/REPROCESSING/BBH/O1_K06_C02_LH_BBH_BKG_run1/merge/wave_O1_K06_C02_LH_BBH_BKG_run1.M3.V_hvetoLH.C_bin1_cut.S_ifar.root	 0       0        6      1	O1
/home/vedovato/O1/REPROCESSING/BBH/O1_K07_C02_LH_BBH_BKG_run1/merge/wave_O1_K07_C02_LH_BBH_BKG_run1.M3.V_hvetoLH.C_bin1_cut.S_ifar.root	 0       0        7      1	O1
/home/vedovato/O1/REPROCESSING/BBH/O1_K08_C02_LH_BBH_BKG_run1/merge/wave_O1_K08_C02_LH_BBH_BKG_run1.M3.V_hvetoLH.C_bin1_cut.S_ifar.root	 0       0        8      1	O1
/home/vedovato/O1/REPROCESSING/BBH/O1_K09_C02_LH_BBH_BKG_run1/merge/wave_O1_K09_C02_LH_BBH_BKG_run1.M3.V_hvetoLH.C_bin1_cut.S_ifar.root	 0       0        9      1	O1

#/work/salemi/O1/SEARCHES/OFFLINE/BBH/LH/SIM/O1_K99_C02_LH_BBH_SIM_BBH_O1_ALLSKY_run1/merge/wave_O1_K99_C02_LH_BBH_SIM_BBH_O1_ALLSKY_run1.M2.V_hvetoLH.C_U.S_bin1_cut.root     0       0       0       -1       O1
/home/vedovato/O1/REPROCESSING/BBH/SIM/O1_K01_C02_LH_BBH_SIM_BBH_BROAD_ISOTROPIC_test1/merge/wave_O1_K01_C02_LH_BBH_SIM_BBH_BROAD_ISOTROPIC_test1.M1.V_hvetoLH.C_U.S_bin1_cut.root     0       0       1       -1       O1
/home/vedovato/O1/REPROCESSING/BBH/SIM/O1_K08_C02_LH_BBH_SIM_BBH_BROAD_ISOTROPIC_test1/merge/wave_O1_K08_C02_LH_BBH_SIM_BBH_BROAD_ISOTROPIC_test1.M1.V_hvetoLH.C_U.S_bin1_cut.root     0       0       8       -1       O1

/home/vedovato/O1/REPROCESSING/BBH/O1_K08_C02_LH_BBH_BKG_erun1/merge/wave_O1_K08_C02_LH_BBH_BKG_erun1.M3.V_hvetoLH.C_bin1_cut.S_ifar.root 0       0        10      1      O1


