0 1126073529
1126114861 1126121462
1126123267 1126123553
1126126832 1126139205
1126139266 1126149058
1126155336 1126155799
1126166028 1126251604
1126252133 1126252291
1126274322 1126276234
1126281754 1126290026
1126293017 1126293257
1126299137 1126299197
1126299497 1126299557
1126301417 1126301717
1126301897 1126301957
1126302197 1126302257
1126302437 1126302497
1126302557 1126302617
1126304477 1126304537
1126304597 1126304777
1126304897 1126305077
1126305197 1126305377
1126305437 1126305557
1126305617 1126306937
1126307057 1126308670
1126309577 1126309637
1126309817 1126309877
1126327397 1126327457
1126328957 1126329017
1126330637 1126330697
1126331060 1126401691
1126401917 1126401977
1126420217 1126420277
1126426037 1126426496
1126427417 1126432226
1126448905 1126470677
1126476499 1126476759
1126480080 1126523802
1126530914 1126533090
1126544642 1126545529
1126575197 1126575257
1126604112 1126611508
1126613091 1126615415
1126629181 1126633397
1126633457 1126633637
1126633697 1126633877
1126634057 1126634117
1126634237 1126634417
1126634477 1126634537
1126635077 1126635137
1126636997 1126637057
1126637117 1126637177
1126637357 1126637537
1126657697 1126657757
1126657817 1126657937
1126659317 1126659377
1126676597 1126676717
1126677317 1126682744
1126691793 1126714447
1126715543 1126719918
1126720055 1126721736
1126807637 1126807697
1126808537 1126808597
1126808777 1126808837
1126810637 1126810817
1126813757 1126813817
1126813877 1126814057
1126814177 1126814297
1126814357 1126814717
1126816037 1126816097
1126816517 1126816577
1126818437 1126818497
1126818557 1126818677
1126818737 1126818917
1126819517 1126819577
1126820117 1126820477
1126820597 1126820657
1126821917 1126829493
1126830137 1126830197
1126830857 1126830917
1126831277 1126831757
1126832537 1126832717
1126833017 1126833077
1126833137 1126833377
1126833497 1126837277
1126838177 1126838237
1126851578 1126855130
1126856957 1126857017
1126871897 1126872077
1126872677 1126872737
1126873457 1126873517
1126873577 1126873697
1126873877 1126873937
1126874057 1126874177
1126874237 1126874297
1126874417 1126874477
1126874717 1126874777
1126874897 1126874957
1126875437 1126875557
1126878137 1126878257
1126879217 1126879277
1126879397 1126879457
1126879697 1126879817
1126879877 1126880117
1126881137 1126881437
1126881497 1126881677
1126881857 1126881977
1126882097 1126882217
1126882277 1126882877
1126883057 1126883597
1126883717 1126883777
1126884137 1126884257
1126885097 1126885217
1126885877 1126885937
1126886117 1126886177
1126886477 1126886537
1126886597 1126886777
1126886897 1126887137
1126887677 1126887977
1126888037 1126888397
1126888457 1126888517
1126888577 1126888637
1126893227 1126907957
1126909037 1126910657
1126914257 1126915037
1126915097 1126915157
1126915782 1126918131
1126927457 1126927577
1126928357 1126928477
1126932377 1126932497
1126937597 1126937657
1126944159 1126946249
1126965677 1126965797
1126969223 1126987925
1126991568 1126992216
1127001027 1127001172
1127074604 1127076602
1127076737 1127076917
1127079617 1127079677
1127079797 1127079917
1127082130 1127087599
1127089697 1127089757
1127090357 1127090477
1127090537 1127090657
1127091917 1127092037
1127096837 1127096897
1127100077 1127100197
1127105477 1127105537
1127108297 1127108357
1127109797 1127109857
1127111417 1127119063
1127119517 1127119577
1127120537 1127120597
1127120670 1127120931
1127123897 1127124017
1127124197 1127124497
1127133359 1127156503
1127156897 1127157017
1127158037 1127158097
1127158277 1127158457
1127158672 1127166399
1127166797 1127166857
1127167277 1127167337
1127169917 1127169977
1127173517 1127173577
1127173997 1127174057
1127174177 1127174237
1127175377 1127175437
1127184737 1127184797
1127189897 1127189957
1127224040 1127233630
1127245757 1127245937
1127245997 1127246237
1127246297 1127246357
1127246537 1127246657
1127246897 1127247017
1127247077 1127247137
1127247377 1127247797
1127247857 1127247917
1127248037 1127248097
1127248817 1127248877
1127249177 1127249297
1127249477 1127249597
1127249657 1127249777
1127252057 1127252117
1127256633 1127258769
1127265437 1127265497
1127272523 1127276368
1127276436 1127283768
1127284277 1127284337
1127286137 1127286617
1127289977 1127290157
1127290937 1127290997
1127293757 1127293877
1127293937 1127293997
1127294057 1127294177
1127296097 1127296157
1127296817 1127296877
1127296997 1127297117
1127297357 1127297417
1127297537 1127297777
1127297957 1127298017
1127298077 1127298137
1127298197 1127298257
1127298377 1127298437
1127298977 1127299037
1127299157 1127299277
1127299577 1127299697
1127299757 1127300237
1127300297 1127300477
1127300777 1127301437
1127301497 1127301797
1127301917 1127302037
1127302097 1127302157
1127302217 1127302277
1127302337 1127303357
1127303417 1127303657
1127303777 1127303837
1127303957 1127304197
1127304317 1127304437
1127304617 1127305517
1127305577 1127306177
1127306237 1127306717
1127307017 1127307317
1127307377 1127307977
1127308397 1127308817
1127308877 1127309057
1127309117 1127309357
1127309477 1127309597
1127309717 1127309777
1127310497 1127313255
1127313437 1127314097
1127315297 1127315477
1127315597 1127315957
1127316017 1127316677
1127316737 1127317097
1127317997 1127318237
1127319617 1127319677
1127319737 1127319917
1127320517 1127320577
1127320637 1127320757
1127320817 1127320877
1127320937 1127321597
1127321657 1127321957
1127322077 1127322315
1127322317 1127322377
1127322437 1127322737
1127322977 1127323037
1127323217 1127323277
1127325077 1127325137
1127325197 1127325437
1127325557 1127325617
1127325977 1127326037
1127326277 1127326337
1127326997 1127327057
1127327357 1127327537
1127328497 1127328557
1127328977 1127329397
1127329457 1127329577
1127329701 1127329989
1127330117 1127330177
1127331677 1127331737
1127334857 1127334917
1127335037 1127335157
1127335397 1127335457
1127339417 1127339537
1127340017 1127340197
1127340317 1127340437
1127340497 1127340737
1127340797 1127340977
1127341157 1127341397
1127341457 1127341517
1127341817 1127341937
1127342537 1127343197
1127343317 1127343377
1127347097 1127347157
1127347217 1127347277
1127347637 1127348057
1127348117 1127348177
1127348537 1127348597
1127348897 1127348957
1127349257 1127349377
1127350217 1127350277
1127350337 1127350397
1127352257 1127352317
1127352437 1127352497
1127352677 1127352737
1127353457 1127353577
1127353757 1127353817
1127354057 1127354117
1127354177 1127354297
1127354357 1127354477
1127356637 1127356697
1127356757 1127356817
1127357237 1127357297
1127357357 1127357477
1127357537 1127357717
1127357777 1127358317
1127358377 1127358497
1127358557 1127358737
1127358797 1127359037
1127359097 1127359217
1127359277 1127359397
1127359457 1127359517
1127359577 1127359697
1127360057 1127360117
1127364257 1127364557
1127364677 1127364737
1127367377 1127367437
1127367737 1127368457
1127368517 1127368577
1127368877 1127368937
1127369117 1127369177
1127369237 1127369357
1127386037 1127386097
1127387357 1127387417
1127398817 1127399057
1127420057 1127420957
1127421077 1127421317
1127421497 1127421917
1127421977 1127422397
1127422457 1127422517
1127422577 1127422637
1127423117 1127423177
1127423837 1127423957
1127424197 1127424257
1127425277 1127425337
1127427137 1127427197
1127428157 1127428217
1127428457 1127428517
1127435297 1127435357
1127436377 1127436617
1127436677 1127436737
1127436797 1127436857
1127436917 1127436977
1127437037 1127437217
1127437397 1127438117
1127438177 1127438597
1127438837 1127439557
1127440517 1127440577
1127440757 1127440817
1127440997 1127441117
1127441177 1127441297
1127441357 1127442977
1127443037 1127443157
1127443217 1127443277
1127443877 1127444177
1127444717 1127444837
1127444897 1127447357
1127447417 1127447537
1127447597 1127447957
1127448257 1127448497
1127448917 1127448977
1127449037 1127449397
1127449457 1127449517
1127449697 1127449877
1127449937 1127450237
1127450417 1127450537
1127451317 1127451557
1127451737 1127451857
1127451917 1127452097
1127452217 1127452397
1127452457 1127452757
1127452817 1127452937
1127452997 1127453057
1127453237 1127453417
1127453477 1127453537
1127453597 1127453657
1127454197 1127454857
1127454917 1127455217
1127455277 1127455337
1127455637 1127455937
1127456117 1127456177
1127458637 1127458697
1127458997 1127459057
1127459117 1127459297
1127459477 1127459597
1127466017 1127466077
1127467097 1127467157
1127470037 1127470097
1127470757 1127470937
1127471177 1127471357
1127471597 1127471657
1127471717 1127471777
1127473037 1127474988
1127476277 1127476337
1127477237 1127477297
1127479877 1127479937
1127480177 1127480357
1127480537 1127480597
1127480657 1127481571
1127483717 1127483777
1127484977 1127485037
1127485157 1127485277
1127485337 1127485517
1127485637 1127485817
1127485928 1127486758
1127490664 1127493377
1127494277 1127494937
1127495597 1127495657
1127495837 1127496677
1127496737 1127497037
1127497073 1127497443
1127497637 1127497757
1127497817 1127497877
1127499077 1127505580
1127538416 1127542188
1127572338 1127600564
1127603597 1127603657
1127603897 1127603957
1127604345 1127605981
1127610497 1127610557
1127613783 1127617667
1127634250 1127637592
1127670202 1127672509
1127672621 1127677444
1127682859 1127688849
1127743166 1127745666
1127745778 1127747340
1127767654 1127781937
1127814167 1127833937
1127836741 1127850018
1127851198 1127931980
1127946147 1127948029
1127952059 1127957843
1127964953 1127966973
1128021672 1128027892
1128100907 1128116370
1128176312 1128212167
1128302784 1128307413
1128307751 1128318750
1128331217 1128331337
1128331817 1128331877
1128351692 1128387596
1128462211 1128465254
1128527937 1128536518
1128546187 1128618578
1128708736 1128736191
1128740715 1128740835
1128763900 1128771811
1128782611 1128812093
1128837796 1128858247
1128873900 1128876302
1128880792 1128892523
1128897293 1128898889
1128922731 1128929810
1128929843 1128931801
1128956513 1128985185
1129003850 1129007625
1129011309 1129035540
1129136348 1129136736
1129152759 1129155660
1129222395 1129230007
1129260383 1129265646
1129294877 1129294937
1129320488 1129328003
1129383056 1129482036
1129493030 1129497350
1129574798 1129609234
1129615584 1129618357
1129627650 1129633206
1129668754 1129674847
1129676608 1129684877
1129703995 1129721697
1129777891 1129786110
1129800917 1129876722
1129882366 1129967744
1129968078 1129973230
1129974141 1129975046
1129992773 1130018622
1130094286 1130119479
1130164504 1130170615
1130170740 1130171209
1130184410 1130187911
1130192283 1130196168
1130244155 1130308697
1130326903 1130327023
1130327143 1130327203
1130330491 1130467573
1130482412 1130499285
1130559234 1130572617
1130578448 1130585400
1130603139 1130638260
1130645698 1130655728
1130662123 1130662243
1130662303 1130662363
1130688703 1130688763
1130689007 1130722395
1130743336 1130744618
1130753415 1130767176
1130864260 1130875481
1130889786 1130893220
1130916520 1130941035
1130965833 1130969522
1131016006 1131054330
1131063881 1131145277
1131179534 1131182058
1131206809 1131258515
1131260214 1131262439
1131272860 1131293845
1131303135 1131308708
1131314499 1131319276
1131387095 1131394911
1131429841 1131599292
1131647696 1131648702
1131665255 1131704322
1131728751 1131733827
1131734169 1131736295
1131777449 1131779500
1131780860 1131944359
1131954784 1131957539
1131962150 1131970993
1131988271 1132013797
1132035036 1132042025
1132044354 1132046782
1132071636 1132073070
1132090332 1132100563
1132103455 1132108612
1132141397 1132141457
1132185253 1132197472
1132204774 1132207129
1132287599 1132297123
1132314879 1132317563
1132339955 1132342061
1132347642 1132353344
1132354122 1132369810
1132370126 1132371569
1132414098 1132478011
1132552703 1132566362
1132591494 1132596048
1132637904 1132646950
1132688789 1132707004
1132814101 1132882261
1132912808 1132920113
1133019999 1133053848
1133093793 1133093951
1133121833 1133122786
1133138731 1133139254
1133172949 1133180512
1133233383 1133244433
1133245565 1133260208
1133304360 1133326571
1133380618 1133442869
1133468426 1133579856
1133625907 1133663139
1133665971 1133674275
1133692878 1133744521
1133747565 1133752701
1133754942 1133759726
1133771116 1133771371
1133773825 1133775853
1133801006 1133927365
1133976064 1133978532
1133979005 1133988945
1133991119 1133993497
1133995504 1133996639
1134007567 1134007710
1134010574 1134066213
1134068212 1134074728
1134076535 1134104115
1134156863 1134158208
1134178264 1134188991
1134195798 1134197896
1134222546 1134267924
1134278456 1134280603
1134291628 1134291968
1134292250 1134292579
1134302304 1134303321
1134303823 1134304685
1134348434 1134352064
1134352637 1134352697
1134355920 1134358570
1134416150 1134432422
1134510211 1134518081
1134528862 1134543174
1134673731 1134674804
1134675707 1134720521
1134752897 1134752957
1134757699 1134757832
1134768190 1134772038
1134774977 1134775097
1134775277 1134784603
1134784757 1134784817
1134785117 1134785237
1134835439 1134862087
1134878382 1134884408
1134912017 1134912077
1134912137 1134912197
1134918497 1134918737
1134919157 1134919349
1134927677 1134927975
1134929652 1135021840
1135024394 1135033244
1135057817 1135136228
1135151418 1135151859
1135234150 1135238726
1135364643 1135366079
1135391749 1135411109
1135417372 1135418759
1135446251 1135457586
1135496456 1135516970
1135596211 1135617234
1135651273 1135664857
1135698459 1135703491
1135717343 1135737171
1135770186 1135776762
1135778720 1135778845
1135843684 1135853150
1135898693 1135911179
1135924188 1135925097
1135943020 1135948563
1135965365 1135968898
1135975834 1135980656
1135991814 1136004514
1136024580 1136032651
1136038418 1136090432
1136091020 1136106654
1136116366 1136116706
1136122930 1136164549
1136176726 1136180347
1136181264 1136192801
1136217629 1136260445
1136304022 1136346535
1136347154 1136347704
1136376123 1136376659
1136399182 1136400642
1136408548 1136411629
1136414325 1136414785
1136419210 1136419562
1136428437 1136431145
1136432453 1136432454
1136435017 1136435077
1136435569 1136435858
1136462440 1136463255
1136466239 1136476672
1136479761 1136482802
1136527335 1136528553
1136560537 1136560796
1136567007 1136582038
1136584903 1136585203
1136596292 1136597152
1136645860 1136645993
1136650093 1136706986
1136740384 1136799305
1136801202 1136801869
1136803840 1136816633
1136826646 1136861219
1136915389 1136923544
1136927118 1136927550
1136930091 1136953663
1137002455 1137022301
1137030355 1137030507
1137030916 1137040346
1137097551 1137122581
1137124012 1137210884
1137253524 4000000000
