0 1126051217
1127161623 1127161625
1127161723 1127161725
1127162126 1127162128
1127162532 1127162534
1127162961 1127162963
1127175853 1127175855
1127179822 1127179824
1127181622 1127181624
1127183422 1127183424
1127783818 1127783821
1127784865 1127784868
1127789373 1127789375
1128124330 1128124333
1128125231 1128125233
1128126131 1128126133
1128127031 1128127033
1128127930 1128127933
1128128831 1128128833
1128129731 1128129733
1128130631 1128130633
1128657862 1128657864
1128658222 1128658224
1128658582 1128658584
1128658942 1128658944
1128659302 1128659304
1128659662 1128659664
1128666022 1128666024
1128666382 1128666384
1128666742 1128666744
1128667102 1128667104
1128667462 1128667464
1128667822 1128667824
1128668182 1128668184
1128668542 1128668544
1128668902 1128668904
1128669262 1128669264
1128669622 1128669624
1128669982 1128669984
1128670342 1128670344
1128670702 1128670704
1128671062 1128671064
1128671422 1128671424
1128671782 1128671784
1128672502 1128672504
1129391753 1129391754
1129394153 1129394154
1129397697 1129397698
1131397644 1131397647
1131492488 1131492489
1131495269 1131495270
1134345929 1134345931
1134348934 1134348935
1134353734 1134353735
1134354934 1134354935
1134356134 1134356135
1134357333 1134357335
1134359806 1134359807
1134361005 1134361007
1134362206 1134362207
1134363405 1134363407
1134364606 1134364607
1134581196 1134581198
1135352097 1135352098
1136584228 1136584237
1136586138 1136586147
1136587238 1136587247
1136588337 1136588346
1136589438 1136589446
1136590538 1136590546
1136591638 1136591647
1136592738 1136592747
1136593838 1136593848
1136594938 1136594947
1136794217 1136794294
1136795417 1136795494
1136796617 1136796694
1136797817 1136797894
1136799017 1136799094
1136814617 1136814694
1136880017 1136880094
1136881217 1136881294
1136882417 1136882494
1136898017 1136898094
1136899217 1136899294
1136900422 1136900769
1136901617 1136901694
1136902817 1136902894
1136904017 1136904094
1136905217 1136905294
1136906417 1136906494
1136907622 1136907969
1136912168 1136912169
1136912171 1136912172
1136912174 1136912175
1136912177 1136912178
1136912180 1136912181
1136912183 1136912184
1136912186 1136912187
1136912189 1136912190
1136912192 1136912193
1136912195 1136912196
1136912198 1136912199
1136912201 1136912202
1136912204 1136912205
1136912207 1136912208
1136912210 1136912211
1136912213 1136912214
1136912216 1136912217
1136912219 1136912220
1136912222 1136912223
1136912225 1136912226
1136912228 1136912229
1136912231 1136912232
1136912234 1136912235
1136912237 1136912238
1136912240 1136912241
1136912243 1136912244
1136912246 1136912247
1136912249 1136912250
1136912252 1136912253
1136912255 1136912256
1136912258 1136912259
1136912261 1136912262
1136912264 1136912265
1136912267 1136912268
1136912270 1136912271
1136912273 1136912274
1136955017 1136955094
1137024017 1137024094
1137025217 1137025294
1137026417 1137026494
1137213017 1137213094
1137214217 1137214294
1137215422 1137215769
1137254417 4000000000
