O2_K02_C02c_LH_BBH_BKG_run1/merge/wave_O2_K02_C02c_LH_BBH_BKG_run1.M2.V_hvetoLH.C_bin1_cut.S_ifar.root	 0	 0	  2	 1	O2
O2_K03_C02c_LH_BBH_BKG_run1/merge/wave_O2_K03_C02c_LH_BBH_BKG_run1.M2.V_hvetoLH.C_bin1_cut.S_ifar.root	 0	 0	  3	 1	O2
O2_K04_C02c_LH_BBH_BKG_run1/merge/wave_O2_K04_C02c_LH_BBH_BKG_run1.M2.V_hvetoLH.C_bin1_cut.S_ifar.root	 0	 0	  4	 1	O2
O2_K05_C02c_LH_BBH_BKG_run1/merge/wave_O2_K05_C02c_LH_BBH_BKG_run1.M2.V_hvetoLH.C_bin1_cut.S_ifar.root	 0	 0	  5	 1	O2
O2_K06_C02c_LH_BBH_BKG_run1/merge/wave_O2_K06_C02c_LH_BBH_BKG_run1.M2.V_hvetoLH.C_bin1_cut.S_ifar.root	 0	 0	  6	 1	O2
O2_K07_C02c_LH_BBH_BKG_run1/merge/wave_O2_K07_C02c_LH_BBH_BKG_run1.M2.V_hvetoLH.C_bin1_cut.S_ifar.root	 0	 0	  7	 1	O2
O2_K08_C02c_LH_BBH_BKG_run1/merge/wave_O2_K08_C02c_LH_BBH_BKG_run1.M2.V_hvetoLH.C_bin1_cut.S_ifar.root	 0	 0	  8	 1	O2
O2_K09_C02c_LH_BBH_BKG_run1/merge/wave_O2_K09_C02c_LH_BBH_BKG_run1.M2.V_hvetoLH.C_bin1_cut.S_ifar.root	 0	 0	  9	 1	O2
O2_K10_C02c_LH_BBH_BKG_run1/merge/wave_O2_K10_C02c_LH_BBH_BKG_run1.M2.V_hvetoLH.C_bin1_cut.S_ifar.root	 0	 0	 10	 1	O2
O2_K11_C02c_LH_BBH_BKG_run1/merge/wave_O2_K11_C02c_LH_BBH_BKG_run1.M2.V_hvetoLH.C_bin1_cut.S_ifar.root	 0	 0	 11	 1	O2
O2_K12_C02c_LH_BBH_BKG_run1/merge/wave_O2_K12_C02c_LH_BBH_BKG_run1.M2.V_hvetoLH.C_bin1_cut.S_ifar.root	 0	 0	 12	 1	O2
O2_K13_C02c_LH_BBH_BKG_run1/merge/wave_O2_K13_C02c_LH_BBH_BKG_run1.M2.V_hvetoLH.C_bin1_cut.S_ifar.root	 0	 0	 13	 1	O2
O2_K14_C02c_LH_BBH_BKG_run1/merge/wave_O2_K14_C02c_LH_BBH_BKG_run1.M2.V_hvetoLH.C_bin1_cut.S_ifar.root	 0	 0	 14	 1	O2
O2_K15_C02c_LH_BBH_BKG_run3/merge/wave_O2_K15_C02c_LH_BBH_BKG_run3.M2.V_hvetoLH.C_bin1_cut.S_ifar.root	 0	 0	 15	 1	O2
O2_K16_C02c_LH_BBH_BKG_run1/merge/wave_O2_K16_C02c_LH_BBH_BKG_run1.M2.V_hvetoLH.C_bin1_cut.S_ifar.root	 0	 0	 16	 1	O2
O2_K17_C02c_LH_BBH_BKG_run1/merge/wave_O2_K17_C02c_LH_BBH_BKG_run1.M2.V_hvetoLH.C_bin1_cut.S_ifar.root	 0	 0	 17	 1	O2
O2_K18_C02c_LH_BBH_BKG_run1/merge/wave_O2_K18_C02c_LH_BBH_BKG_run1.M2.V_hvetoLH.C_bin1_cut.S_ifar.root	 0	 0	 18	 1	O2
O2_K19_C02c_LH_BBH_BKG_run1/merge/wave_O2_K19_C02c_LH_BBH_BKG_run1.M2.V_hvetoLH.C_bin1_cut.S_ifar.root	 0	 0	 19	 1	O2
O2_K20_C02c_LH_BBH_BKG_run1/merge/wave_O2_K20_C02c_LH_BBH_BKG_run1.M2.V_hvetoLH.C_bin1_cut.S_ifar.root	 0	 0	 20	 1	O2
O2_K21_C02c_LH_BBH_BKG_run1/merge/wave_O2_K21_C02c_LH_BBH_BKG_run1.M2.V_hvetoLH.C_bin1_cut.S_ifar.root	 0	 0	 21	 1	O2
O2_K22_C02c_LH_BBH_BKG_run1/merge/wave_O2_K22_C02c_LH_BBH_BKG_run1.M2.V_hvetoLH.C_bin1_cut.S_ifar.root	 0	 0	 22	 1	O2
