0 1164600798
1164608249 1164608439
1164610090 1164611356
1164611719 1164613150
1164616194 1164629978
1164635957 1164659792
1164660707 1164660761
1164667796 1164683450
1164686894 1164686980
1164710980 1164711303
1164720685 1164736111
1164737113 1164737232
1164740200 1164753654
1164755129 1164755238
1164756402 1164756507
1164760102 1164761663
1164763765 1164763834
1164774480 1164777979
1164782044 1164786174
1164791076 1164791284
1164793474 1164801979
1164806026 1164806060
1164812487 1164815678
1164816995 1164817019
1164818178 1164820073
1164823070 1164823148
1164825365 1164825427
1164826375 1164828947
1164829601 1164829660
1164833250 1165040725
1165042192 1165066858
1165071619 1165116074
1165116236 1165116666
1165117341 1165117372
1165136316 1165142625
1165155680 1165155713
1165161120 1165161145
1165178866 1165178912
1165185024 1165185073
1165191617 1165192405
1165197628 1165207772
1165208522 1165209612
1165211010 1165221481
1165227389 1165230001
1165240613 1165297399
1165302020 1165309309
1165309750 1165341233
1165343062 1165372471
1165374015 1165374045
1165376273 1165386016
1165416474 1165441712
1165445043 1165447750
1165448948 1165449277
1165449439 1165453813
1165456308 1165459284
1165459456 1165459636
1165462285 1165464542
1165465525 1165471953
1165473447 1165482093
1165486466 1165495989
1165497687 1165502899
1165502930 1165531976
1165533085 1165536836
1165537764 1165560594
1165571297 1165578348
1165591465 1165593872
1165594445 1165597230
1165598115 1165603224
1165603723 1165605234
1165610163 1165618019
1165624794 1165626216
1165645269 1165654829
1165671634 1165702041
1165702622 1165703032
1165715194 1165715238
1165717873 1165727470
1165728493 1165728659
1165729091 1165729207
1165730209 1165730234
1165754540 1165759716
1165760979 1165764860
1165765378 1165766259
1165769593 1165776566
1165786184 1165786330
1165786492 1165786675
1165786877 1165787359
1165789191 1165791476
1165799777 1165799973
1165819025 1165822243
1165852715 1165853120
1165855614 1165866335
1165879416 1165889252
1165901541 1165901910
1165923570 1165929966
1165930210 1165930321
1165937061 1165942403
1165949510 1165955114
1165956611 1165956777
1165981018 1165986540
1165987876 1165989597
1165990324 1165990478
1165990560 1165992232
1165992884 1165994151
1165994759 1165996952
1165997696 1165999735
1166000631 1166221127
1166222964 1166226890
1166228540 1166232690
1166234248 1166235270
1166236067 1166240867
1166244081 1166259639
1166260332 1166262094
1166262272 1166264370
1166264830 1166272517
1166273627 1166306131
1166307931 1166309442
1166309616 1166336075
1166337588 1166338850
1166342769 1166344947
1166345560 1166358432
1166360595 1166362905
1166364478 1166365853
1166368397 1166387687
1166394978 1166395041
1166395076 1166398862
1166402755 1166405054
1166411327 1166413502
1166414886 1166426886
1166460326 1166463653
1166464142 1166466831
1166482852 1167536690
1167572316 1167572321
1167576840 1167587310
1167591498 1167593833
1167598963 1167599427
1167630075 1167634198
1167645302 1167654188
1167654612 1167656537
1167664843 1167667787
1167668648 1167679036
1167680982 1167684166
1167685969 1167690131
1167699195 1167710133
1167713997 1167715531
1167720775 1167724103
1167731830 1167734564
1167736768 1167740300
1167744532 1167751200
1167751304 1167940598
1167942010 1167943498
1167949644 1167980368
1167981251 1167982057
1167982663 1167983362
1167997478 1168008928
1168009043 1168042715
1168065110 1168127735
1168141494 1168148086
1168187042 1168212097
1168212380 1168217487
1168227039 1168231023
1168253752 1168257979
1168258402 1168259346
1168259516 1168259973
1168262270 1168262314
1168274142 1168277986
1168278681 1168278794
1168281600 1168281758
1168283394 1168286756
1168287443 1168287561
1168287780 1168287894
1168288108 1168288139
1168288688 1168290926
1168291355 1168298003
1168324634 1168331937
1168362854 1168366010
1168368712 1168378751
1168411186 1168419422
1168445947 1168453726
1168456926 1168459247
1168459772 1168459825
1168474983 1168481418
1168483582 1168483630
1168500203 1168503886
1168566144 1168566149
1168568054 1168576188
1168610501 1168620770
1168621866 1168625944
1168627498 1168629287
1168630463 1168630491
1168631784 1168632102
1168637878 1168649718
1168679563 1168693442
1168700397 1168723197
1168734519 1168734539
1168739180 1168739185
1168752591 1168761225
1168772275 1168780916
1168784606 1168788899
1168797799 1168802427
1168802834 1168802872
1168845692 1168849539
1168878579 1168878951
1168883627 1168883782
1168903463 1168921414
1168940100 1168949380
1169015393 1169018806
1169018880 1169019044
1169024592 1169035392
1169095521 1169207704
1169218062 1169237108
1169237834 1169238943
1169241014 1169241199
1169249464 1169256223
1169274709 1169281203
1169289495 1169298789
1169305198 1169347048
1169353719 1169353880
1169370308 1169375326
1169376328 1169377879
1169378611 1169385856
1169386921 1169477757
1169477957 1169487936
1169489567 1169498029
1169499410 1169501179
1169503929 1169504719
1169547547 1169548287
1169564005 1169570984
1169574220 1169581340
1169584818 1169590978
1169601817 1169605235
1169616026 1169619328
1169656065 1169664796
1169664928 1169674408
1169675640 1169679456
1169680643 1169685684
1169695954 1169701249
1169738875 1169778870
1169798047 1169803376
1169820366 1169825556
1169838186 1169843790
1169859173 1169866552
1169908883 1169949030
1170003158 1170011703
1170013140 1170020183
1170022006 1170032709
1170032939 1170039806
1170043116 1170047738
1170048670 1170049446
1170081383 1170086462
1170118554 1170122736
1170130731 1170131950
1170134371 1170140105
1170145789 1170145965
1170172048 1170197304
1170197756 1170197991
1170232509 1170233127
1170255322 1170284489
1170318828 1170318832
1170329012 1170338303
1170342744 1170343308
1170356098 1170360909
1170368062 1170370056
1170382168 1170382709
1170386755 1170386802
1170387500 1170387668
1170391603 1170408845
1170412534 1170412718
1170417427 1170427099
1170436244 1170439063
1170440387 1170444089
1170444542 1170462330
1170462762 1170462776
1170481938 1170489012
1170512877 1170577396
1170577626 1170577683
1170600465 1170602950
1170615326 1170618970
1170642623 1170645534
1170654624 1170658496
1170672366 1170676376
1170689746 1170695466
1170700523 1170703541
1170704557 1170708765
1170772986 1170786160
1170789019 1170789520
1170827655 1170831583
1170855235 1170860376
1170896413 1170899355
1170947955 1170951144
1170977665 1170981075
1171006987 1171010458
1171030633 1171030721
1171102345 1171105409
1171114633 1171153686
1171166741 1171208086
1171219007 1171219355
1171301364 1171321253
1171326992 1171327999
1171329199 1171331741
1171331809 1171331818
1171375243 1171375655
1171376550 1171377389
1171378051 1171378501
1171381588 1171382080
1171386522 1171388170
1171453417 1171462616
1171629787 1171634336
1171646616 1171657066
1171666295 1171672884
1171697059 1171700304
1171710460 1171714109
1171722309 1171744636
1171752777 1171755409
1171782384 1171784944
1171787501 1171789508
1171789963 1171792530
1171795511 1171797991
1171798098 1171800576
1171817988 1171824176
1171829701 1171851646
1171863774 1171868706
1171871525 1171871738
1171907092 1171907368
1171935304 1171941056
1171957195 1171958822
1171975835 1171978185
1171991972 1172020436
1172041728 1172041773
1172043399 1172043403
1172063929 1172071228
1172075434 1172080956
1172083127 1172083221
1172085000 1172088146
1172090423 1172093111
1172134323 1172138843
1172141666 1172146372
1172155614 1172162806
1172209770 1172214924
1172223895 1172228913
1172291457 1172297382
1172329436 1172354256
1172356441 1172362557
1172376215 1172382122
1172387194 1172388887
1172396324 1172397674
1172406123 1172408800
1172418810 1172425479
1172431626 1172432425
1172433887 1172447521
1172448821 1172448830
1172457783 1172460360
1172486013 1172486085
1172490026 1172496535
1172499451 1172523847
1172534016 1172535732
1172535857 1172536173
1172552345 1172554338
1172564416 1172570859
1172594834 1172602121
1172607289 1172615950
1172616282 1172619713
1172635040 1172642565
1172688161 1172695539
1172746666 1172752616
1172785517 1172803549
1172847946 1172847951
1172849131 1172878403
1172934075 1172965990
1172979423 1172984678
1173013560 1173038705
1173053149 1173054795
1173097632 1173102686
1173113944 1173116983
1173121408 1173136429
1173141780 1173141795
1173187652 1173194526
1173194887 1173196986
1173203038 1173203115
1173267230 1173269807
1173272929 1173272996
1173297618 1173352101
1173354361 1173354433
1173355387 1173360546
1173360746 1173393944
1173402761 1173408457
1173414733 1173420628
1173469551 1173472731
1173500025 1173505952
1173524175 1173527274
1173535269 1173556424
1173557900 1173557997
1173574339 1173577171
1173579561 1173579621
1173583179 1173585061
1173587079 1173587161
1173589107 1173591039
1173607280 1173611350
1173616737 1173641237
1173654276 1173659736
1173716911 1173720338
1173729833 1173729937
1173843999 1173847353
1173850108 1173853066
1173855162 1173855209
1173902418 1173902420
1173976546 1173985627
1173989051 1173989202
1173997194 1173997282
1174006249 1174006377
1174124159 1174127498
1174130423 1174132293
1174133481 1174133578
1174140255 1174168113
1174169373 1174172664
1174178893 1174180951
1174183658 1174185376
1174240984 1174256803
1174317012 1174355714
1174356388 1174356406
1174382465 1174388047
1174404643 1174407251
1174420517 1174423591
1174467894 1174471589
1174490438 1174493345
1174527635 1174536556
1174556510 1174559560
1174563059 1174564400
1174642669 1174644173
1174648294 1174659927
1174683719 1174685836
1174694542 1174694972
1174695150 1174697358
1174711372 1174713646
1174744823 1174769075
1174796478 1174814314
1174836324 1174867032
1174867949 1174869441
1174900383 1174924959
1174936629 1174939088
1174951189 1174953065
1174963250 1174966644
1174989107 1174991938
1175005926 1175008118
1175017888 1175026688
1175053199 1175056351
1175056384 1175056599
1175070328 1175070333
1175110716 1175114441
1175115502 1175124886
1175213494 1175226677
1175241282 1175255184
1175270151 1175272978
1175278307 1175291560
1175305940 1175308140
1175349595 1175372072
1175381527 1175388228
1175407681 1175417492
1175437176 1175440954
1175474176 1175474342
1175482205 1175553513
1175557562 1175559005
1175590797 1175592589
1175629793 1175635488
1175635671 1175640228
1175640601 1175643634
1175645341 1175645376
1175674868 1175681748
1175693186 1175696778
1175705334 1175707282
1175713574 1175713728
1175713874 1175714159
1175714174 1175714374
1175726426 1175730458
1175761375 1175763831
1175771194 1175773802
1175787563 1175789870
1175805747 1175809044
1175826548 1175828407
1175861674 1175864788
1175894543 1175897248
1175901242 1175902743
1175902789 1175909208
1175948590 1175951741
1175954431 1175980377
1175993267 1175995756
1176028294 1176032010
1176048028 1176161620
1176192490 1176196962
1176214180 1176215135
1176240003 1176240820
1176241232 1176241237
1176243552 1176246668
1176280677 1176289703
1176294579 1176300438
1176339845 1176342083
1176354728 1176354733
1176382475 1176383458
1176423307 1176425312
1176441422 1176450892
1176457884 1176457887
1176472218 1176476388
1176489505 1176496878
1176516597 1176519221
1176531370 1176533646
1176557698 1176585368
1176590494 1176592351
1176592384 1176592568
1176607332 1176610158
1176652815 1176678428
1176680834 1176684418
1176696387 1176698656
1176698880 1176698950
1176722647 1176724498
1176739227 1176755292
1176777855 1176785219
1176785302 1176785328
1176810803 1176812779
1176841982 1176846829
1176847620 1176848017
1176902816 1176907017
1176922460 1176922523
1176952447 1176959198
1177018950 1177026931
1177064294 1177074904
1177083491 1177083494
1177105788 1177123638
1177164045 1177182452
1177183150 1177198948
1177200200 1177209928
1177223289 1177225927
1177259186 1177281675
1177342001 1177367257
1177367300 1177369166
1177369720 1177370097
1177406716 1177409568
1177447521 1177520517
1177541567 1177654218
1177656078 1177658599
1177672779 1177707013
1177707103 1177707141
1177712279 1177714946
1177768901 1177792304
1177792997 1177796015
1177803870 1177811844
1177821009 1177824248
1177825125 1177839274
1177859718 1177877720
1177884996 1177893338
1177893978 1177980928
1177982476 1177985612
1177998922 1178004281
1178014684 1178018789
1178027601 1178029475
1178031433 1178063779
1178067033 1178072059
1178084106 1178086459
1178100327 1178102162
1178109462 1178112707
1178141834 1178141839
1178143501 1178145498
1178193204 1178196598
1178285782 1178287458
1178287615 1178287653
1178290827 1179814065
1179815773 1179815815
1179815946 1179816219
1179847707 1179924383
1179931420 1179939138
1179949995 1179985854
1179985903 1179985936
1179986018 1179986063
1179989635 1180002902
1180016748 1180019369
1180019533 1180022221
1180022876 1180023714
1180030088 1180037904
1180039136 1180077202
1180105143 1180162865
1180189764 1180249596
1180249947 1180253450
1180274922 1180276532
1180285162 1180285216
1180295607 1180312589
1180358872 1180361159
1180364925 1180364997
1180373277 1180380952
1180394153 1180403138
1180453443 1180469585
1180476896 1180494477
1180534856 1180540157
1180580477 1180580549
1180592345 1180595083
1180602318 1180604133
1180604451 1180606338
1180606464 1180606664
1180621835 1180626117
1180684101 1180685921
1180694257 1180696179
1180698860 1180701577
1180706966 1180749549
1180751175 1180763187
1180790064 1180819260
1180821032 1180822963
1180826602 1180826728
1180849520 1180853307
1180854433 1180857787
1180859227 1180862854
1180864272 1180867984
1180869386 1180875607
1180876926 1180895028
1180901458 1180901507
1180902262 1180914411
1181022600 1181030211
1181030945 1181048067
1181074877 1181092533
1181107145 1181113757
1181138186 1181144004
1181156249 1181173207
1181210134 1181239270
1181251370 1181254355
1181285196 1181290874
1181307521 1181326467
1181351746 1181355211
1181365061 1181369967
1181392342 1181397127
1181397785 1181442739
1181450466 1181453122
1181458095 1181476975
1181477146 1181477169
1181520526 1181529457
1181582461 1181605502
1181663061 1181666519
1181689072 1181692277
1181730817 1181767804
1181776118 1181779897
1181845005 1181849087
1181851859 1181859927
1181889848 1181896061
1181922638 1181922643
1181927860 1181949710
1182002505 1182212338
1182214344 1182215942
1182216192 1182216262
1182312477 1182319864
1182320009 1182320161
1182334732 1182337376
1182350175 1182353472
1182373478 1182375877
1182422272 1182424445
1182426062 1182427667
1182450914 1182460210
1182466732 1182468834
1182513308 1182524551
1182532815 1182535166
1182538730 1182540817
1182553786 1182555706
1182558443 1182560658
1182579770 1182581902
1182607274 1182636185
1182640250 1182641967
1182666816 1182670056
1182712445 1182718675
1182732811 1182738991
1182822816 1182833352
1182879744 1182879817
1182882985 1182884867
1182888833 1182890632
1182897723 1182905895
1182980413 1182991237
1182992669 1182994807
1182998512 1183000567
1183000953 1183003351
1183008871 1183012260
1183093427 1183101807
1183144268 1183147187
1183194808 1183197227
1183207449 1183211488
1183220807 1183226557
1183273715 1183278027
1183298457 1183324521
1183358155 1183387940
1183403279 1183411749
1183416366 1183422224
1183479384 1183488009
1183491390 1183501794
1183581052 1183585777
1183587875 1183590032
1183592917 1183594798
1183616178 1183620776
1183654845 1183656859
1183712930 1183718435
1183738067 1183741025
1183751764 1183762077
1183762545 1183768249
1183793970 1183808757
1183813454 1183847323
1183849194 1183856843
1183909816 1183947019
1183953966 1183997522
1184009745 1184033242
1184102995 1184103004
1184107085 1184127622
1184137864 1184140201
1184222699 1184225096
1184243993 1184245880
1184263389 1184267244
1184292942 1184296186
1184326021 1184336564
1184346731 1184364324
1184364904 1184365756
1184370374 1184402109
1184421027 1184456811
1184475182 1184479454
1184528999 1184537150
1184558101 1184563528
1184608562 1184610650
1184612976 1184615477
1184625908 1184649127
1184682939 1184687957
1184688494 1184688522
1184689546 1184689572
1184702343 1184718283
1184734465 1184738034
1184753513 1184766645
1184769173 1184780374
1184784541 1184795014
1184796474 1184798168
1184816439 1184818767
1184914218 1184916934
1184980231 1184982454
1185011193 1185013381
1185025671 1185053344
1185055372 1185062262
1185078061 1185080138
1185116169 1185116174
1185120855 1185122754
1185134144 1185136298
1185160868 1185179708
1185209254 1185211294
1185212379 1185235872
1185307467 1185324983
1185325056 1185325248
1185326277 1185328213
1185380559 1185383184
1185414753 1185416509
1185419201 1185419361
1185454497 1185456524
1185493487 1185499911
1185509870 1185511782
1185567246 1185582177
1185631465 1185648024
1185686035 1185688134
1185692842 1185695189
1185703715 1185706914
1185714093 1185717215
1185725680 1185749276
1185764509 1185766529
1185813600 1185828532
1185852415 1185859580
1185877297 1185885164
1185899378 1185908256
1185909696 1185911564
1185912267 1185915614
1185936846 1185938680
1185961200 1185963702
1185999074 1186004399
1186054457 1186058186
1186058240 1186058514
1186061163 1186063034
1186095020 1186097764
1186097840 1186099169
1186099200 1186099446
1186107557 1186108973
1186119405 1186124881
1186201219 1186203525
1186235394 1186262248
1186272461 1186281181
1186304054 1186307188
1186329803 1186342315
1186418824 1186434257
1186435954 1186439064
1186439168 1186439384
1186460391 1186461995
1186490403 1186491849
1186502512 1186525344
1186528322 1186531499
1186561208 1186567619
1186621174 1186642632
1186668195 1186670799
1186676273 1186678230
1186679835 1186683875
1186694318 1186696765
1186707549 1186711427
1186719874 1186724287
1186733720 1186735558
1186767946 1186772314
1186818067 1186823504
1186840847 1186862417
1186866203 1186869098
1186872861 1186874761
1186876539 1186879267
1186893397 1186896968
1186941750 1186953083
1187001382 1187004231
1187004416 1187004571
1187039542 1187041964
1187048797 1187050774
1187052164 1187053503
1187053568 1187053824
1187061743 1187072749
1187074322 1187076297
1187124167 1187127590
1187141918 1187144138
1187144699 1187150554
1187225084 1187227274
1187244597 1187247154
1187300383 1187305202
1187307747 1187310866
1187312020 1187313590
1187353743 1187357038
1187360176 1187366372
1187443322 1187470778
1187494760 1187499245
1187517063 1187524296
1187600980 1187605724
1187617289 1187618772
1187618816 1187619107
1187660674 1187662235
1187664891 1187666523
1187693287 1187695573
1187733618 4000000000
