INDEX VERSION 1.3+C:\Users\Edrick\Desktop\Java FX workspace\.metadata\.plugins\org.eclipse.wst.jsdt.core\indexes
466432325.index
2618807471.index
2950079345.index
3988617577.index
839167511.index
3995136197.index
