<?xml version="1.0" encoding="UTF-8"?>
<session version="1.0">
<refactoring comment="Rename resource &apos;NumericalMethods/src/GUI (1).java&apos; to &apos;GUI.java&apos;" description="Rename resource &apos;GUI (1).java&apos;" flags="7" id="org.eclipse.ltk.core.refactoring.rename.resource" input="src/GUI (1).java" name="GUI.java" stamp="1493382394410" updateReferences="true"/>
</session>