INDEX VERSION 1.3+C:\Users\Edrick\Desktop\newWorkspace\.metadata\.plugins\org.eclipse.wst.jsdt.core\indexes
437983519.index
1063223155.index
3181951865.index
597954511.index
1614285696.index
212037157.index
1228066942.index
3246169211.index
2042690334.index
1860286185.index
1682318057.index
2564529795.index
