127.0.0.1 - - [04/Jul/2016:11:09:47 +0800] "GET / HTTP/1.1" 404 951
0:0:0:0:0:0:0:1 - - [04/Jul/2016:11:09:56 +0800] "GET /code04New/ HTTP/1.1" 500 5093
0:0:0:0:0:0:0:1 - - [04/Jul/2016:11:10:36 +0800] "GET / HTTP/1.1" 404 951
0:0:0:0:0:0:0:1 - - [04/Jul/2016:11:10:36 +0800] "GET /favicon.ico HTTP/1.1" 404 973
0:0:0:0:0:0:0:1 - - [04/Jul/2016:11:11:02 +0800] "GET / HTTP/1.1" 404 951
0:0:0:0:0:0:0:1 - - [04/Jul/2016:11:12:26 +0800] "GET / HTTP/1.1" 404 951
127.0.0.1 - - [04/Jul/2016:11:20:25 +0800] "GET / HTTP/1.1" 404 951
0:0:0:0:0:0:0:1 - - [04/Jul/2016:11:20:35 +0800] "GET /code04New/ HTTP/1.1" 500 5093
127.0.0.1 - - [04/Jul/2016:11:22:23 +0800] "GET / HTTP/1.1" 404 951
0:0:0:0:0:0:0:1 - - [04/Jul/2016:11:22:25 +0800] "GET /code04New/ HTTP/1.1" 500 5093
0:0:0:0:0:0:0:1 - - [04/Jul/2016:11:23:10 +0800] "GET /code04New/index.html HTTP/1.1" 404 949
0:0:0:0:0:0:0:1 - - [04/Jul/2016:11:23:27 +0800] "GET /code04New/ HTTP/1.1" 404 949
127.0.0.1 - - [04/Jul/2016:11:23:55 +0800] "GET / HTTP/1.1" 404 951
0:0:0:0:0:0:0:1 - - [04/Jul/2016:11:24:01 +0800] "GET /code04New/ HTTP/1.1" 500 5093
0:0:0:0:0:0:0:1 - - [04/Jul/2016:11:31:51 +0800] "GET / HTTP/1.1" 404 951
0:0:0:0:0:0:0:1 - - [04/Jul/2016:11:32:51 +0800] "GET / HTTP/1.1" 404 951
0:0:0:0:0:0:0:1 - - [04/Jul/2016:11:33:10 +0800] "GET / HTTP/1.1" 404 951
0:0:0:0:0:0:0:1 - - [04/Jul/2016:11:34:45 +0800] "GET / HTTP/1.1" 404 951
0:0:0:0:0:0:0:1 - - [04/Jul/2016:13:39:47 +0800] "GET /help/topic/com.vmware.ICbase/images/vmware_favicon.ico HTTP/1.1" 404 1059
