ITEMID,DOC_REF,UPLOADED_BY,DOC_TITLE,SCHEME_CODE,PRINT_MONTH,PRINT_YEAR,EFFECTIVE_DATE,EXPIRY_DATE,STOCK,FORMAT_0001,APPROVER,PRODUCT_CODE,

A1001001A18I25B00008A04535,PHDHG14402,WRIGHT2,Leeds Buillding Society Important Information,QII,8,2018,10/09/2018,01/01/9999,No,PDF,-,"LHO",
A1001001A18I14A95321E47401,SHHYH0480B,WRIGHT2,Red Apple Goup Ltd Bright IPID,,9,2018,14/09/2018,01/01/9999,No,PYH,PDF,"SRCE",
A1001001A18I14B03032A68257,CHHHG14142,LOWESJ,"Insurance Product Information Document (BuildingsContents)",ILBC,8,2018,16/09/2018,01/01/9999,Yes,,-,"MHO",
A1001001A18I14B03033D68292,CHHHG14240,LOWESJ,Insurance Product Information Document (Home Emergency),ILHE,5,2018,16/09/2018,01/01/9999,Yes,,-,"MHO",
A1001001A18I14B03033I68294,CHHHG14241,LOWESJ,Insurance Product Information Document (Legal Services),ILLS,8,2018,16/09/2018,01/01/9999,Yes,,-,"MHO",
A1001001A18I14B03034C68298,CHHHG14242,LOWESJ,"Insurance Product Information Document (BuildingsContents)",IPBC,8,2018,16/09/2018,01/01/9999,Yes,,-,"BYSH",
A1001001A18I14B03034H68300,CHHHG14243,LOWESJ,Insurance Product Information Document (Home Emergency),IPHE,5,2018,16/09/2018,01/01/9999,Yes,,-,"BYSH",
A1001001A18I14B03035B68342,CHHHG14244,LOWESJ,Insurance Product Information Document (Legal Services),IPLS,8,2018,16/09/2018,01/01/9999,Yes,,-,"BYSH",
A1001001A18I14B03035H68346,CHHHG14245,LOWESJ,"Product Information (GadgetSportsBikePersonal Items)",IPPI,8,2018,16/09/2018,01/01/9999,Yes,,-,BYSH,
A1001001A18I14B03036B68348,CHHHG14246,LOWESJ,"Insurance Product Information Document (StudentStarter) ",IPSS,8,2018,16/09/2018,01/01/9999,Yes,,-,"BYSH",
A1001001A18I14B03036G68350,CHHHG14308,LOWESJ,Insurance Product Information Document (Landlord Cover),IPLD,8,2018,16/09/2018,01/01/9999,Yes,,-,"BYSH",
A1001001A18I14B03039F68399,CHHHG14310,LOWESJ,About our insurance services,SUM,8,2018,16/09/2018,01/01/9999,Yes,,-,"BYSH",
A1001001A18I14B03040A68405,CHHHG9916,LOWESJ,About our insurance services,SUM292,8,2018,16/09/2018,01/01/9999,Yes,,-,"MHO",
A1001001A18I14B03042D68415,CHHHG9919,LOWESJ,Full policy wording,POL292,8,2018,16/09/2018,01/01/9999,Yes,,-,"MHO",
A1001001A18I14B03044E68445,CHHHG10773,LOWESJ,Summary of Important Changes,NTP292,8,2018,16/09/2018,01/01/9999,Yes,,-,"MHO",
A1001001A18I14B05157F82089,CHHHG12403,LOWESJ,Important Information From Your Insurer,QII,8,2018,16/09/2018,01/01/9999,No,,-,"BYSH",
A1001001A18I14B42447B15608,CHHHG9184,LOWESJ,First Direct Home Policy Document,POLI,9,2018,16/09/2018,01/01/9999,Yes,,-,"FDHOM",
A1001001A18I14B42448F15614,CHHCB9890,LOWESJ,first direct Home Summary of Limits & Excesses,SLE,9,2018,16/09/2018,01/01/9999,Yes,,-,"FDHOM",
A1001001A18I14B42449A15616,CHHHG9219,LOWESJ,First Direct Home Important Information,QII,9,2018,16/09/2018,01/01/9999,Yes,,-,"FDHOM",
A1001001A18I14B42449J15684,CTRTG14498,LOWESJ,FD Travel Limits & Excess,SLE,9,2018,16/09/2018,01/01/9999,Yes,,-,"FDTRA",
A1001001A18I14B42450I15690,CTRTG9221,LOWESJ,First Direct Travel Important Information,QII,9,2018,16/09/2018,01/01/9999,Yes,,-,"FDTRA",
A1001001A18I14B42451F15694,CTRTG9186,LOWESJ,First Direct Travel Policy,POLI,9,2018,16/09/2018,01/01/9999,Yes,,-,"FDTRA",
A1001001A18I14B61221H83472,SCOOS0124B,DENNYJ,Jelf Locum Exp Policy and Certificate,POL,8,2018,15/09/2018,01/01/9999,No,PDF,-,"SGP076",
A1001001A18I14B61402C84349,SCOOS0127B,DENNYJ,Jelf Practice Expenses Policy and Certificate,POL,8,2018,15/09/2018,01/01/9999,No,PDF,-,"SGP076",
A1001001A18I14B61627E85837,SCBAS0787,DENNYJ,Jelf Locum Expenses Application and Summary,APP,8,2018,15/09/2018,01/01/9999,No,PDF,-,"SGP076",
A1001001A18I14B61758H87244,SCBAS0554,DENNYJ,Jelf Practice Expenses Summary and Application,APP,8,2018,15/09/2018,01/01/9999,No,PDF,-,"SGP076",
A1001001A18I17A92806F43677,CTRTG13957,WILLIDS,M&S Travel Insurance Policy Booklet,POL,9,2018,17/09/2018,01/01/9999,Yes,,-,"MAST",
A1001001A18I17A93141E45557,CTRTG13959,WILLIDS,M&S Travel Insurance Product Information Document,IPD,9,2018,17/09/2018,01/01/9999,Yes,,-,"MAST",
A1001001A18I17B02810F79203,SHHYH9385,DREPAUM,Eric Rawlins Your House Policy,POL,9,2018,12/09/2018,01/01/9999,No,PYH,-,"SERAW",
A1001001A18I18A95918J25500,,,,,,,,,No,,-,"",
A1001001A18I18A95918J25500,,,,,,,,,No,,-,"",
A1001001A18I18A95918J25500,,,,,,,,,No,,-,"",
A1001001A18I18A95918J25500,,,,,,,,,No,,-,"",
A1001001A18I18A95918J25500,,,,,,,,,No,,-,"",
A1001001A18I18A95918J25500,,,,,,,,,No,,-,"",
A1001001A18I18B00208H27108,BCOTR1258,STEBBIL,Private Car (Powerpoint) Policy,POL,8,2018,01/10/2018,01/01/9999,Yes,PDF,-,"PPC",
A1001001A18I18B00208H27108,BCOTR1258,STEBBIL,Private Car (Powerpoint) Policy,POL,8,2018,01/10/2018,01/01/9999,Yes,PDF,-,"",
A1001001A18I18B00208H27108,BCOTR1258,STEBBIL,Private Car (Powerpoint) Policy,POL,8,2018,01/10/2018,01/01/9999,Yes,PDF,-,"FC",
A1001001A18I18B00208H27108,BCOTR1258,STEBBIL,Private Car (Powerpoint) Policy,POL,8,2018,01/10/2018,01/01/9999,Yes,PDF,-,"FG",
A1001001A18I18B00208H27108,BCOTR1258,STEBBIL,Private Car (Powerpoint) Policy,POL,8,2018,01/10/2018,01/01/9999,Yes,PDF,-,"IC",
A1001001A18I18B00208H27108,BCOTR1258,STEBBIL,Private Car (Powerpoint) Policy,POL,8,2018,01/10/2018,01/01/9999,Yes,PDF,-,"IG",
A1001001A18I18B00504F28947,BCOTR1265,STEBBIL,Private Car (E Services) Policy,POL,8,2018,01/10/2018,01/01/9999,Yes,PDF,-,"PPC",
A1001001A18I18B00731H30669,BMODC2647,STEBBIL,Private Car (Home and Drivers Club) Policy,POL,8,2018,01/10/2018,01/01/9999,Yes,PDF,-,"PPC",
A1001001A18I18B01010C32251,BCOTR1263,STEBBIL,"Private Car (PowerpointE services and H&D Club) NTP ",OTH,10,2018,01/10/2018,01/01/9999,Yes,PDF,-,"PPC",
A1001001A18I18B01010C32251,BCOTR1263,STEBBIL,"Private Car (PowerpointE services and H&D Club) NTP ",OTH,10,2018,01/10/2018,01/01/9999,Yes,PDF,-,"",
A1001001A18I18B01010C32251,BCOTR1263,STEBBIL,"Private Car (PowerpointE services and H&D Club) NTP ",OTH,10,2018,01/10/2018,01/01/9999,Yes,PDF,-,"FC",
A1001001A18I18B01010C32251,BCOTR1263,STEBBIL,"Private Car (PowerpointE services and H&D Club) NTP ",OTH,10,2018,01/10/2018,01/01/9999,Yes,PDF,-,"FG",
A1001001A18I18B01010C32251,BCOTR1263,STEBBIL,"Private Car (PowerpointE services and H&D Club) NTP ",OTH,10,2018,01/10/2018,01/01/9999,Yes,PDF,-,"IC",
A1001001A18I18B01010C32251,BCOTR1263,STEBBIL,"Private Car (PowerpointE services and H&D Club) NTP ",OTH,10,2018,01/10/2018,01/01/9999,Yes,PDF,-,"IG",
A1001001A18I21B05109I33932,SCOAG10673,BOWLERN,AQMEN RECRUITMENT POLICY,POL,9,2018,21/09/2018,01/01/9999,No,CCS,-,"S1906",
A1001001A18I21B05347J35624,SCOAG13015,BOWLERN,AQMEN YOUR RECRUITMENT SOLUTION POLICY,POL,9,2018,21/09/2018,01/01/9999,No,CCS,-,"S1906",
A1001001A18I21B12736J57430,SCOSA8923,WILLIDS,SCHEMES TEMPLATE AGRICULTURE,POL,7,2018,21/09/2018,01/01/9999,No,PDF,-,"NONE",
A1001001A18I25A93610I90569,NHDHG14239,CLARKF1,AvivaPlus Online Home Important Info v1.0,POL,9,2018,16/09/2018,10/10/2018,No,PDF,-,"MTH",
A1001001A18I25A93917G92261,NMDMG14388,CLARKF1,AvivaPlus Online Motor Important Info v1.0,POL,9,2018,16/09/2018,10/10/2018,No,PDF,-,"MTM",
A1001001A18I25A93939D92517,NMDMG14388,CLARKF1,AvivaPlus Online Motor Important Info v1.0,,9,2018,16/09/2018,10/10/2018,No,Word,-,"",
A1001001A18I25A95025A99018,CHHHG13187,WRIGHT2,Important Information,QII,8,2018,10/09/2018,01/01/9999,No,PDF,-,"TSB",
A1001001A18I25B64125G42609,SNIHG14577,WRIGHT2,Comfort Insurance Horizon Home Comforts Plus Policy,POL,8,2018,25/09/2018,01/01/9999,No,PHP,-,"SCOMFT",
A1001001A18I25B64917A47480,SNIHG14578,WRIGHT2,Comfort Horizon Home Comforts Policy,POL,8,2018,25/09/2018,01/01/9999,No,PYH,-,"SCOMFT",
A1001001A18I26B62545I80078,BHHHP14712,SIMPSP3,Home Insurance Product Guide (Acturis and Fast Trade Only),OTH,10,2018,08/10/2018,01/01/9999,No,PDF,-,"PHP",
A1001001A18I26B62545I80078,BHHHP14712,SIMPSP3,Home Insurance Product Guide (Acturis and Fast Trade Only),OTH,10,2018,08/10/2018,01/01/9999,No,PDF,-,"PYH",
A1001001A18I28A94804B35463,CTRTG13856,WRIGHT2,TSB Pick and Protect Travel Important Information,QII,7,2018,01/09/2018,01/01/9999,No,PDF,-,"TSBT",
A1001001A18J02A84359H48301,BCSCR13005,STEBBIL,COMMERCIAL CRIME INSURANCE APPLICATION,APP,7,2018,02/10/2018,01/01/9999,No,WEBPDF,-,"CEF",
A1001001A18J02B63512I43817,SHHCB0003B,DREPAUM,Brownhills Home IPID,,8,2018,02/10/2018,01/01/9999,No,PDF,-,"SBROMW",
A1001001A18J04B03333D80120,SCICN0716,STEBBIL,TRADE DIRECT HOME SUMMARY,SUM,9,2018,04/10/2018,01/01/9999,No,CCC,-,"1344",
A1001001A18J05A90405I52446,SNING2282,WILLIDS,Bryan James Chorus Master Proposal Form,APP,5,2018,05/10/2018,01/01/9999,No,CBE,-,"S1380",
A1001001A18J05A90640C55760,SNING2281,WILLIDS,Bryan James Melody Master Proposal Form,APP,5,2018,05/10/2018,01/01/9999,No,CBE,-,"S576",
A1001001A18J05A90904G58784,SNING2280,WILLIDS,Bryan James Pipe Master Proposal Form,APP,5,2018,05/10/2018,01/01/9999,No,CBE,-,"S1636",
A1001001A18J05A91103D61546,SNING2279,WILLIDS,Bryan James Rhythm Master Proposal Form,APP,5,2018,05/10/2018,01/01/9999,No,CBE,-,"S577",
A1001001A18J05A91349I63068,SNING1812,WILLIDS,Bryan James Variety Master Proposal Form,APP,5,2018,05/10/2018,01/01/9999,No,CBE,-,"S1621",
A1001001A18J05A91715A64508,SNING1117,WILLIDS,Bryan James Music Master Proposal Form,APP,5,2018,05/10/2018,01/01/9999,No,CPO,-,"NONE",
A1001001A18J05A92050A65957,SCOPI8894,WILLIDS,BBIS Proposal Form,APP,5,2018,05/10/2018,01/01/9999,No,CBE,-,"S574",
A1001001A18J07C02636B07014,,,,,,,08/10/2018,01/01/9999,No,,-,"PHP",