{
    "common": {
        "business_context": "connect.aviva.co.uk",
        "fragment_version": 1,
        "content_model": "news-card"
    },
    "publishing": {
        "start_date": "2018-09-15T16:00:00",
        "end_date": "2018-12-15T00:00:00",
        "published_date": "2018-09-15T16:00:00",
        "last_modified_by": "WICKSG",
        "last_modified_date": "2018-09-15T16:00:00"
    },
    "content": {
        "heading": "Welcome back Gail",
        "copy": "Your account abc@brokerage.com was last used on 17th April 2018 at 16:24.<br/> If you think this is incorrect, please contact us on 0800 158 2224<br/><br/>Club 110 Member | <span class='m-card-readmore'><a href='#'>Access the member lounge</a></span>",
        "style": "t-accent-dark t-accent-dark--dark-grey"
    }
}