{
    "common": {
        "business_context": "connect.aviva.co.uk",
        "fragment_version": 1,
        "content_model": "news-card"
    },
    "publishing": {
        "start_date": "2018-09-15T16:00:00",
        "end_date": "2018-12-15T00:00:00",
        "published_date": "2018-09-15T16:00:00",
        "last_modified_by": "WICKSG",
        "last_modified_date": "2018-09-15T16:00:00"
    },
    "content": [
        {
            "heading": "Club 110",
            "copy": "Members Lounge"
        }
    ]
}