{
    "common": {
        "business_context": "Aviva-Connect:adviser",
        "fragment_version": 1,
        "content_model": "masthead-selector"
    },
    "publishing": {
        "start_date": "2018-09-15T16:00:00",
        "end_date": "2018-12-15T00:00:00",
        "published_date": "2018-09-15T16:00:00",
        "last_modified_by": "WICKSG",
        "last_modified_date": "2018-09-15T16:00:00"
    },
    "content": {
        "language": [
            {
                "name": "UK, English",
                "icon": "en_GB.png",
                "url": "?lang=en_GB"
            },
            {
                "name": "FR, Fran&#xE7;ais",
                "icon": "fr_FR.png",
                "url": "?lang=fr_FR"
            },
            {
                "name": "PL, Polonais",
                "icon": "pl_PL.png",
                "url": "?lang=pl_PL"
            }
        ],
        "selector": [
            {
                "heading": "Connect PoC",
                "url": "/intermediary"
            },
            {
                "heading": "Adviser",
                "url": "/intermediary/adviser"
            },
            {
                "heading": "Broker",
                "url": "/intermediary/broker"
            },
            {
                "heading": "Health",
                "url": "/intermediary/health"
            }
        ]
    }
}