{
    "common": {
        "business_context": "framework",
        "fragment_version": 1,
        "content_model": "framework-masthead"
    },
    "publishing": {
        "start_date": "2018-09-15T16:00:00",
        "end_date": "2018-12-15T00:00:00",
        "published_date": "2018-09-15T16:00:00",
        "last_modified_by": "WICKSG",
        "last_modified_date": "2018-09-15T16:00:00"
    },
    "content": {}
}