{    "theme": {
    "section": "t-accent-light t-accent-light--lightest-blue t-card-accent-light",
    "card": "m-card--image-left m-card--50 m-card-keyline m-card-keyline--yellow",
    "layout": "",
    "image": "m-card-image--16x9"
},
    "common": {
        "business_context": "connect.aviva.co.uk",
        "fragment_version": 1,
        "content_model": "card-editorial"
    },
    "publishing": {
        "start_date": "2018-09-15T16:00:00",
        "end_date": "2018-12-15T00:00:00",
        "published_date": "2018-09-15T16:00:00",
        "last_modified_by": "WICKSG",
        "last_modified_date": "2018-09-15T16:00:00"
    },
    "content": [
        {
            "id": "aviva-focus",
            "heading": "Aviva focus",
            "cards": [
                {
                    "id": "business-development",
                    "heading": "Business development",
                    "subheading": "We've created a rich, full learning environment that helps you to grow and sharpen your skills. Built around engaging challenges and an extensive database of learning material, we help you reduce risks, develop skills, and grow your business",
                    "cta": "Read article",
                    "url": "/news/on-the-house",
                    "image": "https://www.aviva.co.uk/content/dam/aviva-public/gb/images/personal/retirement/saving-for-retirement/aviva-pension/retirement-saving-for-aviva-pension-story-2-1050-598.$public_product_tile_desktop$.jpg?$public_product_tile_desktop$"
                }
            ]
        }
    ]
}