{
    "common": {
        "business_context": "Aviva-Connect:adviser",
        "fragment_version": 1,
        "content_model": "masthead-navigation"
    },
    "publishing": {
        "start_date": "2018-09-15T16:00:00",
        "end_date": "2018-12-15T00:00:00",
        "published_date": "2018-09-15T16:00:00",
        "last_modified_by": "WICKSG",
        "last_modified_date": "2018-09-15T16:00:00"
    },
    "content": {
        "logo": {
            "img": "/images/logo/aviva-logo.png",
            "url": "#",
            "alt_text": "AVIVA"
        },
        "search": {
            "title": "Search",
            "url": "#"
        },
        "login": {},
        "register": {},
        "navigation": [
            {
                "title": "Demos",
                "url": "#",
                "sub_headings": [
                    {
                        "title": "Connect",
                        "links": [
                            {
                                "text": "Adviser",
                                "url": "/examples/connect-home-adviser.html",
                                "css_class": "bold_underline"
                            },
                            {
                                "text": "Broker",
                                "url": "/examples/connect-home-broker.html"
                            },
                            {
                                "text": "Health",
                                "url": "/examples/connect-home-health.html"
                            }
                        ]
                    },
                    {
                        "title": "Aviva (UK)",
                        "links": [
                            {
                                "text": "Self investment (bond)",
                                "url": "#"
                            },
                            {
                                "text": "Smooth managed funds",
                                "url": "#"
                            },
                            {
                                "text": "Visit Aviva Investers for more investment options",
                                "url": "#"
                            },
                            {
                                "text": "Find out more about Investments",
                                "url": "#",
                                "css_class": "bold_underline"
                            }
                        ]
                    },
                    {
                        "title": "Aviva (Worldwide)",
                        "links": [
                            {
                                "text": "Self investment (bond)",
                                "url": "#"
                            },
                            {
                                "text": "Smooth managed funds",
                                "url": "#"
                            },
                            {
                                "text": "Visit Aviva Investers for more investment options",
                                "url": "#"
                            },
                            {
                                "text": "Find out more about Investments",
                                "url": "#",
                                "css_class": "bold_underline"
                            }
                        ]
                    }
                ],
                "sub_navigation": [
                    {
                        "text": "Contact us",
                        "url": "#",
                        "alt_text": "Contact us about insurance",
                        "icon": "o-masthead-support__link--contact"
                    },
                    {
                        "text": "Online Services",
                        "url": "#",
                        "alt_text": "Make a claim about insurance",
                        "icon": "o-masthead-support__link--claim"
                    }
                ]
            },
            {
                "title": "Specifications",
                "url": "#",
                "sub_headings": [
                    {
                        "title": "Individual Pensions",
                        "links": [
                            {
                                "text": "Personal pension",
                                "url": "#"
                            },
                            {
                                "text": "Stakeholder pension",
                                "url": "#"
                            },
                            {
                                "text": "Find out more about individual pensions",
                                "url": "#"
                            }
                        ]
                    },
                    {
                        "title": "Annuities",
                        "links": [
                            {
                                "text": "Pension annuity",
                                "url": "#"
                            },
                            {
                                "text": "With Profits Pension annuity",
                                "url": "#"
                            },
                            {
                                "text": "Immediate Life Annuity",
                                "url": "#"
                            },
                            {
                                "text": "Find out more about annuities",
                                "url": "#"
                            }
                        ]
                    },
                    {
                        "title": "Equity Release",
                        "links": [
                            {
                                "text": "Lifetime Flexible Option",
                                "url": "#"
                            },
                            {
                                "text": "Lifestyle Lump Sum Max",
                                "url": "#"
                            },
                            {
                                "text": "Find out more about equity release",
                                "url": "#"
                            }
                        ]
                    },
                    {
                        "title": "Lifetime care",
                        "links": [
                            {
                                "text": "Immediate Lifetime Care",
                                "url": "#"
                            },
                            {
                                "text": "Secured Lifetime Care",
                                "url": "#"
                            },
                            {
                                "text": "Find out more about lifetime",
                                "url": "#"
                            }
                        ]
                    }
                ],
                "sub_section": {
                    "text": "Find out more about our retirement options",
                    "url": "#"
                },
                "sub_navigation": [
                    {
                        "text": "Contact us",
                        "url": "#",
                        "alt_text": "Contact us about insurance",
                        "icon": "o-masthead-support__link--contact"
                    },
                    {
                        "text": "Online Services",
                        "url": "#",
                        "alt_text": "Make a claim about insurance",
                        "icon": "o-masthead-support__link--claim"
                    }
                ]
            },
            {
                "title": "Content",
                "url": "#",
                "sub_headings": [
                    {
                        "title": "Personal Protection",
                        "links": [
                            {
                                "text": "Lifetime Insurance+",
                                "url": "#"
                            },
                            {
                                "text": "Critical Illness+",
                                "url": "#"
                            },
                            {
                                "text": "Whole of Life Insurance+",
                                "url": "#"
                            },
                            {
                                "text": "Income Protection+",
                                "url": "#"
                            },
                            {
                                "text": "Living Costs Protection",
                                "url": "#"
                            },
                            {
                                "text": "Find out more about personal protection",
                                "url": "#"
                            }
                        ]
                    },
                    {
                        "title": "Business Protection",
                        "links": [
                            {
                                "text": "Business Live Insurance Options",
                                "url": "#"
                            },
                            {
                                "text": "Relevant Life Insurance",
                                "url": "#"
                            },
                            {
                                "text": "Find out more about business protection",
                                "url": "#"
                            }
                        ]
                    }
                ],
                "sub_section": {
                    "text": "Find out more about our Protection options",
                    "url": "#"
                },
                "sub_navigation": [
                    {
                        "text": "Contact us",
                        "url": "#",
                        "alt_text": "Contact us about insurance",
                        "icon": "o-masthead-support__link--contact"
                    },
                    {
                        "text": "Online Services",
                        "url": "#",
                        "alt_text": "Make a claim about insurance",
                        "icon": "o-masthead-support__link--claim"
                    }
                ]
            }
        ]
    }
}