{
    "common": {
        "business_context": "Aviva-co-uk",
        "fragment_version": 1,
        "content_model": "masthead-navigation"
    },
    "publishing": {
        "start_date": "2018-09-15T16:00:00",
        "end_date": "2018-12-15T00:00:00",
        "published_date": "2018-09-15T16:00:00",
        "last_modified_by": "WICKSG",
        "last_modified_date": "2018-09-15T16:00:00"
    },
    "content": {
        "logo": {
            "img": "/images/logo/aviva-logo.png",
            "url": "",
            "alt_text": "AVIVA"
        },
        "search": {
            "title": "Search",
            "url": "/search/?q={q}"
        },
        "login": {},
        "register": {},
        "navigation": [
            {
                "title": "About us",
                "url": "#about_us",
                "sub_headings": [
                    {
                        "title": "Motor",
                        "links": [
                            {
                                "text": "Car insurance",
                                "url": "/insurance/motor/car-insurance/"
                            },
                            {
                                "text": "MultiCar insurance",
                                "url": "/insurance/motor/multi-car-insurance/"
                            },
                            {
                                "text": "Van insurance",
                                "url": "/insurance/motor/van-insurance/"
                            },
                            {
                                "text": "Business vehicle insurance",
                                "url": "/insurance/motor/business-vehicle-insurance/"
                            },
                            {
                                "text": "Breakdown cover",
                                "url": "/insurance/motor/breakdown-cover/"
                            },
                            {
                                "text": "Aviva Drive",
                                "url": "/insurance/motor/aviva-drive/"
                            },
                            {
                                "text": "Temporary Car Insurance",
                                "url": "/insurance/motor/short-term-car-insurance/"
                            },
                            {
                                "text": "View all motor products",
                                "url": "/insurance/motor"
                            }
                        ]
                    },
                    {
                        "title": "Home",
                        "links": [
                            {
                                "text": "Home insurance",
                                "url": "/insurance/home-products/home-insurance/"
                            },
                            {
                                "text": "Contents insurance",
                                "url": "/insurance/home-products/contents-insurance/"
                            },
                            {
                                "text": "Buildings insurance",
                                "url": "/insurance/home-products/buildings-insurance/"
                            },
                            {
                                "text": "Heating and boiler cover",
                                "url": "/insurance/home-products/heating-boiler-cover/"
                            },
                            {
                                "text": "Renters insurance",
                                "url": "/insurance/home-products/renters-insurnace/"
                            },
                            {
                                "text": "Landlords insurance",
                                "url": "/insurance/home-products/landlord-insurance/"
                            },
                            {
                                "text": "View all home products",
                                "url": "/insurance/home-products/"
                            }
                        ]
                    },
                    {
                        "title": "Life",
                        "links": [
                            {
                                "text": "Life insurance",
                                "url": "/insurance/life-products/life-insurance"
                            },
                            {
                                "text": "Critical illness cover",
                                "url": "/insurance/life-products/critial-illness-cover"
                            },
                            {
                                "text": "Over 50s life insurance",
                                "url": "/insurance/life-products/over-50-life-insurnace"
                            },
                            {
                                "text": "Free Parent Life cover",
                                "url": "/insurance/life-products/free-parent-life-cover"
                            },
                            {
                                "text": "View all life products",
                                "url": "/insurance/life-products/"
                            }
                        ]
                    },
                    {
                        "title": "More",
                        "links": [
                            {
                                "text": "Travel insurance",
                                "url": "/insurance/travel/"
                            },
                            {
                                "text": "Private health insurance",
                                "url": "/health/health-products/private-health-insurance/"
                            },
                            {
                                "text": "Pet insurance",
                                "url": "/insurance/pet-insurance/"
                            },
                            {
                                "text": "Personal accident insurance",
                                "url": "/insurance/personal-accident/"
                            },
                            {
                                "text": "Income protection insurance",
                                "url": "/insurance/income-protection-insurance/"
                            },
                            {
                                "text": "Business insurance",
                                "url": "/business/"
                            },
                            {
                                "text": "Aviva Private Clients",
                                "url": "/aviva-private-clients/"
                            }
                        ]
                    }
                ],
                "promo_card": {
                    "title": "Safer drivers save",
                    "copy": "Put your driving to the test {{firstname}}, with Aviva Drive, where safer drivers can make great savings on their car insurance.",
                    "button": "Find out more",
                    "url": "/good-thinking/safer-roads/"
                },
                "sub_section": {
                    "text": "View all Insurance products",
                    "url": "/insurance/"
                },
                "sub_navigation": [
                    {
                        "text": "Contact us",
                        "url": "/contact-us/",
                        "alt_text": "Contact us about insurance",
                        "icon": "o-masthead-support__link--contact"
                    },
                    {
                        "text": "Make a claim",
                        "url": "/make-a-claim",
                        "alt_text": "Make a claim about insurance",
                        "icon": "o-masthead-support__link--claim"
                    }
                ]
            },
            {
                "title": "Investors",
                "url": "#investments",
                "sub_headings": [
                    {
                        "title": "Investment products",
                        "links": [
                            {
                                "text": "Effortless investing",
                                "url": "/insurance/motor/car-insurance/"
                            }
                        ]
                    },
                    {
                        "title": "Know more",
                        "links": [
                            {
                                "text": "Effortless investing",
                                "url": "/insurance/motor/car-insurance/"
                            }
                        ]
                    },
                    {
                        "title": "Tools and calculators",
                        "links": [
                            {
                                "text": "Effortless investing",
                                "url": "/insurance/motor/car-insurance/"
                            }
                        ]
                    }
                ],
                "promo_card": {
                    "title": "Confused about funds?",
                    "copy": "Take a look at our Ready-made funds designed for all risk attitudes.",
                    "button": "Find out more",
                    "url": "https://portcullis.aviva.co.uk/portcullis/life-readymade-landing"
                },
                "sub_section": {
                    "text": "View all Investment products",
                    "url": "/investments/investment-products/"
                },
                "sub_navigation": [
                    {
                        "text": "Contact us",
                        "url": "/contact-us/",
                        "alt_text": "Contact us about insurance",
                        "icon": "o-masthead-support__link--contact"
                    }
                ]
            },
            {
                "title": "Newsroom",
                "url": "#newsroom",
                "sub_headings": [
                    {
                        "title": "dummy",
                        "links": [
                            {
                                "text": "dummy",
                                "url": "dummy"
                            }
                        ]
                    }
                ],
                "sub_navigation": [
                    {
                        "text": "Contact us",
                        "url": "/contact-us/",
                        "alt_text": "Contact us about insurance",
                        "icon": "o-masthead-support__link--contact"
                    }
                ]
            },
            {
                "title": "Careers",
                "url": "#careers",
                "sub_headings": [
                    {
                        "title": "dummy",
                        "links": [
                            {
                                "text": "dummy",
                                "url": "dummy"
                            }
                        ]
                    }
                ],
                "sub_navigation": [
                    {
                        "text": "Contact us",
                        "url": "/contact-us/",
                        "alt_text": "Contact us about insurance",
                        "icon": "o-masthead-support__link--contact"
                    }
                ]
            },
            {
                "title": "Social purpose",
                "url": "#social",
                "sub_headings": [
                    {
                        "title": "dummy",
                        "links": [
                            {
                                "text": "dummy",
                                "url": "dummy"
                            }
                        ]
                    }
                ],
                "sub_navigation": [
                    {
                        "text": "Contact us",
                        "url": "/contact-us/",
                        "alt_text": "Contact us about insurance",
                        "icon": "o-masthead-support__link--contact"
                    }
                ]
            }
        ]
    }
}