{
    "common": {
        "business_context": "Aviva-co-uk",
        "fragment_version": 1,
        "content_model": "global-head"
    },
    "publishing": {
        "start_date": "2018-09-15T16:00:00",
        "end_date": "2018-12-15T00:00:00",
        "published_date": "2018-09-15T16:00:00",
        "last_modified_by": "WICKSG",
        "last_modified_date": "2018-09-15T16:00:00"
    },
    "content": {
        "framework_cdn": "https://cdn.aviva.com/static/core/v.4.5.2",
        "root_www": "https://www.aviva.co.uk",
        "site_description": "Aviva Public Website",
        "site_title": "Insurance, Savings &amp; Investments - Aviva"
    }
}