{
    "common": {
        "business_context": "aviva-intermediary.aviva.co.uk",
        "fragment_version": 1,
        "content_model": "product-card"
    },
    "publishing": {
        "start_date": "2018-09-15T16:00:00",
        "end_date": "2018-12-15T00:00:00",
        "published_date": "2018-09-15T16:00:00",
        "last_modified_by": "WICKSG",
        "last_modified_date": "2018-09-15T16:00:00"
    },
    "content": {
        "heading": {
            "title": "Our product portfolio",
            "copy": "Looking for the latest information on one of our products? You can find the details you need in our product literature."
        },
        "cards": [
            {
                "heading": "Life Insurance+",
                "copy": "Life protection for you and your family",
                "text": "Documents",
                "url": "/intermediary/adviser/document-library/life-insurance"
            },
            {
                "heading": "Critical Illness+",
                "copy": "Income protection for when you cannot work due to illness",
                "text": "Documents",
                "url": "/intermediary/adviser/document-library/critical-illness"
            },
            {
                "heading": "Whole of Life Insurance+",
                "copy": "Supporting you with training material and product expertise",
                "text": "Documents",
                "url": "/intermediary/adviser/document-library/whole-of-life-insurance"
            },
            {
                "heading": "Income Protection",
                "copy": "This is dummy text that will need to be updated before going into production",
                "text": "Documents",
                "url": "/intermediary/adviser/document-library/income-protection"
            },
            {
                "heading": "Income Protection",
                "copy": "This is dummy text that will need to be updated before going into production",
                "text": "Documents",
                "url": "/intermediary/adviser/document-library/income-protection"
            },
            {
                "heading": "Income Protection",
                "copy": "This is dummy text that will need to be updated before going into production",
                "text": "Documents",
                "url": "/intermediary/adviser/document-library/income-protection"
            },
            {
                "heading": "Income Protection",
                "copy": "This is dummy text that will need to be updated before going into production",
                "text": "Documents",
                "url": "/intermediary/adviser/document-library/income-protection"
            },
            {
                "heading": "Income Protection",
                "copy": "This is dummy text that will need to be updated before going into production",
                "text": "Documents",
                "url": "/intermediary/adviser/document-library/income-protection"
            },
            {
                "heading": "Income Protection",
                "copy": "This is dummy text that will need to be updated before going into production",
                "text": "Documents",
                "url": "/intermediary/adviser/document-library/income-protection"
            }
        ]
    }
}