{
    "themes": {
        "light-white": {
            "section": "",
            "card": ""
        },
        "light-grey": {
            "section": "t-accent-light t-accent-light--grey t-card-accent-light",
            "card": "t-card-accent-light t-card-accent-light--white"
        }
    }
}