{
    "common": {
        "business_context": "connect.aviva.co.uk",
        "fragment_version": 1,
        "content_model": "banner-carousel"
    },
    "publishing": {
        "start_date": "2018-09-15T16:00:00",
        "end_date": "2018-12-15T00:00:00",
        "published_date": "2018-09-15T16:00:00",
        "last_modified_by": "WICKSG",
        "last_modified_date": "2018-09-15T16:00:00"
    },
    "content": [
        {
            "heading": "Welcome to Aviva",
            "sub-heading": "We give our 33 million customers the confidence and control to be ready for life’s opportunities and challenges.",
            "copy": "Terms and conditions apply. Aviva offers products regulated by the Financial Conduct Audhority.",
            "img": "Defy-uncertainty",
            "icon": "",
            "url": "",
            "button": [
                {
                    "text": "Learn more",
                    "url": "/about-us/our-purpose-and-values",
                    "css-class": "btn--transparent"
                }
            ]
        }
    ]
}