{
    "theme": {
        "section": "t-accent-light t-accent-light--lightest-blue t-card-accent-light",
        "card": "t-card-accent-light t-card-accent-light--white m-card-keyline m-card-keyline--yellow",
        "layout": "l-columns--3-medium l-columns--3-large",
        "image": "m-card-image--16x9"
    },
    "common": {
        "business_context": "my-aviva",
        "fragment_version": 1,
        "content_model": "card-navigation"
    },
    "publishing": {
        "start_date": "2018-09-15T16:00:00",
        "end_date": "2018-12-15T00:00:00",
        "published_date": "2018-09-15T16:00:00",
        "last_modified_by": "WICKSG",
        "last_modified_date": "2018-09-15T16:00:00"
    },
    "content": [
        {
            "id": "my-aviva-offers",
            "heading": "Featured products and discounts for existing customers",
            "subheading": "",
            "cards": [
                {
                    "heading": "Travel insurance",
                    "subheading": "",
                    "cta": "Find out more",
                    "url": "/travel-insurance",
                    "image": "https://systest.aviva.co.uk/shared/dynamic-service-mock/iconTravel.jpg",
                    "applicableTo": "MYAVIVA_LP.TRAVEL",
                    "id": "MYAVIVA_LP.TRAVEL"
                },
                {
                    "heading": "Aviva ISA",
                    "subheading": "",
                    "cta": "Find out more",
                    "url": "/aviva-isa",
                    "image": "https://systest.aviva.co.uk/shared/dynamic-service-mock/iconStocksAndSharesISA.jpg",
                    "applicableTo": "MYAVIVA_LP.AVIVAISA",
                    "id": "MYAVIVA_LP.AVIVAISA"
                },
                {
                    "heading": "Breakdown cover",
                    "subheading": "",
                    "cta": "Find out more",
                    "url": "/breakdown-cover",
                    "image": "https://systest.aviva.co.uk/shared/dynamic-service-mock/iconBreakdown.jpg",
                    "applicableTo": "MYAVIVA_LP.BREAKDOWNCOVER",
                    "id": "MYAVIVA_LP.BREAKDOWNCOVER"
                },
                {
                    "heading": "Pet insurance",
                    "subheading": "",
                    "cta": "Find out more",
                    "url": "/pet-insurance",
                    "image": "https://systest.aviva.co.uk/shared/dynamic-service-mock/iconPet.jpg",
                    "applicableTo": "MYAVIVA_LP.PETINSURANCE",
                    "id": "MYAVIVA_LP.PETINSURANCE"
                },
                {
                    "heading": "Pension",
                    "subheading": "",
                    "cta": "Find out more",
                    "url": "/Pension",
                    "image": "https://systest.aviva.co.uk/shared/dynamic-service-mock/iconPension.jpg",
                    "applicableTo": "MYAVIVA_LP.PENSION",
                    "id": "MYAVIVA_LP.PENSION"
                },
                {
                    "heading": "Car insurance",
                    "subheading": "",
                    "cta": "Find out more",
                    "url": "/car-insurance",
                    "image": "https://systest.aviva.co.uk/shared/dynamic-service-mock/iconCar.jpg",
                    "applicableTo": "MYAVIVA_LP.CARINSURANCE",
                    "id": "MYAVIVA_LP.CARINSURANCE"
                },
                {
                    "heading": "Home insurance",
                    "subheading": "",
                    "cta": "Find out more",
                    "url": "/Home-insurance",
                    "image": "https://systest.aviva.co.uk/shared/dynamic-service-mock/iconHome.jpg",
                    "applicableTo": "MYAVIVA_LP.HOMEINSURANCE",
                    "id": "MYAVIVA_LP.HOMEINSURANCE"
                },
                {
                    "heading": "Retirement And Savings",
                    "subheading": "",
                    "cta": "Find out more",
                    "url": "/Retirement-and-savings",
                    "image": "https://systest.aviva.co.uk/shared/dynamic-service-mock/iconRetirementAndSavings.jpg",
                    "applicableTo": "MYAVIVA_LP.RETIREMENTANDSAVINGS",
                    "id": "MYAVIVA_LP.RETIREMENTANDSAVINGS"
                },
                {
                    "heading": "50+ Life insurance",
                    "subheading": "",
                    "cta": "Find out more",
                    "url": "/50plus-life-insurance",
                    "image": "https://systest.aviva.co.uk/shared/dynamic-service-mock/iconFiftyPlusLifeInsurance.jpg",
                    "applicableTo": "MYAVIVA_LP.50PLUSLIFEINSURANCE",
                    "id": "MYAVIVA_LP.50PLUSLIFEINSURANCE"
                },
                {
                    "heading": "Physio essentials",
                    "subheading": "",
                    "cta": "Find out more",
                    "url": "/physio-essentials",
                    "image": "https://systest.aviva.co.uk/shared/dynamic-service-mock/offer-physio.jpg",
                    "applicableTo": "MYAVIVA_LP.PHYSIO",
                    "id": "MYAVIVA_LP.PHYSIO"
                },
                {
                    "heading": "Life insurance",
                    "subheading": "",
                    "cta": "Find out more",
                    "url": "/life-insurance",
                    "image": "https://systest.aviva.co.uk/shared/dynamic-service-mock/iconProtection.jpg",
                    "applicableTo": "MYAVIVA_LP.PROTECTION",
                    "id": "MYAVIVA_LP.PROTECTION"
                }
            ]
        }
    ]
}