com\umg\dw\api\controller\ProductController.class
com\umg\dw\api\repository\ProductRepository.class
com\umg\dw\api\config\CorsConfiguration.class
com\umg\dw\api\config\SwaggerConfig.class
com\umg\dw\api\repository\EstudianteCursoRepository.class
com\umg\dw\api\controller\EstudianteController.class
com\umg\dw\api\repository\EstudianteRepository.class
com\umg\dw\api\DWAPIApplication.class
com\umg\dw\api\repository\CursoRepository.class
