Time,CH A,CH B,
0.E+0,-1.15821E+0,-5.6094E+1,
5.0025E-3,-1.23821E+0,-6.0094E+1,
1.0005E-2,-1.15821E+0,-6.0094E+1,
1.50075E-2,-1.23821E+0,-6.0094E+1,
2.001E-2,-1.31821E+0,-6.0094E+1,
2.50125E-2,-1.15821E+0,-6.4094E+1,
3.0015E-2,-1.31821E+0,-6.0094E+1,
3.50175E-2,-1.23821E+0,-5.6094E+1,
4.002E-2,-1.23821E+0,-5.6094E+1,
4.50225E-2,-1.23821E+0,-6.0094E+1,
5.0025E-2,-1.23821E+0,-5.6094E+1,
5.50275E-2,-1.31821E+0,-5.6094E+1,
6.003E-2,-1.23821E+0,-5.2094E+1,
6.50325E-2,-1.31821E+0,-5.2094E+1,
7.0035E-2,-1.07821E+0,-4.8094E+1,
7.50375E-2,-1.15821E+0,-5.6094E+1,
8.004E-2,-1.15821E+0,-5.2094E+1,
8.50425E-2,-1.07821E+0,-5.2094E+1,
9.0045E-2,-1.15821E+0,-5.2094E+1,
9.50475E-2,-1.15821E+0,-4.8094E+1,
1.0005E-1,-1.23821E+0,-5.2094E+1,
1.05053E-1,-1.07821E+0,-4.4094E+1,
1.10055E-1,-1.07821E+0,-4.0094E+1,
1.15058E-1,-1.23821E+0,-4.4094E+1,
1.2006E-1,-1.23821E+0,-4.4094E+1,
1.25063E-1,-1.23821E+0,-4.0094E+1,
1.30065E-1,-1.31821E+0,-4.4094E+1,
1.35068E-1,-1.23821E+0,-4.0094E+1,
1.4007E-1,-1.15821E+0,-4.8094E+1,
1.45073E-1,-1.23821E+0,-4.8094E+1,
1.50075E-1,-1.15821E+0,-4.4094E+1,
1.55078E-1,-1.15821E+0,-4.8094E+1,
1.6008E-1,-1.15821E+0,-4.8094E+1,
1.65083E-1,-1.07821E+0,-4.0094E+1,
1.70085E-1,-1.07821E+0,-4.8094E+1,
1.75088E-1,-1.23821E+0,-5.6094E+1,
1.8009E-1,-1.07821E+0,-5.2094E+1,
1.85093E-1,-1.07821E+0,-5.2094E+1,
1.90095E-1,-1.07821E+0,-5.6094E+1,
1.95098E-1,-1.15821E+0,-5.2094E+1,
2.001E-1,-1.15821E+0,-6.4094E+1,
2.05103E-1,-1.15821E+0,-5.6094E+1,
2.10105E-1,-1.23821E+0,-5.6094E+1,
2.15108E-1,-1.15821E+0,-5.6094E+1,
2.2011E-1,-1.23821E+0,-5.2094E+1,
2.25113E-1,-1.23821E+0,-5.6094E+1,
2.30115E-1,-1.07821E+0,-5.2094E+1,
2.35118E-1,-1.15821E+0,-5.6094E+1,
2.4012E-1,-1.07821E+0,-4.8094E+1,
2.45123E-1,-1.07821E+0,-5.2094E+1,
2.50125E-1,-1.07821E+0,-4.8094E+1,
2.55128E-1,-1.23821E+0,-5.2094E+1,
2.6013E-1,-1.15821E+0,-5.6094E+1,
2.65133E-1,-1.15821E+0,-5.6094E+1,
2.70135E-1,-1.15821E+0,-5.2094E+1,
2.75138E-1,-1.07821E+0,-5.6094E+1,
2.8014E-1,-1.15821E+0,-5.2094E+1,
2.85143E-1,-1.15821E+0,-6.0094E+1,
2.90145E-1,-1.07821E+0,-5.6094E+1,
2.95148E-1,-9.98209E-1,-6.4094E+1,
3.0015E-1,-1.07821E+0,-6.8094E+1,
3.05153E-1,-1.15821E+0,-7.2094E+1,
3.10155E-1,-1.23821E+0,-6.4094E+1,
3.15158E-1,-1.07821E+0,-6.0094E+1,
3.2016E-1,-1.15821E+0,-6.0094E+1,
3.25163E-1,-1.23821E+0,-6.4094E+1,
3.30165E-1,-1.23821E+0,-6.0094E+1,
3.35168E-1,-1.23821E+0,-6.0094E+1,
3.4017E-1,-9.98209E-1,-6.0094E+1,
3.45173E-1,-1.07821E+0,-6.0094E+1,
3.50175E-1,-1.15821E+0,-5.6094E+1,
3.55178E-1,-1.23821E+0,-6.0094E+1,
3.6018E-1,-1.07821E+0,-6.0094E+1,
3.65183E-1,-1.15821E+0,-6.4094E+1,
3.70185E-1,-1.07821E+0,-6.4094E+1,
3.75188E-1,-1.15821E+0,-6.8094E+1,
3.8019E-1,-1.15821E+0,-6.4094E+1,
3.85193E-1,-1.07821E+0,-6.0094E+1,
3.90195E-1,-1.15821E+0,-6.4094E+1,
3.95198E-1,-1.07821E+0,-6.4094E+1,
4.002E-1,-1.07821E+0,-6.4094E+1,
4.05203E-1,-1.07821E+0,-6.8094E+1,
4.10205E-1,-9.98209E-1,-6.4094E+1,
4.15208E-1,-9.98209E-1,-6.0094E+1,
4.2021E-1,-9.98209E-1,-5.6094E+1,
4.25213E-1,-9.98209E-1,-6.8094E+1,
4.30215E-1,-1.07821E+0,-6.0094E+1,
4.35218E-1,-9.98209E-1,-5.6094E+1,
4.4022E-1,-1.07821E+0,-5.2094E+1,
4.45223E-1,-1.07821E+0,-5.2094E+1,
4.50225E-1,-9.98209E-1,-4.8094E+1,
4.55228E-1,-9.98209E-1,-5.2094E+1,
4.6023E-1,-9.98209E-1,-5.6094E+1,
4.65233E-1,-9.98209E-1,-4.8094E+1,
4.70235E-1,-1.15821E+0,-5.2094E+1,
4.75238E-1,-1.07821E+0,-4.8094E+1,
4.8024E-1,-1.07821E+0,-5.2094E+1,
4.85243E-1,-1.15821E+0,-6.0094E+1,
4.90245E-1,-1.07821E+0,-5.6094E+1,
4.95248E-1,-1.15821E+0,-5.2094E+1,
5.0025E-1,-9.98209E-1,-4.8094E+1,
5.05253E-1,-1.07821E+0,-5.2094E+1,
5.10255E-1,-1.15821E+0,-6.4094E+1,
5.15258E-1,-9.98209E-1,-6.0094E+1,
5.2026E-1,-1.07821E+0,-6.0094E+1,
5.25263E-1,-1.07821E+0,-5.6094E+1,
5.30265E-1,-1.07821E+0,-5.6094E+1,
5.35268E-1,-1.07821E+0,-5.2094E+1,
5.4027E-1,-1.07821E+0,-5.2094E+1,
5.45273E-1,-1.07821E+0,-5.6094E+1,
5.50275E-1,-1.07821E+0,-5.6094E+1,
5.55278E-1,-1.07821E+0,-5.2094E+1,
5.6028E-1,-9.98209E-1,-5.2094E+1,
5.65283E-1,-1.15821E+0,-5.6094E+1,
5.70285E-1,-9.98209E-1,-4.4094E+1,
5.75288E-1,-1.07821E+0,-5.2094E+1,
5.8029E-1,-1.07821E+0,-5.2094E+1,
5.85293E-1,-9.98209E-1,-4.8094E+1,
5.90295E-1,-9.98209E-1,-4.8094E+1,
5.95298E-1,-1.07821E+0,-5.6094E+1,
6.003E-1,-1.07821E+0,-5.6094E+1,
6.05303E-1,-1.07821E+0,-4.8094E+1,
6.10305E-1,-1.07821E+0,-4.8094E+1,
6.15308E-1,-1.07821E+0,-4.4094E+1,
6.2031E-1,-1.07821E+0,-4.8094E+1,
6.25313E-1,-9.98209E-1,-4.8094E+1,
6.30315E-1,-9.98209E-1,-6.0094E+1,
6.35318E-1,-9.18209E-1,-5.6094E+1,
6.4032E-1,-1.07821E+0,-5.6094E+1,
6.45323E-1,-1.07821E+0,-5.2094E+1,
6.50325E-1,-1.07821E+0,-5.6094E+1,
6.55328E-1,-1.07821E+0,-5.2094E+1,
6.6033E-1,-9.18209E-1,-5.2094E+1,
6.65333E-1,-1.15821E+0,-5.6094E+1,
6.70335E-1,-9.98209E-1,-5.2094E+1,
6.75338E-1,-9.98209E-1,-5.6094E+1,
6.8034E-1,-9.18209E-1,-5.2094E+1,
6.85343E-1,-1.07821E+0,-4.8094E+1,
6.90345E-1,-9.18209E-1,-4.4094E+1,
6.95348E-1,-1.07821E+0,-4.4094E+1,
7.0035E-1,-9.98209E-1,-5.2094E+1,
7.05353E-1,-9.98209E-1,-5.2094E+1,
7.10355E-1,-9.98209E-1,-5.6094E+1,
7.15358E-1,-1.07821E+0,-6.0094E+1,
7.2036E-1,-9.98209E-1,-6.0094E+1,
7.25363E-1,-1.07821E+0,-6.4094E+1,
7.30365E-1,-9.98209E-1,-6.0094E+1,
7.35368E-1,-9.98209E-1,-6.4094E+1,
7.4037E-1,-9.98209E-1,-6.0094E+1,
7.45373E-1,-9.18209E-1,-5.6094E+1,
7.50375E-1,-9.98209E-1,-6.0094E+1,
7.55378E-1,-9.98209E-1,-5.2094E+1,
7.6038E-1,-9.18209E-1,-4.8094E+1,
7.65383E-1,-9.18209E-1,-5.2094E+1,
7.70385E-1,-9.98209E-1,-5.2094E+1,
7.75388E-1,-9.18209E-1,-6.0094E+1,
7.8039E-1,-9.18209E-1,-6.0094E+1,
7.85393E-1,-9.98209E-1,-5.6094E+1,
7.90395E-1,-9.98209E-1,-5.6094E+1,
7.95398E-1,-9.18209E-1,-5.2094E+1,
8.004E-1,-8.38209E-1,-4.8094E+1,
8.05403E-1,-1.07821E+0,-6.0094E+1,
8.10405E-1,-1.07821E+0,-6.0094E+1,
8.15408E-1,-9.18209E-1,-6.0094E+1,
8.2041E-1,-1.07821E+0,-6.0094E+1,
8.25413E-1,-9.98209E-1,-5.6094E+1,
8.30415E-1,-9.98209E-1,-5.2094E+1,
8.35418E-1,-1.07821E+0,-6.0094E+1,
8.4042E-1,-9.98209E-1,-6.0094E+1,
8.45423E-1,-8.38209E-1,-6.0094E+1,
8.50425E-1,-9.18209E-1,-5.6094E+1,
8.55428E-1,-9.18209E-1,-6.0094E+1,
8.6043E-1,-9.98209E-1,-6.0094E+1,
8.65433E-1,-9.98209E-1,-6.0094E+1,
8.70435E-1,-9.18209E-1,-5.2094E+1,
8.75438E-1,-9.18209E-1,-5.6094E+1,
8.8044E-1,-9.98209E-1,-5.6094E+1,
8.85443E-1,-9.18209E-1,-5.2094E+1,
8.90445E-1,-8.38209E-1,-5.2094E+1,
8.95448E-1,-9.18209E-1,-5.2094E+1,
9.0045E-1,-9.18209E-1,-5.6094E+1,
9.05453E-1,-9.98209E-1,-5.2094E+1,
9.10455E-1,-9.98209E-1,-6.0094E+1,
9.15458E-1,-8.38209E-1,-5.6094E+1,
9.2046E-1,-9.18209E-1,-5.2094E+1,
9.25463E-1,-9.18209E-1,-5.6094E+1,
9.30465E-1,-9.98209E-1,-5.6094E+1,
9.35468E-1,-9.18209E-1,-4.8094E+1,
9.4047E-1,-8.38209E-1,-4.8094E+1,
9.45473E-1,-9.98209E-1,-5.2094E+1,
9.50475E-1,-9.98209E-1,-5.2094E+1,
9.55478E-1,-9.18209E-1,-4.4094E+1,
9.6048E-1,-9.98209E-1,-4.8094E+1,
9.65483E-1,-9.18209E-1,-4.8094E+1,
9.70485E-1,-8.38209E-1,-5.2094E+1,
9.75488E-1,-9.18209E-1,-6.0094E+1,
9.8049E-1,-9.18209E-1,-5.6094E+1,
9.85493E-1,-9.18209E-1,-5.2094E+1,
9.90495E-1,-8.38209E-1,-6.0094E+1,
9.95498E-1,-9.98209E-1,-5.6094E+1,
1.0005E+0,-8.38209E-1,-5.2094E+1,
1.0055E+0,-9.98209E-1,-5.2094E+1,
1.01051E+0,-9.18209E-1,-6.0094E+1,
1.01551E+0,-9.18209E-1,-5.6094E+1,
1.02051E+0,-9.98209E-1,-4.8094E+1,
1.02551E+0,-9.98209E-1,-4.8094E+1,
1.03052E+0,-9.18209E-1,-5.2094E+1,
1.03552E+0,-8.38209E-1,-5.2094E+1,
1.04052E+0,-9.18209E-1,-5.2094E+1,
1.04552E+0,-8.38209E-1,-4.8094E+1,
1.05053E+0,-8.38209E-1,-4.4094E+1,
1.05553E+0,-8.38209E-1,-4.8094E+1,
1.06053E+0,-7.58209E-1,-5.2094E+1,
1.06553E+0,-8.38209E-1,-5.6094E+1,
1.07054E+0,-8.38209E-1,-5.2094E+1,
1.07554E+0,-8.38209E-1,-5.6094E+1,
1.08054E+0,-8.38209E-1,-5.2094E+1,
1.08554E+0,-7.58209E-1,-4.4094E+1,
1.09055E+0,-7.58209E-1,-4.8094E+1,
1.09555E+0,-9.18209E-1,-4.8094E+1,
1.10055E+0,-7.58209E-1,-4.8094E+1,
1.10555E+0,-8.38209E-1,-4.4094E+1,
1.11056E+0,-8.38209E-1,-4.4094E+1,
1.11556E+0,-8.38209E-1,-5.6094E+1,
1.12056E+0,-8.38209E-1,-6.0094E+1,
1.12556E+0,-8.38209E-1,-6.0094E+1,
1.13057E+0,-9.18209E-1,-6.0094E+1,
1.13557E+0,-7.58209E-1,-5.6094E+1,
1.14057E+0,-8.38209E-1,-5.6094E+1,
1.14557E+0,-8.38209E-1,-6.4094E+1,
1.15058E+0,-9.18209E-1,-6.4094E+1,
1.15558E+0,-9.18209E-1,-6.4094E+1,
1.16058E+0,-9.18209E-1,-6.4094E+1,
1.16558E+0,-9.18209E-1,-6.4094E+1,
1.17059E+0,-9.18209E-1,-6.4094E+1,
1.17559E+0,-8.38209E-1,-6.0094E+1,
1.18059E+0,-9.18209E-1,-5.6094E+1,
1.18559E+0,-7.58209E-1,-5.6094E+1,
1.1906E+0,-8.38209E-1,-5.6094E+1,
1.1956E+0,-8.38209E-1,-5.6094E+1,
1.2006E+0,-7.58209E-1,-5.6094E+1,
1.2056E+0,-7.58209E-1,-5.6094E+1,
1.21061E+0,-7.58209E-1,-4.8094E+1,
1.21561E+0,-9.18209E-1,-6.0094E+1,
1.22061E+0,-7.58209E-1,-4.8094E+1,
1.22561E+0,-6.78209E-1,-5.2094E+1,
1.23062E+0,-6.78209E-1,-4.8094E+1,
1.23562E+0,-9.18209E-1,-5.2094E+1,
1.24062E+0,-7.58209E-1,-4.4094E+1,
1.24562E+0,-9.18209E-1,-4.8094E+1,
1.25063E+0,-7.58209E-1,-4.4094E+1,
1.25563E+0,-9.18209E-1,-4.8094E+1,
1.26063E+0,-8.38209E-1,-4.8094E+1,
1.26563E+0,-7.58209E-1,-4.4094E+1,
1.27064E+0,-9.18209E-1,-4.4094E+1,
1.27564E+0,-7.58209E-1,-4.0094E+1,
1.28064E+0,-6.78209E-1,-4.8094E+1,
1.28564E+0,-8.38209E-1,-4.4094E+1,
1.29065E+0,-7.58209E-1,-4.4094E+1,
1.29565E+0,-8.38209E-1,-4.0094E+1,
1.30065E+0,-8.38209E-1,-4.0094E+1,
1.30565E+0,-8.38209E-1,-3.6094E+1,
1.31066E+0,-7.58209E-1,-4.0094E+1,
1.31566E+0,-7.58209E-1,-3.6094E+1,
1.32066E+0,-8.38209E-1,-4.4094E+1,
1.32566E+0,-6.78209E-1,-4.0094E+1,
1.33067E+0,-7.58209E-1,-4.4094E+1,
1.33567E+0,-7.58209E-1,-4.0094E+1,
1.34067E+0,-8.38209E-1,-4.0094E+1,
1.34567E+0,-8.38209E-1,-4.0094E+1,
1.35068E+0,-8.38209E-1,-4.0094E+1,
1.35568E+0,-8.38209E-1,-4.4094E+1,
1.36068E+0,-6.78209E-1,-4.4094E+1,
1.36568E+0,-8.38209E-1,-4.8094E+1,
1.37069E+0,-7.58209E-1,-4.8094E+1,
1.37569E+0,-8.38209E-1,-4.8094E+1,
1.38069E+0,-7.58209E-1,-4.8094E+1,
1.38569E+0,-6.78209E-1,-5.2094E+1,
1.3907E+0,-7.58209E-1,-5.2094E+1,
1.3957E+0,-6.78209E-1,-4.0094E+1,
1.4007E+0,-7.58209E-1,-4.0094E+1,
1.4057E+0,-6.78209E-1,-3.6094E+1,
1.41071E+0,-7.58209E-1,-3.2094E+1,
1.41571E+0,-8.38209E-1,-4.4094E+1,
1.42071E+0,-7.58209E-1,-4.0094E+1,
1.42571E+0,-7.58209E-1,-4.0094E+1,
1.43072E+0,-8.38209E-1,-4.4094E+1,
1.43572E+0,-8.38209E-1,-4.4094E+1,
1.44072E+0,-6.78209E-1,-3.6094E+1,
1.44572E+0,-8.38209E-1,-3.2094E+1,
1.45073E+0,-8.38209E-1,-4.0094E+1,
1.45573E+0,-8.38209E-1,-3.6094E+1,
1.46073E+0,-7.58209E-1,-4.4094E+1,
1.46573E+0,-8.38209E-1,-4.8094E+1,
1.47074E+0,-8.38209E-1,-4.8094E+1,
1.47574E+0,-8.38209E-1,-4.4094E+1,
1.48074E+0,-6.78209E-1,-4.0094E+1,
1.48574E+0,-9.18209E-1,-4.8094E+1,
1.49075E+0,-7.58209E-1,-4.0094E+1,
1.49575E+0,-7.58209E-1,-4.4094E+1,
1.50075E+0,-8.38209E-1,-4.0094E+1,
1.50575E+0,-7.58209E-1,-4.4094E+1,
1.51076E+0,-6.78209E-1,-3.6094E+1,
1.51576E+0,-6.78209E-1,-3.6094E+1,
1.52076E+0,-7.58209E-1,-3.2094E+1,
1.52576E+0,-7.58209E-1,-3.6094E+1,
1.53077E+0,-8.38209E-1,-4.0094E+1,
1.53577E+0,-7.58209E-1,-4.0094E+1,
1.54077E+0,-8.38209E-1,-4.0094E+1,
1.54577E+0,-6.78209E-1,-4.0094E+1,
1.55078E+0,-7.58209E-1,-4.0094E+1,
1.55578E+0,-7.58209E-1,-4.0094E+1,
1.56078E+0,-6.78209E-1,-3.6094E+1,
1.56578E+0,-8.38209E-1,-4.0094E+1,
1.57079E+0,-5.98209E-1,-3.2094E+1,
1.57579E+0,-7.58209E-1,-2.8094E+1,
1.58079E+0,-7.58209E-1,-3.2094E+1,
1.58579E+0,-6.78209E-1,-3.6094E+1,
1.5908E+0,-6.78209E-1,-3.2094E+1,
1.5958E+0,-5.98209E-1,-3.6094E+1,
1.6008E+0,-7.58209E-1,-4.0094E+1,
1.6058E+0,-7.58209E-1,-4.0094E+1,
1.61081E+0,-5.98209E-1,-4.0094E+1,
1.61581E+0,-7.58209E-1,-3.6094E+1,
1.62081E+0,-7.58209E-1,-4.0094E+1,
1.62581E+0,-5.98209E-1,-3.6094E+1,
1.63082E+0,-7.58209E-1,-4.0094E+1,
1.63582E+0,-7.58209E-1,-3.6094E+1,
1.64082E+0,-6.78209E-1,-3.6094E+1,
1.64582E+0,-6.78209E-1,-3.2094E+1,
1.65083E+0,-6.78209E-1,-3.6094E+1,
1.65583E+0,-6.78209E-1,-3.2094E+1,
1.66083E+0,-6.78209E-1,-2.8094E+1,
1.66583E+0,-6.78209E-1,-2.8094E+1,
1.67084E+0,-7.58209E-1,-2.8094E+1,
1.67584E+0,-7.58209E-1,-2.8094E+1,
1.68084E+0,-7.58209E-1,-2.8094E+1,
1.68584E+0,-5.98209E-1,-2.8094E+1,
1.69085E+0,-6.78209E-1,-2.4094E+1,
1.69585E+0,-5.98209E-1,-2.4094E+1,
1.70085E+0,-6.78209E-1,-2.8094E+1,
1.70585E+0,-5.98209E-1,-2.0094E+1,
1.71086E+0,-6.78209E-1,-3.2094E+1,
1.71586E+0,-5.98209E-1,-2.0094E+1,
1.72086E+0,-6.78209E-1,-2.4094E+1,
1.72586E+0,-6.78209E-1,-2.8094E+1,
1.73087E+0,-7.58209E-1,-2.0094E+1,
1.73587E+0,-6.78209E-1,-2.4094E+1,
1.74087E+0,-6.78209E-1,-2.0094E+1,
1.74587E+0,-7.58209E-1,-2.4094E+1,
1.75088E+0,-6.78209E-1,-3.2094E+1,
1.75588E+0,-5.98209E-1,-2.8094E+1,
1.76088E+0,-5.98209E-1,-2.4094E+1,
1.76588E+0,-7.58209E-1,-2.8094E+1,
1.77089E+0,-6.78209E-1,-2.0094E+1,
1.77589E+0,-5.98209E-1,-2.0094E+1,
1.78089E+0,-7.58209E-1,-2.4094E+1,
1.78589E+0,-5.98209E-1,-2.0094E+1,
1.7909E+0,-5.98209E-1,-2.0094E+1,
1.7959E+0,-5.98209E-1,-3.2094E+1,
1.8009E+0,-7.58209E-1,-3.6094E+1,
1.8059E+0,-5.98209E-1,-3.2094E+1,
1.81091E+0,-5.98209E-1,-2.8094E+1,
1.81591E+0,-6.78209E-1,-3.2094E+1,
1.82091E+0,-5.98209E-1,-3.2094E+1,
1.82591E+0,-6.78209E-1,-2.8094E+1,
1.83092E+0,-6.78209E-1,-2.4094E+1,
1.83592E+0,-6.78209E-1,-2.4094E+1,
1.84092E+0,-6.78209E-1,-2.0094E+1,
1.84592E+0,-6.78209E-1,-2.4094E+1,
1.85093E+0,-5.98209E-1,-2.4094E+1,
1.85593E+0,-6.78209E-1,-2.8094E+1,
1.86093E+0,-5.98209E-1,-2.0094E+1,
1.86593E+0,-6.78209E-1,-2.8094E+1,
1.87094E+0,-5.98209E-1,-2.8094E+1,
1.87594E+0,-5.98209E-1,-3.2094E+1,
1.88094E+0,-5.98209E-1,-3.2094E+1,
1.88594E+0,-6.78209E-1,-3.2094E+1,
1.89095E+0,-5.18209E-1,-2.4094E+1,
1.89595E+0,-5.98209E-1,-3.2094E+1,
1.90095E+0,-6.78209E-1,-2.8094E+1,
1.90595E+0,-5.98209E-1,-2.4094E+1,
1.91096E+0,-5.98209E-1,-2.4094E+1,
1.91596E+0,-5.98209E-1,-2.8094E+1,
1.92096E+0,-5.18209E-1,-2.4094E+1,
1.92596E+0,-5.98209E-1,-2.4094E+1,
1.93097E+0,-5.98209E-1,-2.4094E+1,
1.93597E+0,-6.78209E-1,-3.2094E+1,
1.94097E+0,-5.98209E-1,-3.2094E+1,
1.94597E+0,-5.98209E-1,-3.2094E+1,
1.95098E+0,-5.98209E-1,-2.8094E+1,
1.95598E+0,-5.18209E-1,-2.4094E+1,
1.96098E+0,-6.78209E-1,-1.6094E+1,
1.96598E+0,-5.98209E-1,-1.6094E+1,
1.97099E+0,-5.98209E-1,-8.094E+0,
1.97599E+0,-6.78209E-1,-1.2094E+1,
1.98099E+0,-5.98209E-1,-8.094E+0,
1.98599E+0,-5.18209E-1,-1.2094E+1,
1.991E+0,-5.98209E-1,-1.6094E+1,
1.996E+0,-6.78209E-1,-1.6094E+1,
2.001E+0,-5.18209E-1,-1.2094E+1,
2.006E+0,-5.98209E-1,-1.6094E+1,
2.01101E+0,-6.78209E-1,-2.0094E+1,
2.01601E+0,-5.18209E-1,-2.0094E+1,
2.02101E+0,-5.98209E-1,-2.0094E+1,
2.02601E+0,-6.78209E-1,-2.0094E+1,
2.03102E+0,-5.18209E-1,-1.2094E+1,
2.03602E+0,-5.18209E-1,-2.0094E+1,
2.04102E+0,-5.98209E-1,-2.0094E+1,
2.04602E+0,-5.18209E-1,-1.6094E+1,
2.05103E+0,-6.78209E-1,-2.0094E+1,
2.05603E+0,-5.18209E-1,-2.0094E+1,
2.06103E+0,-5.18209E-1,-1.6094E+1,
2.06603E+0,-5.18209E-1,-1.2094E+1,
2.07104E+0,-5.18209E-1,-1.2094E+1,
2.07604E+0,-5.98209E-1,-1.2094E+1,
2.08104E+0,-5.18209E-1,-8.094E+0,
2.08604E+0,-5.18209E-1,-1.2094E+1,
2.09105E+0,-5.18209E-1,-1.2094E+1,
2.09605E+0,-6.78209E-1,-1.2094E+1,
2.10105E+0,-4.38209E-1,-1.6094E+1,
2.10605E+0,-6.78209E-1,-1.2094E+1,
2.11106E+0,-5.98209E-1,-2.0094E+1,
2.11606E+0,-6.78209E-1,-1.6094E+1,
2.12106E+0,-5.98209E-1,-2.8094E+1,
2.12606E+0,-5.98209E-1,-2.8094E+1,
2.13107E+0,-5.98209E-1,-2.0094E+1,
2.13607E+0,-5.18209E-1,-1.6094E+1,
2.14107E+0,-5.98209E-1,-1.2094E+1,
2.14607E+0,-5.18209E-1,-2.0094E+1,
2.15108E+0,-6.78209E-1,-1.6094E+1,
2.15608E+0,-5.18209E-1,-1.6094E+1,
2.16108E+0,-5.98209E-1,-1.6094E+1,
2.16608E+0,-5.18209E-1,-1.6094E+1,
2.17109E+0,-5.98209E-1,-2.0094E+1,
2.17609E+0,-5.18209E-1,-1.2094E+1,
2.18109E+0,-5.18209E-1,-1.6094E+1,
2.18609E+0,-5.18209E-1,-2.0094E+1,
2.1911E+0,-5.98209E-1,-1.2094E+1,
2.1961E+0,-5.98209E-1,-8.094E+0,
2.2011E+0,-4.38209E-1,-8.094E+0,
2.2061E+0,-4.38209E-1,-1.6094E+1,
2.21111E+0,-5.98209E-1,-1.2094E+1,
2.21611E+0,-5.98209E-1,-1.2094E+1,
2.22111E+0,-5.18209E-1,-1.6094E+1,
2.22611E+0,-5.18209E-1,-4.094E+0,
2.23112E+0,-5.18209E-1,-8.094E+0,
2.23612E+0,-5.18209E-1,-8.094E+0,
2.24112E+0,-5.18209E-1,-4.094E+0,
2.24612E+0,-5.18209E-1,3.906E+0,
2.25113E+0,-5.18209E-1,3.906E+0,
2.25613E+0,-5.18209E-1,-4.094E+0,
2.26113E+0,-5.98209E-1,-4.094E+0,
2.26613E+0,-4.38209E-1,-4.094E+0,
2.27114E+0,-4.38209E-1,-4.094E+0,
2.27614E+0,-4.38209E-1,-9.4E-2,
2.28114E+0,-4.38209E-1,-9.4E-2,
2.28614E+0,-4.38209E-1,-9.4E-2,
2.29115E+0,-5.98209E-1,-4.094E+0,
2.29615E+0,-4.38209E-1,-4.094E+0,
2.30115E+0,-4.38209E-1,-4.094E+0,
2.30615E+0,-4.38209E-1,-9.4E-2,
2.31116E+0,-5.18209E-1,-9.4E-2,
2.31616E+0,-4.38209E-1,3.906E+0,
2.32116E+0,-5.18209E-1,-9.4E-2,
2.32616E+0,-5.98209E-1,-9.4E-2,
2.33117E+0,-5.98209E-1,7.906E+0,
2.33617E+0,-4.38209E-1,-9.4E-2,
2.34117E+0,-4.38209E-1,7.906E+0,
2.34617E+0,-5.18209E-1,7.906E+0,
2.35118E+0,-4.38209E-1,7.906E+0,
2.35618E+0,-3.58209E-1,3.906E+0,
2.36118E+0,-4.38209E-1,-9.4E-2,
2.36618E+0,-5.18209E-1,-9.4E-2,
2.37119E+0,-4.38209E-1,-9.4E-2,
2.37619E+0,-4.38209E-1,3.906E+0,
2.38119E+0,-5.18209E-1,3.906E+0,
2.38619E+0,-3.58209E-1,-9.4E-2,
2.3912E+0,-5.18209E-1,-9.4E-2,
2.3962E+0,-3.58209E-1,-9.4E-2,
2.4012E+0,-3.58209E-1,-9.4E-2,
2.4062E+0,-4.38209E-1,3.906E+0,
2.41121E+0,-5.18209E-1,3.906E+0,
2.41621E+0,-4.38209E-1,-9.4E-2,
2.42121E+0,-5.18209E-1,3.906E+0,
2.42621E+0,-4.38209E-1,1.1906E+1,
2.43122E+0,-3.58209E-1,7.906E+0,
2.43622E+0,-4.38209E-1,7.906E+0,
2.44122E+0,-3.58209E-1,1.1906E+1,
2.44622E+0,-5.18209E-1,7.906E+0,
2.45123E+0,-5.18209E-1,7.906E+0,
2.45623E+0,-5.18209E-1,7.906E+0,
2.46123E+0,-5.18209E-1,3.906E+0,
2.46623E+0,-4.38209E-1,3.906E+0,
2.47124E+0,-4.38209E-1,7.906E+0,
2.47624E+0,-4.38209E-1,-9.4E-2,
2.48124E+0,-3.58209E-1,3.906E+0,
2.48624E+0,-3.58209E-1,7.906E+0,
2.49125E+0,-4.38209E-1,3.906E+0,
2.49625E+0,-3.58209E-1,3.906E+0,
2.50125E+0,-3.58209E-1,3.906E+0,
2.50625E+0,-5.18209E-1,3.906E+0,
2.51126E+0,-5.18209E-1,3.906E+0,
2.51626E+0,-5.98209E-1,3.906E+0,
2.52126E+0,-4.38209E-1,3.906E+0,
2.52626E+0,-5.18209E-1,3.906E+0,
2.53127E+0,-4.38209E-1,7.906E+0,
2.53627E+0,-4.38209E-1,1.1906E+1,
2.54127E+0,-4.38209E-1,1.9906E+1,
2.54627E+0,-3.58209E-1,1.1906E+1,
2.55128E+0,-4.38209E-1,3.906E+0,
2.55628E+0,-4.38209E-1,1.1906E+1,
2.56128E+0,-3.58209E-1,7.906E+0,
2.56628E+0,-4.38209E-1,1.1906E+1,
2.57129E+0,-4.38209E-1,1.1906E+1,
2.57629E+0,-3.58209E-1,1.5906E+1,
2.58129E+0,-3.58209E-1,1.5906E+1,
2.58629E+0,-5.18209E-1,1.5906E+1,
2.5913E+0,-4.38209E-1,1.1906E+1,
2.5963E+0,-3.58209E-1,1.5906E+1,
2.6013E+0,-3.58209E-1,1.1906E+1,
2.6063E+0,-3.58209E-1,1.9906E+1,
2.61131E+0,-4.38209E-1,1.5906E+1,
2.61631E+0,-2.78209E-1,2.3906E+1,
2.62131E+0,-3.58209E-1,2.3906E+1,
2.62631E+0,-3.58209E-1,2.7906E+1,
2.63132E+0,-3.58209E-1,2.7906E+1,
2.63632E+0,-2.78209E-1,2.7906E+1,
2.64132E+0,-4.38209E-1,2.3906E+1,
2.64632E+0,-3.58209E-1,1.9906E+1,
2.65133E+0,-4.38209E-1,1.5906E+1,
2.65633E+0,-2.78209E-1,2.3906E+1,
2.66133E+0,-3.58209E-1,1.9906E+1,
2.66633E+0,-3.58209E-1,2.3906E+1,
2.67134E+0,-3.58209E-1,2.3906E+1,
2.67634E+0,-4.38209E-1,2.3906E+1,
2.68134E+0,-3.58209E-1,2.3906E+1,
2.68634E+0,-4.38209E-1,1.9906E+1,
2.69135E+0,-4.38209E-1,2.3906E+1,
2.69635E+0,-2.78209E-1,2.7906E+1,
2.70135E+0,-2.78209E-1,2.7906E+1,
2.70635E+0,-3.58209E-1,1.9906E+1,
2.71136E+0,-4.38209E-1,1.9906E+1,
2.71636E+0,-2.78209E-1,2.3906E+1,
2.72136E+0,-3.58209E-1,2.3906E+1,
2.72636E+0,-3.58209E-1,2.3906E+1,
2.73137E+0,-4.38209E-1,2.3906E+1,
2.73637E+0,-3.58209E-1,2.3906E+1,
2.74137E+0,-3.58209E-1,3.5906E+1,
2.74637E+0,-4.38209E-1,3.5906E+1,
2.75138E+0,-4.38209E-1,3.1906E+1,
2.75638E+0,-4.38209E-1,3.1906E+1,
2.76138E+0,-3.58209E-1,3.1906E+1,
2.76638E+0,-4.38209E-1,3.5906E+1,
2.77139E+0,-5.18209E-1,3.1906E+1,
2.77639E+0,-2.78209E-1,3.9906E+1,
2.78139E+0,-2.78209E-1,3.9906E+1,
2.78639E+0,-2.78209E-1,3.5906E+1,
2.7914E+0,-3.58209E-1,3.1906E+1,
2.7964E+0,-4.38209E-1,2.7906E+1,
2.8014E+0,-3.58209E-1,3.1906E+1,
2.8064E+0,-4.38209E-1,2.3906E+1,
2.81141E+0,-4.38209E-1,3.5906E+1,
2.81641E+0,-2.78209E-1,3.9906E+1,
2.82141E+0,-3.58209E-1,3.9906E+1,
2.82641E+0,-4.38209E-1,3.9906E+1,
2.83142E+0,-2.78209E-1,3.9906E+1,
2.83642E+0,-3.58209E-1,3.5906E+1,
2.84142E+0,-3.58209E-1,2.7906E+1,
2.84642E+0,-3.58209E-1,3.5906E+1,
2.85143E+0,-2.78209E-1,3.5906E+1,
2.85643E+0,-3.58209E-1,3.1906E+1,
2.86143E+0,-4.38209E-1,3.5906E+1,
2.86643E+0,-3.58209E-1,2.7906E+1,
2.87144E+0,-1.98209E-1,3.5906E+1,
2.87644E+0,-3.58209E-1,3.9906E+1,
2.88144E+0,-2.78209E-1,3.9906E+1,
2.88644E+0,-1.98209E-1,4.3906E+1,
2.89145E+0,-4.38209E-1,4.7906E+1,
2.89645E+0,-4.38209E-1,3.9906E+1,
2.90145E+0,-2.78209E-1,5.1906E+1,
2.90645E+0,-2.78209E-1,4.3906E+1,
2.91146E+0,-1.98209E-1,4.7906E+1,
2.91646E+0,-3.58209E-1,3.9906E+1,
2.92146E+0,-1.98209E-1,4.3906E+1,
2.92646E+0,-3.58209E-1,4.7906E+1,
2.93147E+0,-3.58209E-1,3.9906E+1,
2.93647E+0,-3.58209E-1,4.7906E+1,
2.94147E+0,-1.98209E-1,5.1906E+1,
2.94647E+0,-2.78209E-1,5.1906E+1,
2.95148E+0,-1.98209E-1,5.1906E+1,
2.95648E+0,-4.38209E-1,5.1906E+1,
2.96148E+0,-3.58209E-1,5.1906E+1,
2.96648E+0,-3.58209E-1,4.3906E+1,
2.97149E+0,-2.78209E-1,5.5906E+1,
2.97649E+0,-3.58209E-1,5.9906E+1,
2.98149E+0,-1.98209E-1,5.9906E+1,
2.98649E+0,-3.58209E-1,5.5906E+1,
2.9915E+0,-1.98209E-1,5.9906E+1,
2.9965E+0,-2.78209E-1,5.9906E+1,
3.0015E+0,-3.58209E-1,5.5906E+1,
3.0065E+0,-3.58209E-1,5.5906E+1,
3.01151E+0,-2.78209E-1,5.9906E+1,
3.01651E+0,-1.98209E-1,6.3906E+1,
3.02151E+0,-3.58209E-1,5.5906E+1,
3.02651E+0,-1.98209E-1,6.3906E+1,
3.03152E+0,-2.78209E-1,6.7906E+1,
3.03652E+0,-2.78209E-1,5.9906E+1,
3.04152E+0,-1.98209E-1,7.1906E+1,
3.04652E+0,-2.78209E-1,6.7906E+1,
3.05153E+0,-3.58209E-1,6.3906E+1,
3.05653E+0,-2.78209E-1,6.3906E+1,
3.06153E+0,-1.18209E-1,6.7906E+1,
3.06653E+0,-1.98209E-1,7.5906E+1,
3.07154E+0,-1.98209E-1,7.1906E+1,
3.07654E+0,-1.98209E-1,6.3906E+1,
3.08154E+0,-2.78209E-1,6.3906E+1,
3.08654E+0,-3.58209E-1,5.9906E+1,
3.09155E+0,-1.98209E-1,6.7906E+1,
3.09655E+0,-1.18209E-1,6.7906E+1,
3.10155E+0,-1.18209E-1,7.1906E+1,
3.10655E+0,-2.78209E-1,7.1906E+1,
3.11156E+0,-2.78209E-1,6.7906E+1,
3.11656E+0,-2.78209E-1,7.1906E+1,
3.12156E+0,-2.78209E-1,6.7906E+1,
3.12656E+0,-1.98209E-1,7.5906E+1,
3.13157E+0,-2.78209E-1,7.1906E+1,
3.13657E+0,-1.98209E-1,7.5906E+1,
3.14157E+0,-3.58209E-1,7.1906E+1,
3.14657E+0,-2.78209E-1,7.9906E+1,
3.15158E+0,-1.98209E-1,7.9906E+1,
3.15658E+0,-2.78209E-1,7.5906E+1,
3.16158E+0,-1.98209E-1,7.1906E+1,
3.16658E+0,-1.98209E-1,6.7906E+1,
3.17159E+0,-1.18209E-1,7.5906E+1,
3.17659E+0,-1.98209E-1,7.5906E+1,
3.18159E+0,-2.78209E-1,7.1906E+1,
3.18659E+0,-1.98209E-1,7.5906E+1,
3.1916E+0,-1.98209E-1,8.3906E+1,
3.1966E+0,-2.78209E-1,7.9906E+1,
3.2016E+0,-2.78209E-1,8.3906E+1,
3.2066E+0,-2.78209E-1,8.3906E+1,
3.21161E+0,-2.78209E-1,8.3906E+1,
3.21661E+0,-1.98209E-1,8.7906E+1,
3.22161E+0,-1.18209E-1,8.3906E+1,
3.22661E+0,-1.98209E-1,8.7906E+1,
3.23162E+0,-1.98209E-1,9.1906E+1,
3.23662E+0,-2.78209E-1,8.7906E+1,
3.24162E+0,-1.98209E-1,9.1906E+1,
3.24662E+0,-1.98209E-1,9.1906E+1,
3.25163E+0,-2.78209E-1,9.1906E+1,
3.25663E+0,-1.18209E-1,9.5906E+1,
3.26163E+0,-1.18209E-1,9.1906E+1,
3.26663E+0,-1.98209E-1,9.1906E+1,
3.27164E+0,-1.18209E-1,9.1906E+1,
3.27664E+0,-1.18209E-1,9.5906E+1,
3.28164E+0,-1.18209E-1,1.03906E+2,
3.28664E+0,-1.18209E-1,1.03906E+2,
3.29165E+0,-1.18209E-1,9.9906E+1,
3.29665E+0,-2.78209E-1,9.9906E+1,
3.30165E+0,-1.18209E-1,9.5906E+1,
3.30665E+0,-2.78209E-1,1.07906E+2,
3.31166E+0,-1.98209E-1,1.07906E+2,
3.31666E+0,-2.78209E-1,1.03906E+2,
3.32166E+0,-1.98209E-1,1.11906E+2,
3.32666E+0,-1.98209E-1,1.11906E+2,
3.33167E+0,-1.18209E-1,1.11906E+2,
3.33667E+0,-1.98209E-1,1.11906E+2,
3.34167E+0,-2.78209E-1,1.15906E+2,
3.34667E+0,-1.18209E-1,1.19906E+2,
3.35168E+0,-1.18209E-1,1.23906E+2,
3.35668E+0,-1.98209E-1,1.19906E+2,
3.36168E+0,-1.98209E-1,1.15906E+2,
3.36668E+0,-3.8209E-2,1.11906E+2,
3.37169E+0,-1.98209E-1,1.07906E+2,
3.37669E+0,-1.18209E-1,1.11906E+2,
3.38169E+0,-1.98209E-1,1.19906E+2,
3.38669E+0,-1.98209E-1,1.19906E+2,
3.3917E+0,-1.98209E-1,1.19906E+2,
3.3967E+0,-1.18209E-1,1.27906E+2,
3.4017E+0,-1.18209E-1,1.23906E+2,
3.4067E+0,-3.8209E-2,1.23906E+2,
3.41171E+0,-3.8209E-2,1.23906E+2,
3.41671E+0,-1.98209E-1,1.19906E+2,
3.42171E+0,-1.98209E-1,1.27906E+2,
3.42671E+0,-1.98209E-1,1.23906E+2,
3.43172E+0,-1.98209E-1,1.23906E+2,
3.43672E+0,-1.98209E-1,1.23906E+2,
3.44172E+0,-1.98209E-1,1.27906E+2,
3.44672E+0,-1.18209E-1,1.27906E+2,
3.45173E+0,-1.18209E-1,1.27906E+2,
3.45673E+0,-1.98209E-1,1.19906E+2,
3.46173E+0,-1.18209E-1,1.35906E+2,
3.46673E+0,-1.98209E-1,1.31906E+2,
3.47174E+0,-1.18209E-1,1.31906E+2,
3.47674E+0,-3.8209E-2,1.35906E+2,
3.48174E+0,-3.8209E-2,1.31906E+2,
3.48674E+0,-3.8209E-2,1.39906E+2,
3.49175E+0,-1.98209E-1,1.35906E+2,
3.49675E+0,-3.8209E-2,1.35906E+2,
3.50175E+0,-1.18209E-1,1.39906E+2,
3.50675E+0,-2.78209E-1,1.47906E+2,
3.51176E+0,-1.18209E-1,1.43906E+2,
3.51676E+0,-3.8209E-2,1.39906E+2,
3.52176E+0,-1.18209E-1,1.43906E+2,
3.52676E+0,-3.8209E-2,1.43906E+2,
3.53177E+0,-1.98209E-1,1.43906E+2,
3.53677E+0,-1.18209E-1,1.43906E+2,
3.54177E+0,-1.18209E-1,1.51906E+2,
3.54677E+0,-3.8209E-2,1.51906E+2,
3.55178E+0,-1.98209E-1,1.47906E+2,
3.55678E+0,-1.98209E-1,1.47906E+2,
3.56178E+0,-3.8209E-2,1.55906E+2,
3.56678E+0,-1.18209E-1,1.55906E+2,
3.57179E+0,-1.98209E-1,1.51906E+2,
3.57679E+0,-1.18209E-1,1.51906E+2,
3.58179E+0,4.1791E-2,1.51906E+2,
3.58679E+0,-1.98209E-1,1.47906E+2,
3.5918E+0,-3.8209E-2,1.51906E+2,
3.5968E+0,-1.98209E-1,1.55906E+2,
3.6018E+0,4.1791E-2,1.55906E+2,
3.6068E+0,-3.8209E-2,1.59906E+2,
3.61181E+0,-3.8209E-2,1.63906E+2,
3.61681E+0,-1.98209E-1,1.59906E+2,
3.62181E+0,4.1791E-2,1.63906E+2,
3.62681E+0,4.1791E-2,1.67906E+2,
3.63182E+0,-3.8209E-2,1.67906E+2,
3.63682E+0,-1.18209E-1,1.67906E+2,
3.64182E+0,-3.8209E-2,1.67906E+2,
3.64682E+0,-1.18209E-1,1.67906E+2,
3.65183E+0,-1.18209E-1,1.71906E+2,
3.65683E+0,-1.98209E-1,1.75906E+2,
3.66183E+0,-1.18209E-1,1.75906E+2,
3.66683E+0,-1.18209E-1,1.75906E+2,
3.67184E+0,-3.8209E-2,1.75906E+2,
3.67684E+0,-1.98209E-1,1.79906E+2,
3.68184E+0,-1.18209E-1,1.79906E+2,
3.68684E+0,-1.18209E-1,1.67906E+2,
3.69185E+0,-1.98209E-1,1.71906E+2,
3.69685E+0,-1.98209E-1,1.71906E+2,
3.70185E+0,4.1791E-2,1.75906E+2,
3.70685E+0,-1.18209E-1,1.79906E+2,
3.71186E+0,4.1791E-2,1.71906E+2,
3.71686E+0,-1.18209E-1,1.75906E+2,
3.72186E+0,-1.18209E-1,1.71906E+2,
3.72686E+0,4.1791E-2,1.79906E+2,
3.73187E+0,4.1791E-2,1.79906E+2,
3.73687E+0,-1.18209E-1,1.75906E+2,
3.74187E+0,-3.8209E-2,1.83906E+2,
3.74687E+0,-3.8209E-2,1.87906E+2,
3.75188E+0,-3.8209E-2,1.87906E+2,
3.75688E+0,4.1791E-2,1.79906E+2,
3.76188E+0,-3.8209E-2,1.83906E+2,
3.76688E+0,-1.18209E-1,1.79906E+2,
3.77189E+0,4.1791E-2,1.79906E+2,
3.77689E+0,-1.18209E-1,1.79906E+2,
3.78189E+0,4.1791E-2,1.83906E+2,
3.78689E+0,4.1791E-2,1.83906E+2,
3.7919E+0,-3.8209E-2,1.79906E+2,
3.7969E+0,4.1791E-2,1.71906E+2,
3.8019E+0,-1.18209E-1,1.79906E+2,
3.8069E+0,-1.18209E-1,1.79906E+2,
3.81191E+0,-1.98209E-1,1.79906E+2,
3.81691E+0,-3.8209E-2,1.75906E+2,
3.82191E+0,-3.8209E-2,1.75906E+2,
3.82691E+0,4.1791E-2,1.75906E+2,
3.83192E+0,-3.8209E-2,1.79906E+2,
3.83692E+0,-1.18209E-1,1.79906E+2,
3.84192E+0,-3.8209E-2,1.79906E+2,
3.84692E+0,-3.8209E-2,1.79906E+2,
3.85193E+0,-3.8209E-2,1.75906E+2,
3.85693E+0,-3.8209E-2,1.79906E+2,
3.86193E+0,4.1791E-2,1.79906E+2,
3.86693E+0,-1.18209E-1,1.71906E+2,
3.87194E+0,4.1791E-2,1.71906E+2,
3.87694E+0,4.1791E-2,1.75906E+2,
3.88194E+0,-3.8209E-2,1.75906E+2,
3.88694E+0,-3.8209E-2,1.71906E+2,
3.89195E+0,4.1791E-2,1.75906E+2,
3.89695E+0,1.21791E-1,1.83906E+2,
3.90195E+0,4.1791E-2,1.75906E+2,
3.90695E+0,4.1791E-2,1.71906E+2,
3.91196E+0,1.21791E-1,1.67906E+2,
3.91696E+0,1.21791E-1,1.67906E+2,
3.92196E+0,4.1791E-2,1.67906E+2,
3.92696E+0,4.1791E-2,1.59906E+2,
3.93197E+0,4.1791E-2,1.51906E+2,
3.93697E+0,4.1791E-2,1.51906E+2,
3.94197E+0,4.1791E-2,1.47906E+2,
3.94697E+0,4.1791E-2,1.43906E+2,
3.95198E+0,4.1791E-2,1.35906E+2,
3.95698E+0,4.1791E-2,1.39906E+2,
3.96198E+0,-3.8209E-2,1.35906E+2,
3.96698E+0,4.1791E-2,1.31906E+2,
3.97199E+0,1.21791E-1,1.31906E+2,
3.97699E+0,4.1791E-2,1.27906E+2,
3.98199E+0,-3.8209E-2,1.23906E+2,
3.98699E+0,4.1791E-2,1.19906E+2,
3.992E+0,1.21791E-1,1.15906E+2,
3.997E+0,1.21791E-1,1.15906E+2,
4.002E+0,4.1791E-2,1.11906E+2,
4.007E+0,4.1791E-2,1.03906E+2,
4.01201E+0,4.1791E-2,9.1906E+1,
4.01701E+0,-3.8209E-2,8.7906E+1,
4.02201E+0,-3.8209E-2,7.5906E+1,
4.02701E+0,2.01791E-1,7.5906E+1,
4.03202E+0,4.1791E-2,6.7906E+1,
4.03702E+0,4.1791E-2,6.3906E+1,
4.04202E+0,4.1791E-2,5.5906E+1,
4.04702E+0,-3.8209E-2,4.7906E+1,
4.05203E+0,-3.8209E-2,4.7906E+1,
4.05703E+0,1.21791E-1,3.9906E+1,
4.06203E+0,4.1791E-2,3.5906E+1,
4.06703E+0,1.21791E-1,2.7906E+1,
4.07204E+0,-3.8209E-2,1.9906E+1,
4.07704E+0,1.21791E-1,1.1906E+1,
4.08204E+0,4.1791E-2,3.906E+0,
4.08704E+0,4.1791E-2,-9.4E-2,
4.09205E+0,1.21791E-1,-8.094E+0,
4.09705E+0,4.1791E-2,-1.6094E+1,
4.10205E+0,4.1791E-2,-2.0094E+1,
4.10705E+0,-3.8209E-2,-2.8094E+1,
4.11206E+0,1.21791E-1,-3.2094E+1,
4.11706E+0,-3.8209E-2,-4.4094E+1,
4.12206E+0,1.21791E-1,-4.8094E+1,
4.12706E+0,1.21791E-1,-6.0094E+1,
4.13207E+0,4.1791E-2,-7.2094E+1,
4.13707E+0,1.21791E-1,-7.6094E+1,
4.14207E+0,4.1791E-2,-8.4094E+1,
4.14707E+0,1.21791E-1,-8.8094E+1,
4.15208E+0,2.01791E-1,-9.2094E+1,
4.15708E+0,1.21791E-1,-1.04094E+2,
4.16208E+0,2.01791E-1,-1.16094E+2,
4.16708E+0,1.21791E-1,-1.32094E+2,
4.17209E+0,4.1791E-2,-1.36094E+2,
4.17709E+0,1.21791E-1,-1.44094E+2,
4.18209E+0,1.21791E-1,-1.48094E+2,
4.18709E+0,1.21791E-1,-1.56094E+2,
4.1921E+0,4.1791E-2,-1.64094E+2,
4.1971E+0,2.01791E-1,-1.68094E+2,
4.2021E+0,4.1791E-2,-1.76094E+2,
4.2071E+0,1.21791E-1,-1.84094E+2,
4.21211E+0,1.21791E-1,-1.92094E+2,
4.21711E+0,-3.8209E-2,-2.04094E+2,
4.22211E+0,1.21791E-1,-2.04094E+2,
4.22711E+0,4.1791E-2,-2.12094E+2,
4.23212E+0,1.21791E-1,-2.20094E+2,
4.23712E+0,1.21791E-1,-2.28094E+2,
4.24212E+0,1.21791E-1,-2.32094E+2,
4.24712E+0,1.21791E-1,-2.44094E+2,
4.25213E+0,4.1791E-2,-2.48094E+2,
4.25713E+0,2.01791E-1,-2.52094E+2,
4.26213E+0,2.01791E-1,-2.60094E+2,
4.26713E+0,1.21791E-1,-2.64094E+2,
4.27214E+0,2.01791E-1,-2.64094E+2,
4.27714E+0,1.21791E-1,-2.72094E+2,
4.28214E+0,2.01791E-1,-2.76094E+2,
4.28714E+0,1.21791E-1,-2.80094E+2,
4.29215E+0,1.21791E-1,-2.88094E+2,
4.29715E+0,1.21791E-1,-2.96094E+2,
4.30215E+0,1.21791E-1,-3.00094E+2,
4.30715E+0,1.21791E-1,-3.00094E+2,
4.31216E+0,1.21791E-1,-3.08094E+2,
4.31716E+0,2.01791E-1,-3.12094E+2,
4.32216E+0,4.1791E-2,-3.20094E+2,
4.32716E+0,1.21791E-1,-3.20094E+2,
4.33217E+0,2.01791E-1,-3.28094E+2,
4.33717E+0,1.21791E-1,-3.32094E+2,
4.34217E+0,1.21791E-1,-3.32094E+2,
4.34717E+0,1.21791E-1,-3.32094E+2,
4.35218E+0,2.01791E-1,-3.36094E+2,
4.35718E+0,1.21791E-1,-3.36094E+2,
4.36218E+0,1.21791E-1,-3.40094E+2,
4.36718E+0,4.1791E-2,-3.40094E+2,
4.37219E+0,2.01791E-1,-3.40094E+2,
4.37719E+0,2.01791E-1,-3.44094E+2,
4.38219E+0,2.01791E-1,-3.44094E+2,
4.38719E+0,2.01791E-1,-3.48094E+2,
4.3922E+0,2.01791E-1,-3.56094E+2,
4.3972E+0,4.1791E-2,-3.60094E+2,
4.4022E+0,1.21791E-1,-3.64094E+2,
4.4072E+0,2.01791E-1,-3.60094E+2,
4.41221E+0,2.01791E-1,-3.64094E+2,
4.41721E+0,2.81791E-1,-3.64094E+2,
4.42221E+0,1.21791E-1,-3.68094E+2,
4.42721E+0,2.01791E-1,-3.68094E+2,
4.43222E+0,1.21791E-1,-3.64094E+2,
4.43722E+0,2.01791E-1,-3.64094E+2,
4.44222E+0,2.81791E-1,-3.60094E+2,
4.44722E+0,1.21791E-1,-3.64094E+2,
4.45223E+0,2.01791E-1,-3.68094E+2,
4.45723E+0,2.81791E-1,-3.72094E+2,
4.46223E+0,1.21791E-1,-3.76094E+2,
4.46723E+0,2.81791E-1,-3.76094E+2,
4.47224E+0,1.21791E-1,-3.76094E+2,
4.47724E+0,2.81791E-1,-3.72094E+2,
4.48224E+0,2.81791E-1,-3.72094E+2,
4.48724E+0,2.01791E-1,-3.76094E+2,
4.49225E+0,2.01791E-1,-3.80094E+2,
4.49725E+0,2.81791E-1,-3.76094E+2,
4.50225E+0,1.21791E-1,-3.72094E+2,
4.50725E+0,1.21791E-1,-3.76094E+2,
4.51226E+0,2.01791E-1,-3.80094E+2,
4.51726E+0,1.21791E-1,-3.72094E+2,
4.52226E+0,2.81791E-1,-3.72094E+2,
4.52726E+0,2.81791E-1,-3.68094E+2,
4.53227E+0,2.01791E-1,-3.68094E+2,
4.53727E+0,2.81791E-1,-3.68094E+2,
4.54227E+0,2.01791E-1,-3.68094E+2,
4.54727E+0,2.01791E-1,-3.68094E+2,
4.55228E+0,2.01791E-1,-3.72094E+2,
4.55728E+0,2.01791E-1,-3.72094E+2,
4.56228E+0,1.21791E-1,-3.72094E+2,
4.56728E+0,2.01791E-1,-3.64094E+2,
4.57229E+0,2.01791E-1,-3.64094E+2,
4.57729E+0,2.01791E-1,-3.64094E+2,
4.58229E+0,2.01791E-1,-3.60094E+2,
4.58729E+0,2.01791E-1,-3.60094E+2,
4.5923E+0,2.01791E-1,-3.64094E+2,
4.5973E+0,2.01791E-1,-3.72094E+2,
4.6023E+0,2.01791E-1,-3.72094E+2,
4.6073E+0,1.21791E-1,-3.68094E+2,
4.61231E+0,2.81791E-1,-3.64094E+2,
4.61731E+0,2.81791E-1,-3.68094E+2,
4.62231E+0,2.01791E-1,-3.64094E+2,
4.62731E+0,2.81791E-1,-3.68094E+2,
4.63232E+0,2.81791E-1,-3.68094E+2,
4.63732E+0,1.21791E-1,-3.68094E+2,
4.64232E+0,2.01791E-1,-3.64094E+2,
4.64732E+0,2.81791E-1,-3.64094E+2,
4.65233E+0,2.81791E-1,-3.60094E+2,
4.65733E+0,2.01791E-1,-3.64094E+2,
4.66233E+0,2.81791E-1,-3.60094E+2,
4.66733E+0,2.01791E-1,-3.60094E+2,
4.67234E+0,2.81791E-1,-3.48094E+2,
4.67734E+0,2.81791E-1,-3.52094E+2,
4.68234E+0,2.01791E-1,-3.56094E+2,
4.68734E+0,2.81791E-1,-3.56094E+2,
4.69235E+0,2.01791E-1,-3.52094E+2,
4.69735E+0,3.61791E-1,-3.48094E+2,
4.70235E+0,2.01791E-1,-3.56094E+2,
4.70735E+0,2.81791E-1,-3.44094E+2,
4.71236E+0,2.81791E-1,-3.48094E+2,
4.71736E+0,2.81791E-1,-3.48094E+2,
4.72236E+0,2.01791E-1,-3.52094E+2,
4.72736E+0,2.01791E-1,-3.44094E+2,
4.73237E+0,2.81791E-1,-3.44094E+2,
4.73737E+0,3.61791E-1,-3.40094E+2,
4.74237E+0,2.01791E-1,-3.40094E+2,
4.74737E+0,2.81791E-1,-3.44094E+2,
4.75238E+0,2.01791E-1,-3.44094E+2,
4.75738E+0,2.01791E-1,-3.44094E+2,
4.76238E+0,3.61791E-1,-3.40094E+2,
4.76738E+0,2.01791E-1,-3.36094E+2,
4.77239E+0,2.01791E-1,-3.36094E+2,
4.77739E+0,2.81791E-1,-3.40094E+2,
4.78239E+0,3.61791E-1,-3.40094E+2,
4.78739E+0,2.81791E-1,-3.44094E+2,
4.7924E+0,2.01791E-1,-3.36094E+2,
4.7974E+0,3.61791E-1,-3.32094E+2,
4.8024E+0,3.61791E-1,-3.28094E+2,
4.8074E+0,3.61791E-1,-3.28094E+2,
4.81241E+0,2.81791E-1,-3.28094E+2,
4.81741E+0,2.81791E-1,-3.24094E+2,
4.82241E+0,2.81791E-1,-3.28094E+2,
4.82741E+0,3.61791E-1,-3.24094E+2,
4.83242E+0,3.61791E-1,-3.32094E+2,
4.83742E+0,2.81791E-1,-3.28094E+2,
4.84242E+0,2.81791E-1,-3.24094E+2,
4.84742E+0,3.61791E-1,-3.24094E+2,
4.85243E+0,3.61791E-1,-3.24094E+2,
4.85743E+0,3.61791E-1,-3.24094E+2,
4.86243E+0,2.81791E-1,-3.20094E+2,
4.86743E+0,2.01791E-1,-3.20094E+2,
4.87244E+0,2.81791E-1,-3.20094E+2,
4.87744E+0,2.81791E-1,-3.20094E+2,
4.88244E+0,2.81791E-1,-3.20094E+2,
4.88744E+0,2.81791E-1,-3.28094E+2,
4.89245E+0,3.61791E-1,-3.20094E+2,
4.89745E+0,3.61791E-1,-3.20094E+2,
4.90245E+0,3.61791E-1,-3.16094E+2,
4.90745E+0,2.81791E-1,-3.20094E+2,
4.91246E+0,2.81791E-1,-3.20094E+2,
4.91746E+0,2.81791E-1,-3.24094E+2,
4.92246E+0,2.81791E-1,-3.16094E+2,
4.92746E+0,3.61791E-1,-3.16094E+2,
4.93247E+0,2.81791E-1,-3.16094E+2,
4.93747E+0,2.81791E-1,-3.20094E+2,
4.94247E+0,3.61791E-1,-3.16094E+2,
4.94747E+0,3.61791E-1,-3.20094E+2,
4.95248E+0,3.61791E-1,-3.12094E+2,
4.95748E+0,3.61791E-1,-3.04094E+2,
4.96248E+0,3.61791E-1,-3.08094E+2,
4.96748E+0,2.81791E-1,-3.08094E+2,
4.97249E+0,3.61791E-1,-3.12094E+2,
4.97749E+0,3.61791E-1,-3.08094E+2,
4.98249E+0,4.41791E-1,-3.08094E+2,
4.98749E+0,3.61791E-1,-3.08094E+2,
4.9925E+0,4.41791E-1,-3.08094E+2,
4.9975E+0,4.41791E-1,-2.96094E+2,
5.0025E+0,3.61791E-1,-3.00094E+2,
5.0075E+0,2.81791E-1,-3.00094E+2,
5.01251E+0,2.81791E-1,-2.96094E+2,
5.01751E+0,2.81791E-1,-2.96094E+2,
5.02251E+0,2.81791E-1,-2.96094E+2,
5.02751E+0,3.61791E-1,-2.92094E+2,
5.03252E+0,3.61791E-1,-2.92094E+2,
5.03752E+0,4.41791E-1,-2.84094E+2,
5.04252E+0,2.81791E-1,-2.84094E+2,
5.04752E+0,4.41791E-1,-2.88094E+2,
5.05253E+0,3.61791E-1,-2.88094E+2,
5.05753E+0,2.81791E-1,-2.88094E+2,
5.06253E+0,3.61791E-1,-2.88094E+2,
5.06753E+0,4.41791E-1,-2.88094E+2,
5.07254E+0,3.61791E-1,-2.88094E+2,
5.07754E+0,2.81791E-1,-2.92094E+2,
5.08254E+0,2.81791E-1,-2.96094E+2,
5.08754E+0,3.61791E-1,-2.92094E+2,
5.09255E+0,2.81791E-1,-2.88094E+2,
5.09755E+0,2.81791E-1,-2.88094E+2,
5.10255E+0,4.41791E-1,-2.88094E+2,
5.10755E+0,3.61791E-1,-2.88094E+2,
5.11256E+0,5.21791E-1,-2.88094E+2,
5.11756E+0,3.61791E-1,-2.88094E+2,
5.12256E+0,4.41791E-1,-2.80094E+2,
5.12756E+0,4.41791E-1,-2.84094E+2,
5.13257E+0,3.61791E-1,-2.80094E+2,
5.13757E+0,4.41791E-1,-2.80094E+2,
5.14257E+0,3.61791E-1,-2.76094E+2,
5.14757E+0,4.41791E-1,-2.72094E+2,
5.15258E+0,3.61791E-1,-2.76094E+2,
5.15758E+0,3.61791E-1,-2.76094E+2,
5.16258E+0,4.41791E-1,-2.76094E+2,
5.16758E+0,5.21791E-1,-2.72094E+2,
5.17259E+0,3.61791E-1,-2.80094E+2,
5.17759E+0,3.61791E-1,-2.84094E+2,
5.18259E+0,3.61791E-1,-2.80094E+2,
5.18759E+0,3.61791E-1,-2.76094E+2,
5.1926E+0,3.61791E-1,-2.80094E+2,
5.1976E+0,4.41791E-1,-2.76094E+2,
5.2026E+0,4.41791E-1,-2.72094E+2,
5.2076E+0,5.21791E-1,-2.72094E+2,
5.21261E+0,4.41791E-1,-2.68094E+2,
5.21761E+0,4.41791E-1,-2.68094E+2,
5.22261E+0,3.61791E-1,-2.68094E+2,
5.22761E+0,2.81791E-1,-2.68094E+2,
5.23262E+0,4.41791E-1,-2.68094E+2,
5.23762E+0,4.41791E-1,-2.64094E+2,
5.24262E+0,4.41791E-1,-2.64094E+2,
5.24762E+0,5.21791E-1,-2.60094E+2,
5.25263E+0,5.21791E-1,-2.64094E+2,
5.25763E+0,4.41791E-1,-2.60094E+2,
5.26263E+0,3.61791E-1,-2.64094E+2,
5.26763E+0,3.61791E-1,-2.68094E+2,
5.27264E+0,5.21791E-1,-2.72094E+2,
5.27764E+0,5.21791E-1,-2.68094E+2,
5.28264E+0,3.61791E-1,-2.76094E+2,
5.28764E+0,5.21791E-1,-2.68094E+2,
5.29265E+0,4.41791E-1,-2.64094E+2,
5.29765E+0,4.41791E-1,-2.72094E+2,
5.30265E+0,3.61791E-1,-2.68094E+2,
5.30765E+0,5.21791E-1,-2.60094E+2,
5.31266E+0,5.21791E-1,-2.64094E+2,
5.31766E+0,4.41791E-1,-2.64094E+2,
5.32266E+0,4.41791E-1,-2.64094E+2,
5.32766E+0,4.41791E-1,-2.60094E+2,
5.33267E+0,5.21791E-1,-2.60094E+2,
5.33767E+0,5.21791E-1,-2.60094E+2,
5.34267E+0,4.41791E-1,-2.60094E+2,
5.34767E+0,4.41791E-1,-2.56094E+2,
5.35268E+0,4.41791E-1,-2.64094E+2,
5.35768E+0,5.21791E-1,-2.60094E+2,
5.36268E+0,3.61791E-1,-2.64094E+2,
5.36768E+0,4.41791E-1,-2.64094E+2,
5.37269E+0,4.41791E-1,-2.56094E+2,
5.37769E+0,2.81791E-1,-2.60094E+2,
5.38269E+0,3.61791E-1,-2.60094E+2,
5.38769E+0,4.41791E-1,-2.56094E+2,
5.3927E+0,6.01791E-1,-2.56094E+2,
5.3977E+0,5.21791E-1,-2.52094E+2,
5.4027E+0,5.21791E-1,-2.52094E+2,
5.4077E+0,3.61791E-1,-2.60094E+2,
5.41271E+0,5.21791E-1,-2.56094E+2,
5.41771E+0,4.41791E-1,-2.52094E+2,
5.42271E+0,5.21791E-1,-2.44094E+2,
5.42771E+0,5.21791E-1,-2.48094E+2,
5.43272E+0,6.01791E-1,-2.44094E+2,
5.43772E+0,6.01791E-1,-2.48094E+2,
5.44272E+0,5.21791E-1,-2.48094E+2,
5.44772E+0,6.01791E-1,-2.48094E+2,
5.45273E+0,4.41791E-1,-2.48094E+2,
5.45773E+0,5.21791E-1,-2.48094E+2,
5.46273E+0,4.41791E-1,-2.52094E+2,
5.46773E+0,4.41791E-1,-2.48094E+2,
5.47274E+0,4.41791E-1,-2.52094E+2,
5.47774E+0,6.01791E-1,-2.48094E+2,
5.48274E+0,6.01791E-1,-2.40094E+2,
5.48774E+0,5.21791E-1,-2.36094E+2,
5.49275E+0,5.21791E-1,-2.48094E+2,
5.49775E+0,5.21791E-1,-2.44094E+2,
5.50275E+0,6.01791E-1,-2.36094E+2,
5.50775E+0,5.21791E-1,-2.44094E+2,
5.51276E+0,4.41791E-1,-2.44094E+2,
5.51776E+0,4.41791E-1,-2.44094E+2,
5.52276E+0,4.41791E-1,-2.44094E+2,
5.52776E+0,5.21791E-1,-2.40094E+2,
5.53277E+0,4.41791E-1,-2.48094E+2,
5.53777E+0,4.41791E-1,-2.48094E+2,
5.54277E+0,4.41791E-1,-2.52094E+2,
5.54777E+0,5.21791E-1,-2.48094E+2,
5.55278E+0,5.21791E-1,-2.40094E+2,
5.55778E+0,5.21791E-1,-2.40094E+2,
5.56278E+0,5.21791E-1,-2.40094E+2,
5.56778E+0,6.01791E-1,-2.40094E+2,
5.57279E+0,5.21791E-1,-2.44094E+2,
5.57779E+0,5.21791E-1,-2.44094E+2,
5.58279E+0,4.41791E-1,-2.48094E+2,
5.58779E+0,6.01791E-1,-2.44094E+2,
5.5928E+0,6.01791E-1,-2.48094E+2,
5.5978E+0,5.21791E-1,-2.44094E+2,
5.6028E+0,5.21791E-1,-2.44094E+2,
5.6078E+0,5.21791E-1,-2.40094E+2,
5.61281E+0,5.21791E-1,-2.44094E+2,
5.61781E+0,5.21791E-1,-2.40094E+2,
5.62281E+0,5.21791E-1,-2.36094E+2,
5.62781E+0,5.21791E-1,-2.36094E+2,
5.63282E+0,6.01791E-1,-2.24094E+2,
5.63782E+0,5.21791E-1,-2.32094E+2,
5.64282E+0,5.21791E-1,-2.36094E+2,
5.64782E+0,6.81791E-1,-2.36094E+2,
5.65283E+0,4.41791E-1,-2.40094E+2,
5.65783E+0,4.41791E-1,-2.40094E+2,
5.66283E+0,5.21791E-1,-2.44094E+2,
5.66783E+0,6.01791E-1,-2.40094E+2,
5.67284E+0,6.81791E-1,-2.40094E+2,
5.67784E+0,6.01791E-1,-2.36094E+2,
5.68284E+0,6.01791E-1,-2.32094E+2,
5.68784E+0,4.41791E-1,-2.32094E+2,
5.69285E+0,5.21791E-1,-2.36094E+2,
5.69785E+0,6.01791E-1,-2.36094E+2,
5.70285E+0,5.21791E-1,-2.36094E+2,
5.70785E+0,6.81791E-1,-2.36094E+2,
5.71286E+0,6.01791E-1,-2.32094E+2,
5.71786E+0,6.81791E-1,-2.28094E+2,
5.72286E+0,5.21791E-1,-2.32094E+2,
5.72786E+0,6.01791E-1,-2.28094E+2,
5.73287E+0,6.81791E-1,-2.32094E+2,
5.73787E+0,5.21791E-1,-2.36094E+2,
5.74287E+0,5.21791E-1,-2.36094E+2,
5.74787E+0,6.01791E-1,-2.36094E+2,
5.75288E+0,6.01791E-1,-2.32094E+2,
5.75788E+0,5.21791E-1,-2.24094E+2,
5.76288E+0,6.81791E-1,-2.28094E+2,
5.76788E+0,6.01791E-1,-2.24094E+2,
5.77289E+0,5.21791E-1,-2.24094E+2,
5.77789E+0,6.01791E-1,-2.16094E+2,
5.78289E+0,5.21791E-1,-2.20094E+2,
5.78789E+0,6.01791E-1,-2.24094E+2,
5.7929E+0,6.01791E-1,-2.16094E+2,
5.7979E+0,6.01791E-1,-2.20094E+2,
5.8029E+0,6.81791E-1,-2.20094E+2,
5.8079E+0,6.81791E-1,-2.24094E+2,
5.81291E+0,5.21791E-1,-2.28094E+2,
5.81791E+0,5.21791E-1,-2.24094E+2,
5.82291E+0,6.01791E-1,-2.24094E+2,
5.82791E+0,6.01791E-1,-2.28094E+2,
5.83292E+0,6.81791E-1,-2.24094E+2,
5.83792E+0,7.61791E-1,-2.28094E+2,
5.84292E+0,6.01791E-1,-2.32094E+2,
5.84792E+0,6.81791E-1,-2.32094E+2,
5.85293E+0,6.01791E-1,-2.32094E+2,
5.85793E+0,6.01791E-1,-2.28094E+2,
5.86293E+0,6.01791E-1,-2.28094E+2,
5.86793E+0,5.21791E-1,-2.20094E+2,
5.87294E+0,6.81791E-1,-2.16094E+2,
5.87794E+0,6.81791E-1,-2.20094E+2,
5.88294E+0,6.81791E-1,-2.28094E+2,
5.88794E+0,6.01791E-1,-2.28094E+2,
5.89295E+0,6.01791E-1,-2.20094E+2,
5.89795E+0,6.81791E-1,-2.20094E+2,
5.90295E+0,6.01791E-1,-2.24094E+2,
5.90795E+0,6.01791E-1,-2.28094E+2,
5.91296E+0,6.81791E-1,-2.20094E+2,
5.91796E+0,6.01791E-1,-2.20094E+2,
5.92296E+0,5.21791E-1,-2.24094E+2,
5.92796E+0,6.81791E-1,-2.20094E+2,
5.93297E+0,6.81791E-1,-2.20094E+2,
5.93797E+0,6.81791E-1,-2.20094E+2,
5.94297E+0,6.81791E-1,-2.20094E+2,
5.94797E+0,6.81791E-1,-2.16094E+2,
5.95298E+0,6.01791E-1,-2.16094E+2,
5.95798E+0,6.01791E-1,-2.20094E+2,
5.96298E+0,6.01791E-1,-2.20094E+2,
5.96798E+0,6.81791E-1,-2.20094E+2,
5.97299E+0,6.01791E-1,-2.20094E+2,
5.97799E+0,6.81791E-1,-2.12094E+2,
5.98299E+0,6.81791E-1,-2.12094E+2,
5.98799E+0,6.81791E-1,-2.08094E+2,
5.993E+0,6.81791E-1,-2.08094E+2,
5.998E+0,6.01791E-1,-2.12094E+2,
6.003E+0,6.81791E-1,-2.08094E+2,
6.008E+0,7.61791E-1,-2.20094E+2,
6.01301E+0,6.81791E-1,-2.20094E+2,
6.01801E+0,6.01791E-1,-2.20094E+2,
6.02301E+0,6.81791E-1,-2.16094E+2,
6.02801E+0,6.81791E-1,-2.12094E+2,
6.03302E+0,6.81791E-1,-2.08094E+2,
6.03802E+0,6.81791E-1,-2.08094E+2,
6.04302E+0,7.61791E-1,-2.12094E+2,
6.04802E+0,6.81791E-1,-2.04094E+2,
6.05303E+0,6.81791E-1,-2.04094E+2,
6.05803E+0,6.81791E-1,-2.04094E+2,
6.06303E+0,6.81791E-1,-2.08094E+2,
6.06803E+0,6.81791E-1,-2.08094E+2,
6.07304E+0,6.01791E-1,-2.12094E+2,
6.07804E+0,6.81791E-1,-2.08094E+2,
6.08304E+0,7.61791E-1,-2.08094E+2,
6.08804E+0,7.61791E-1,-2.08094E+2,
6.09305E+0,7.61791E-1,-2.04094E+2,
6.09805E+0,6.01791E-1,-2.20094E+2,
6.10305E+0,7.61791E-1,-2.16094E+2,
6.10805E+0,6.01791E-1,-2.20094E+2,
6.11306E+0,7.61791E-1,-2.12094E+2,
6.11806E+0,7.61791E-1,-2.12094E+2,
6.12306E+0,6.81791E-1,-2.20094E+2,
6.12806E+0,6.81791E-1,-2.16094E+2,
6.13307E+0,6.81791E-1,-2.24094E+2,
6.13807E+0,6.01791E-1,-2.20094E+2,
6.14307E+0,6.81791E-1,-2.16094E+2,
6.14807E+0,6.81791E-1,-2.16094E+2,
6.15308E+0,7.61791E-1,-2.20094E+2,
6.15808E+0,6.01791E-1,-2.24094E+2,
6.16308E+0,6.01791E-1,-2.12094E+2,
6.16808E+0,7.61791E-1,-2.08094E+2,
6.17309E+0,6.81791E-1,-2.08094E+2,
6.17809E+0,7.61791E-1,-2.04094E+2,
6.18309E+0,7.61791E-1,-2.04094E+2,
6.18809E+0,7.61791E-1,-2.04094E+2,
6.1931E+0,6.81791E-1,-2.04094E+2,
6.1981E+0,6.81791E-1,-2.12094E+2,
6.2031E+0,7.61791E-1,-2.04094E+2,
6.2081E+0,8.41791E-1,-2.04094E+2,
6.21311E+0,7.61791E-1,-2.16094E+2,
6.21811E+0,6.81791E-1,-2.08094E+2,
6.22311E+0,6.81791E-1,-2.04094E+2,
6.22811E+0,7.61791E-1,-2.08094E+2,
6.23312E+0,7.61791E-1,-2.04094E+2,
6.23812E+0,6.81791E-1,-2.04094E+2,
6.24312E+0,7.61791E-1,-2.04094E+2,
6.24812E+0,6.81791E-1,-2.04094E+2,
6.25313E+0,7.61791E-1,-2.04094E+2,
6.25813E+0,6.81791E-1,-2.04094E+2,
6.26313E+0,6.81791E-1,-2.08094E+2,
6.26813E+0,7.61791E-1,-2.08094E+2,
6.27314E+0,7.61791E-1,-2.04094E+2,
6.27814E+0,8.41791E-1,-2.04094E+2,
6.28314E+0,8.41791E-1,-2.04094E+2,
6.28814E+0,6.81791E-1,-2.12094E+2,
6.29315E+0,7.61791E-1,-2.00094E+2,
6.29815E+0,7.61791E-1,-2.04094E+2,
6.30315E+0,7.61791E-1,-2.04094E+2,
6.30815E+0,8.41791E-1,-2.00094E+2,
6.31316E+0,8.41791E-1,-2.00094E+2,
6.31816E+0,9.21791E-1,-1.96094E+2,
6.32316E+0,6.81791E-1,-2.04094E+2,
6.32816E+0,7.61791E-1,-2.04094E+2,
6.33317E+0,7.61791E-1,-2.00094E+2,
6.33817E+0,7.61791E-1,-2.04094E+2,
6.34317E+0,7.61791E-1,-2.08094E+2,
6.34817E+0,7.61791E-1,-2.04094E+2,
6.35318E+0,7.61791E-1,-2.04094E+2,
6.35818E+0,6.81791E-1,-2.00094E+2,
6.36318E+0,8.41791E-1,-2.04094E+2,
6.36818E+0,6.81791E-1,-2.04094E+2,
6.37319E+0,9.21791E-1,-2.00094E+2,
6.37819E+0,7.61791E-1,-2.00094E+2,
6.38319E+0,9.21791E-1,-2.00094E+2,
6.38819E+0,8.41791E-1,-2.00094E+2,
6.3932E+0,7.61791E-1,-2.00094E+2,
6.3982E+0,8.41791E-1,-2.04094E+2,
6.4032E+0,8.41791E-1,-2.04094E+2,
6.4082E+0,7.61791E-1,-2.00094E+2,
6.41321E+0,8.41791E-1,-1.92094E+2,
6.41821E+0,7.61791E-1,-2.00094E+2,
6.42321E+0,8.41791E-1,-2.04094E+2,
6.42821E+0,8.41791E-1,-2.04094E+2,
6.43322E+0,8.41791E-1,-2.00094E+2,
6.43822E+0,8.41791E-1,-2.00094E+2,
6.44322E+0,7.61791E-1,-2.04094E+2,
6.44822E+0,7.61791E-1,-2.00094E+2,
6.45323E+0,8.41791E-1,-1.96094E+2,
6.45823E+0,8.41791E-1,-1.96094E+2,
6.46323E+0,8.41791E-1,-1.96094E+2,
6.46823E+0,8.41791E-1,-1.92094E+2,
6.47324E+0,8.41791E-1,-1.88094E+2,
6.47824E+0,7.61791E-1,-1.96094E+2,
6.48324E+0,8.41791E-1,-1.92094E+2,
6.48824E+0,8.41791E-1,-1.92094E+2,
6.49325E+0,7.61791E-1,-1.92094E+2,
6.49825E+0,7.61791E-1,-1.92094E+2,
6.50325E+0,9.21791E-1,-2.00094E+2,
6.50825E+0,8.41791E-1,-2.00094E+2,
6.51326E+0,9.21791E-1,-2.00094E+2,
6.51826E+0,9.21791E-1,-1.96094E+2,
6.52326E+0,7.61791E-1,-2.00094E+2,
6.52826E+0,9.21791E-1,-1.96094E+2,
6.53327E+0,9.21791E-1,-1.92094E+2,
6.53827E+0,9.21791E-1,-1.92094E+2,
6.54327E+0,8.41791E-1,-2.00094E+2,
6.54827E+0,8.41791E-1,-2.00094E+2,
6.55328E+0,8.41791E-1,-1.96094E+2,
6.55828E+0,9.21791E-1,-2.00094E+2,
6.56328E+0,8.41791E-1,-1.96094E+2,
6.56828E+0,9.21791E-1,-1.92094E+2,
6.57329E+0,8.41791E-1,-1.92094E+2,
6.57829E+0,8.41791E-1,-1.92094E+2,
6.58329E+0,9.21791E-1,-1.88094E+2,
6.58829E+0,7.61791E-1,-1.88094E+2,
6.5933E+0,9.21791E-1,-1.96094E+2,
6.5983E+0,9.21791E-1,-1.92094E+2,
6.6033E+0,7.61791E-1,-1.96094E+2,
6.6083E+0,8.41791E-1,-1.92094E+2,
6.61331E+0,8.41791E-1,-1.92094E+2,
6.61831E+0,8.41791E-1,-1.92094E+2,
6.62331E+0,9.21791E-1,-1.96094E+2,
6.62831E+0,9.21791E-1,-1.88094E+2,
6.63332E+0,8.41791E-1,-1.84094E+2,
6.63832E+0,8.41791E-1,-1.88094E+2,
6.64332E+0,9.21791E-1,-1.84094E+2,
6.64832E+0,8.41791E-1,-1.88094E+2,
6.65333E+0,7.61791E-1,-1.92094E+2,
6.65833E+0,8.41791E-1,-1.92094E+2,
6.66333E+0,8.41791E-1,-1.96094E+2,
6.66833E+0,1.00179E+0,-1.88094E+2,
6.67334E+0,8.41791E-1,-1.92094E+2,
6.67834E+0,9.21791E-1,-1.88094E+2,
6.68334E+0,8.41791E-1,-1.92094E+2,
6.68834E+0,8.41791E-1,-1.92094E+2,
6.69335E+0,8.41791E-1,-1.96094E+2,
6.69835E+0,9.21791E-1,-1.92094E+2,
6.70335E+0,8.41791E-1,-1.96094E+2,
6.70835E+0,9.21791E-1,-1.92094E+2,
6.71336E+0,7.61791E-1,-1.92094E+2,
6.71836E+0,7.61791E-1,-1.92094E+2,
6.72336E+0,9.21791E-1,-1.92094E+2,
6.72836E+0,8.41791E-1,-1.92094E+2,
6.73337E+0,1.00179E+0,-1.96094E+2,
6.73837E+0,1.00179E+0,-1.96094E+2,
6.74337E+0,1.00179E+0,-1.92094E+2,
6.74837E+0,8.41791E-1,-1.92094E+2,
6.75338E+0,9.21791E-1,-1.92094E+2,
6.75838E+0,8.41791E-1,-1.92094E+2,
6.76338E+0,8.41791E-1,-1.92094E+2,
6.76838E+0,8.41791E-1,-1.92094E+2,
6.77339E+0,1.00179E+0,-1.84094E+2,
6.77839E+0,1.00179E+0,-1.88094E+2,
6.78339E+0,8.41791E-1,-1.88094E+2,
6.78839E+0,8.41791E-1,-1.88094E+2,
6.7934E+0,1.00179E+0,-1.92094E+2,
6.7984E+0,9.21791E-1,-1.92094E+2,
6.8034E+0,9.21791E-1,-1.96094E+2,
6.8084E+0,9.21791E-1,-1.88094E+2,
6.81341E+0,1.00179E+0,-1.84094E+2,
6.81841E+0,9.21791E-1,-1.88094E+2,
6.82341E+0,8.41791E-1,-1.92094E+2,
6.82841E+0,1.00179E+0,-1.88094E+2,
6.83342E+0,1.00179E+0,-1.88094E+2,
6.83842E+0,9.21791E-1,-1.92094E+2,
6.84342E+0,1.00179E+0,-1.88094E+2,
6.84842E+0,1.00179E+0,-1.88094E+2,
6.85343E+0,9.21791E-1,-1.96094E+2,
6.85843E+0,1.00179E+0,-1.92094E+2,
6.86343E+0,9.21791E-1,-1.96094E+2,
6.86843E+0,1.00179E+0,-1.92094E+2,
6.87344E+0,1.00179E+0,-1.92094E+2,
6.87844E+0,9.21791E-1,-1.92094E+2,
6.88344E+0,1.08179E+0,-1.92094E+2,
6.88844E+0,1.00179E+0,-1.88094E+2,
6.89345E+0,1.00179E+0,-1.92094E+2,
6.89845E+0,1.00179E+0,-1.96094E+2,
6.90345E+0,9.21791E-1,-1.92094E+2,
6.90845E+0,1.00179E+0,-1.92094E+2,
6.91346E+0,9.21791E-1,-1.92094E+2,
6.91846E+0,1.00179E+0,-1.92094E+2,
6.92346E+0,1.00179E+0,-1.92094E+2,
6.92846E+0,1.08179E+0,-1.84094E+2,
6.93347E+0,1.00179E+0,-1.88094E+2,
6.93847E+0,9.21791E-1,-1.88094E+2,
6.94347E+0,9.21791E-1,-1.96094E+2,
6.94847E+0,1.00179E+0,-1.92094E+2,
6.95348E+0,9.21791E-1,-1.92094E+2,
6.95848E+0,9.21791E-1,-1.92094E+2,
6.96348E+0,9.21791E-1,-1.88094E+2,
6.96848E+0,1.00179E+0,-1.88094E+2,
6.97349E+0,9.21791E-1,-1.96094E+2,
6.97849E+0,1.08179E+0,-1.88094E+2,
6.98349E+0,1.00179E+0,-1.88094E+2,
6.98849E+0,9.21791E-1,-1.92094E+2,
6.9935E+0,9.21791E-1,-1.88094E+2,
6.9985E+0,1.00179E+0,-1.84094E+2,
7.0035E+0,1.00179E+0,-1.88094E+2,
7.0085E+0,9.21791E-1,-1.88094E+2,
7.01351E+0,1.00179E+0,-1.96094E+2,
7.01851E+0,9.21791E-1,-1.92094E+2,
7.02351E+0,1.00179E+0,-1.88094E+2,
7.02851E+0,9.21791E-1,-1.88094E+2,
7.03352E+0,1.00179E+0,-1.84094E+2,
7.03852E+0,1.00179E+0,-1.92094E+2,
7.04352E+0,1.08179E+0,-1.88094E+2,
7.04852E+0,1.00179E+0,-1.92094E+2,
7.05353E+0,9.21791E-1,-1.92094E+2,
7.05853E+0,1.08179E+0,-1.92094E+2,
7.06353E+0,1.08179E+0,-2.00094E+2,
7.06853E+0,1.00179E+0,-1.96094E+2,
7.07354E+0,1.08179E+0,-1.96094E+2,
7.07854E+0,1.08179E+0,-1.96094E+2,
7.08354E+0,1.00179E+0,-1.88094E+2,
7.08854E+0,1.08179E+0,-1.84094E+2,
7.09355E+0,1.08179E+0,-1.88094E+2,
7.09855E+0,1.08179E+0,-1.88094E+2,
7.10355E+0,1.00179E+0,-1.84094E+2,
7.10855E+0,1.08179E+0,-1.80094E+2,
7.11356E+0,1.00179E+0,-1.84094E+2,
7.11856E+0,1.16179E+0,-1.84094E+2,
7.12356E+0,1.08179E+0,-1.88094E+2,
7.12856E+0,1.08179E+0,-1.84094E+2,
7.13357E+0,1.08179E+0,-1.84094E+2,
7.13857E+0,1.00179E+0,-1.84094E+2,
7.14357E+0,1.08179E+0,-1.76094E+2,
7.14857E+0,1.08179E+0,-1.76094E+2,
7.15358E+0,1.00179E+0,-1.80094E+2,
7.15858E+0,1.16179E+0,-1.80094E+2,
7.16358E+0,1.16179E+0,-1.84094E+2,
7.16858E+0,1.16179E+0,-1.84094E+2,
7.17359E+0,1.08179E+0,-1.76094E+2,
7.17859E+0,1.00179E+0,-1.84094E+2,
7.18359E+0,1.08179E+0,-1.84094E+2,
7.18859E+0,1.08179E+0,-1.84094E+2,
7.1936E+0,1.00179E+0,-1.84094E+2,
7.1986E+0,1.00179E+0,-1.84094E+2,
7.2036E+0,1.00179E+0,-1.84094E+2,
7.2086E+0,1.16179E+0,-1.88094E+2,
7.21361E+0,1.08179E+0,-1.88094E+2,
7.21861E+0,1.08179E+0,-1.88094E+2,
7.22361E+0,1.08179E+0,-1.88094E+2,
7.22861E+0,1.08179E+0,-1.88094E+2,
7.23362E+0,1.08179E+0,-1.88094E+2,
7.23862E+0,1.08179E+0,-1.88094E+2,
7.24362E+0,1.16179E+0,-1.84094E+2,
7.24862E+0,1.00179E+0,-1.88094E+2,
7.25363E+0,1.08179E+0,-1.84094E+2,
7.25863E+0,1.00179E+0,-1.92094E+2,
7.26363E+0,1.08179E+0,-1.92094E+2,
7.26863E+0,1.16179E+0,-1.84094E+2,
7.27364E+0,1.08179E+0,-1.84094E+2,
7.27864E+0,1.16179E+0,-1.84094E+2,
7.28364E+0,1.16179E+0,-1.84094E+2,
7.28864E+0,1.16179E+0,-1.80094E+2,
7.29365E+0,1.16179E+0,-1.84094E+2,
7.29865E+0,1.00179E+0,-1.88094E+2,
7.30365E+0,1.16179E+0,-1.88094E+2,
7.30865E+0,1.16179E+0,-1.88094E+2,
7.31366E+0,1.08179E+0,-1.92094E+2,
7.31866E+0,1.16179E+0,-1.92094E+2,
7.32366E+0,1.16179E+0,-1.88094E+2,
7.32866E+0,1.00179E+0,-1.92094E+2,
7.33367E+0,1.16179E+0,-1.88094E+2,
7.33867E+0,1.16179E+0,-1.88094E+2,
7.34367E+0,1.00179E+0,-1.92094E+2,
7.34867E+0,1.16179E+0,-1.88094E+2,
7.35368E+0,1.08179E+0,-1.96094E+2,
7.35868E+0,1.16179E+0,-2.00094E+2,
7.36368E+0,1.08179E+0,-1.92094E+2,
7.36868E+0,1.16179E+0,-1.92094E+2,
7.37369E+0,1.08179E+0,-1.92094E+2,
7.37869E+0,1.08179E+0,-1.88094E+2,
7.38369E+0,1.16179E+0,-1.84094E+2,
7.38869E+0,1.24179E+0,-1.84094E+2,
7.3937E+0,1.08179E+0,-1.84094E+2,
7.3987E+0,1.00179E+0,-1.84094E+2,
7.4037E+0,1.08179E+0,-1.88094E+2,
7.4087E+0,1.08179E+0,-1.88094E+2,
7.41371E+0,1.08179E+0,-1.84094E+2,
7.41871E+0,1.16179E+0,-1.80094E+2,
7.42371E+0,1.16179E+0,-1.80094E+2,
7.42871E+0,1.24179E+0,-1.84094E+2,
7.43372E+0,1.08179E+0,-1.88094E+2,
7.43872E+0,1.16179E+0,-1.88094E+2,
7.44372E+0,1.16179E+0,-1.84094E+2,
7.44872E+0,1.24179E+0,-1.76094E+2,
7.45373E+0,1.24179E+0,-1.76094E+2,
7.45873E+0,1.16179E+0,-1.88094E+2,
7.46373E+0,1.16179E+0,-1.88094E+2,
7.46873E+0,1.16179E+0,-1.84094E+2,
7.47374E+0,1.16179E+0,-1.80094E+2,
7.47874E+0,1.08179E+0,-1.88094E+2,
7.48374E+0,1.24179E+0,-1.88094E+2,
7.48874E+0,1.16179E+0,-1.88094E+2,
7.49375E+0,1.16179E+0,-1.88094E+2,
7.49875E+0,1.24179E+0,-1.96094E+2,
7.50375E+0,1.16179E+0,-1.92094E+2,
7.50875E+0,1.24179E+0,-1.88094E+2,
7.51376E+0,1.16179E+0,-1.92094E+2,
7.51876E+0,1.24179E+0,-1.84094E+2,
7.52376E+0,1.08179E+0,-1.80094E+2,
7.52876E+0,1.16179E+0,-1.84094E+2,
7.53377E+0,1.16179E+0,-1.84094E+2,
7.53877E+0,1.16179E+0,-1.88094E+2,
7.54377E+0,1.16179E+0,-1.92094E+2,
7.54877E+0,1.08179E+0,-1.88094E+2,
7.55378E+0,1.24179E+0,-1.84094E+2,
7.55878E+0,1.16179E+0,-1.88094E+2,
7.56378E+0,1.24179E+0,-1.92094E+2,
7.56878E+0,1.24179E+0,-1.88094E+2,
7.57379E+0,1.24179E+0,-1.88094E+2,
7.57879E+0,1.24179E+0,-1.84094E+2,
7.58379E+0,1.24179E+0,-1.88094E+2,
7.58879E+0,1.16179E+0,-1.92094E+2,
7.5938E+0,1.16179E+0,-1.88094E+2,
7.5988E+0,1.32179E+0,-1.92094E+2,
7.6038E+0,1.24179E+0,-1.92094E+2,
7.6088E+0,1.24179E+0,-1.80094E+2,
7.61381E+0,1.16179E+0,-1.84094E+2,
7.61881E+0,1.16179E+0,-1.84094E+2,
7.62381E+0,1.16179E+0,-1.84094E+2,
7.62881E+0,1.24179E+0,-1.80094E+2,
7.63382E+0,1.24179E+0,-1.84094E+2,
7.63882E+0,1.24179E+0,-1.88094E+2,
7.64382E+0,1.24179E+0,-1.92094E+2,
7.64882E+0,1.16179E+0,-1.92094E+2,
7.65383E+0,1.24179E+0,-1.92094E+2,
7.65883E+0,1.32179E+0,-1.88094E+2,
7.66383E+0,1.16179E+0,-1.92094E+2,
7.66883E+0,1.16179E+0,-1.92094E+2,
7.67384E+0,1.24179E+0,-1.96094E+2,
7.67884E+0,1.24179E+0,-1.88094E+2,
7.68384E+0,1.24179E+0,-1.88094E+2,
7.68884E+0,1.32179E+0,-1.88094E+2,
7.69385E+0,1.16179E+0,-1.88094E+2,
7.69885E+0,1.16179E+0,-1.80094E+2,
7.70385E+0,1.24179E+0,-1.88094E+2,
7.70885E+0,1.32179E+0,-1.80094E+2,
7.71386E+0,1.24179E+0,-1.88094E+2,
7.71886E+0,1.32179E+0,-1.80094E+2,
7.72386E+0,1.32179E+0,-1.84094E+2,
7.72886E+0,1.24179E+0,-1.92094E+2,
7.73387E+0,1.24179E+0,-1.88094E+2,
7.73887E+0,1.16179E+0,-1.96094E+2,
7.74387E+0,1.32179E+0,-1.88094E+2,
7.74887E+0,1.24179E+0,-1.92094E+2,
7.75388E+0,1.16179E+0,-1.88094E+2,
7.75888E+0,1.32179E+0,-1.92094E+2,
7.76388E+0,1.24179E+0,-1.92094E+2,
7.76888E+0,1.16179E+0,-2.00094E+2,
7.77389E+0,1.24179E+0,-1.96094E+2,
7.77889E+0,1.32179E+0,-1.92094E+2,
7.78389E+0,1.32179E+0,-1.96094E+2,
7.78889E+0,1.32179E+0,-1.96094E+2,
7.7939E+0,1.24179E+0,-1.96094E+2,
7.7989E+0,1.32179E+0,-1.92094E+2,
7.8039E+0,1.24179E+0,-1.96094E+2,
7.8089E+0,1.24179E+0,-1.96094E+2,
7.81391E+0,1.32179E+0,-1.92094E+2,
7.81891E+0,1.16179E+0,-1.92094E+2,
7.82391E+0,1.32179E+0,-1.92094E+2,
7.82891E+0,1.40179E+0,-1.88094E+2,
7.83392E+0,1.32179E+0,-1.84094E+2,
7.83892E+0,1.32179E+0,-1.88094E+2,
7.84392E+0,1.32179E+0,-1.92094E+2,
7.84892E+0,1.16179E+0,-1.88094E+2,
7.85393E+0,1.24179E+0,-1.88094E+2,
7.85893E+0,1.32179E+0,-1.84094E+2,
7.86393E+0,1.24179E+0,-1.84094E+2,
7.86893E+0,1.24179E+0,-1.88094E+2,
7.87394E+0,1.32179E+0,-1.84094E+2,
7.87894E+0,1.32179E+0,-1.80094E+2,
7.88394E+0,1.16179E+0,-1.84094E+2,
7.88894E+0,1.32179E+0,-1.88094E+2,
7.89395E+0,1.40179E+0,-1.92094E+2,
7.89895E+0,1.24179E+0,-1.88094E+2,
7.90395E+0,1.24179E+0,-2.00094E+2,
7.90895E+0,1.40179E+0,-1.92094E+2,
7.91396E+0,1.40179E+0,-1.88094E+2,
7.91896E+0,1.40179E+0,-1.88094E+2,
7.92396E+0,1.24179E+0,-1.92094E+2,
7.92896E+0,1.24179E+0,-1.92094E+2,
7.93397E+0,1.32179E+0,-1.92094E+2,
7.93897E+0,1.32179E+0,-1.92094E+2,
7.94397E+0,1.40179E+0,-1.92094E+2,
7.94897E+0,1.32179E+0,-2.00094E+2,
7.95398E+0,1.48179E+0,-1.92094E+2,
7.95898E+0,1.40179E+0,-1.96094E+2,
7.96398E+0,1.24179E+0,-1.96094E+2,
7.96898E+0,1.24179E+0,-1.96094E+2,
7.97399E+0,1.32179E+0,-1.92094E+2,
7.97899E+0,1.32179E+0,-1.88094E+2,
7.98399E+0,1.40179E+0,-1.92094E+2,
7.98899E+0,1.40179E+0,-1.84094E+2,
7.994E+0,1.24179E+0,-1.84094E+2,
7.999E+0,1.40179E+0,-1.80094E+2,
8.004E+0,1.40179E+0,-1.84094E+2,
8.009E+0,1.32179E+0,-1.84094E+2,
8.01401E+0,1.40179E+0,-1.76094E+2,
8.01901E+0,1.32179E+0,-1.76094E+2,
8.02401E+0,1.24179E+0,-1.76094E+2,
8.02901E+0,1.48179E+0,-1.80094E+2,
8.03402E+0,1.40179E+0,-1.84094E+2,
8.03902E+0,1.24179E+0,-1.92094E+2,
8.04402E+0,1.40179E+0,-1.84094E+2,
8.04902E+0,1.32179E+0,-1.80094E+2,
8.05403E+0,1.32179E+0,-1.84094E+2,
8.05903E+0,1.32179E+0,-1.76094E+2,
8.06403E+0,1.40179E+0,-1.84094E+2,
8.06903E+0,1.40179E+0,-1.84094E+2,
8.07404E+0,1.48179E+0,-1.84094E+2,
8.07904E+0,1.40179E+0,-1.80094E+2,
8.08404E+0,1.40179E+0,-1.84094E+2,
8.08904E+0,1.40179E+0,-1.84094E+2,
8.09405E+0,1.40179E+0,-1.88094E+2,
8.09905E+0,1.40179E+0,-1.72094E+2,
8.10405E+0,1.32179E+0,-1.84094E+2,
8.10905E+0,1.40179E+0,-1.84094E+2,
8.11406E+0,1.32179E+0,-1.92094E+2,
8.11906E+0,1.32179E+0,-1.88094E+2,
8.12406E+0,1.40179E+0,-1.92094E+2,
8.12906E+0,1.32179E+0,-1.88094E+2,
8.13407E+0,1.32179E+0,-1.88094E+2,
8.13907E+0,1.48179E+0,-1.92094E+2,
8.14407E+0,1.40179E+0,-1.88094E+2,
8.14907E+0,1.40179E+0,-1.88094E+2,
8.15408E+0,1.40179E+0,-1.88094E+2,
8.15908E+0,1.48179E+0,-1.88094E+2,
8.16408E+0,1.40179E+0,-1.88094E+2,
8.16908E+0,1.40179E+0,-1.84094E+2,
8.17409E+0,1.32179E+0,-1.88094E+2,
8.17909E+0,1.40179E+0,-1.84094E+2,
8.18409E+0,1.32179E+0,-1.92094E+2,
8.18909E+0,1.40179E+0,-1.84094E+2,
8.1941E+0,1.32179E+0,-1.88094E+2,
8.1991E+0,1.48179E+0,-1.76094E+2,
8.2041E+0,1.40179E+0,-1.76094E+2,
8.2091E+0,1.32179E+0,-1.76094E+2,
8.21411E+0,1.40179E+0,-1.76094E+2,
8.21911E+0,1.48179E+0,-1.84094E+2,
8.22411E+0,1.48179E+0,-1.84094E+2,
8.22911E+0,1.32179E+0,-1.88094E+2,
8.23412E+0,1.40179E+0,-1.88094E+2,
8.23912E+0,1.40179E+0,-1.84094E+2,
8.24412E+0,1.40179E+0,-1.84094E+2,
8.24912E+0,1.40179E+0,-1.88094E+2,
8.25413E+0,1.48179E+0,-1.84094E+2,
8.25913E+0,1.56179E+0,-1.92094E+2,
8.26413E+0,1.48179E+0,-1.92094E+2,
8.26913E+0,1.48179E+0,-1.84094E+2,
8.27414E+0,1.48179E+0,-1.84094E+2,
8.27914E+0,1.32179E+0,-1.88094E+2,
8.28414E+0,1.48179E+0,-1.92094E+2,
8.28914E+0,1.48179E+0,-1.88094E+2,
8.29415E+0,1.40179E+0,-1.88094E+2,
8.29915E+0,1.48179E+0,-1.92094E+2,
8.30415E+0,1.40179E+0,-2.00094E+2,
8.30915E+0,1.48179E+0,-1.96094E+2,
8.31416E+0,1.48179E+0,-1.96094E+2,
8.31916E+0,1.40179E+0,-1.92094E+2,
8.32416E+0,1.48179E+0,-1.92094E+2,
8.32916E+0,1.56179E+0,-1.92094E+2,
8.33417E+0,1.48179E+0,-1.88094E+2,
8.33917E+0,1.40179E+0,-1.88094E+2,
8.34417E+0,1.32179E+0,-1.84094E+2,
8.34917E+0,1.56179E+0,-1.88094E+2,
8.35418E+0,1.48179E+0,-1.84094E+2,
8.35918E+0,1.40179E+0,-1.88094E+2,
8.36418E+0,1.32179E+0,-1.88094E+2,
8.36918E+0,1.40179E+0,-1.84094E+2,
8.37419E+0,1.32179E+0,-1.88094E+2,
8.37919E+0,1.40179E+0,-1.88094E+2,
8.38419E+0,1.48179E+0,-1.88094E+2,
8.38919E+0,1.48179E+0,-1.84094E+2,
8.3942E+0,1.48179E+0,-1.84094E+2,
8.3992E+0,1.48179E+0,-1.84094E+2,
8.4042E+0,1.48179E+0,-1.88094E+2,
8.4092E+0,1.48179E+0,-1.88094E+2,
8.41421E+0,1.40179E+0,-1.88094E+2,
8.41921E+0,1.56179E+0,-1.88094E+2,
8.42421E+0,1.48179E+0,-1.84094E+2,
8.42921E+0,1.48179E+0,-1.80094E+2,
8.43422E+0,1.48179E+0,-1.84094E+2,
8.43922E+0,1.40179E+0,-1.80094E+2,
8.44422E+0,1.56179E+0,-1.80094E+2,
8.44922E+0,1.56179E+0,-1.84094E+2,
8.45423E+0,1.48179E+0,-1.84094E+2,
8.45923E+0,1.48179E+0,-1.84094E+2,
8.46423E+0,1.56179E+0,-1.80094E+2,
8.46923E+0,1.48179E+0,-1.76094E+2,
8.47424E+0,1.40179E+0,-1.84094E+2,
8.47924E+0,1.48179E+0,-1.84094E+2,
8.48424E+0,1.48179E+0,-1.88094E+2,
8.48924E+0,1.40179E+0,-1.84094E+2,
8.49425E+0,1.40179E+0,-1.92094E+2,
8.49925E+0,1.56179E+0,-1.88094E+2,
8.50425E+0,1.56179E+0,-1.88094E+2,
8.50925E+0,1.48179E+0,-1.96094E+2,
8.51426E+0,1.40179E+0,-1.88094E+2,
8.51926E+0,1.48179E+0,-1.92094E+2,
8.52426E+0,1.40179E+0,-2.00094E+2,
8.52926E+0,1.40179E+0,-1.96094E+2,
8.53427E+0,1.48179E+0,-1.96094E+2,
8.53927E+0,1.48179E+0,-1.88094E+2,
8.54427E+0,1.40179E+0,-1.96094E+2,
8.54927E+0,1.56179E+0,-2.00094E+2,
8.55428E+0,1.56179E+0,-1.96094E+2,
8.55928E+0,1.56179E+0,-1.92094E+2,
8.56428E+0,1.56179E+0,-1.88094E+2,
8.56928E+0,1.48179E+0,-1.92094E+2,
8.57429E+0,1.48179E+0,-1.88094E+2,
8.57929E+0,1.48179E+0,-1.92094E+2,
8.58429E+0,1.48179E+0,-1.96094E+2,
8.58929E+0,1.48179E+0,-1.88094E+2,
8.5943E+0,1.48179E+0,-1.92094E+2,
8.5993E+0,1.56179E+0,-1.88094E+2,
8.6043E+0,1.48179E+0,-1.92094E+2,
8.6093E+0,1.56179E+0,-1.88094E+2,
8.61431E+0,1.56179E+0,-1.84094E+2,
8.61931E+0,1.56179E+0,-1.88094E+2,
8.62431E+0,1.56179E+0,-1.88094E+2,
8.62931E+0,1.56179E+0,-1.88094E+2,
8.63432E+0,1.56179E+0,-1.84094E+2,
8.63932E+0,1.48179E+0,-1.84094E+2,
8.64432E+0,1.56179E+0,-1.88094E+2,
8.64932E+0,1.56179E+0,-1.92094E+2,
8.65433E+0,1.48179E+0,-1.96094E+2,
8.65933E+0,1.64179E+0,-1.92094E+2,
8.66433E+0,1.56179E+0,-1.92094E+2,
8.66933E+0,1.56179E+0,-1.88094E+2,
8.67434E+0,1.64179E+0,-1.88094E+2,
8.67934E+0,1.64179E+0,-1.88094E+2,
8.68434E+0,1.48179E+0,-1.88094E+2,
8.68934E+0,1.56179E+0,-1.88094E+2,
8.69435E+0,1.40179E+0,-1.88094E+2,
8.69935E+0,1.48179E+0,-1.88094E+2,
8.70435E+0,1.56179E+0,-1.88094E+2,
8.70935E+0,1.56179E+0,-1.84094E+2,
8.71436E+0,1.64179E+0,-1.88094E+2,
8.71936E+0,1.56179E+0,-1.96094E+2,
8.72436E+0,1.64179E+0,-1.88094E+2,
8.72936E+0,1.64179E+0,-1.88094E+2,
8.73437E+0,1.48179E+0,-1.84094E+2,
8.73937E+0,1.64179E+0,-1.88094E+2,
8.74437E+0,1.56179E+0,-1.88094E+2,
8.74937E+0,1.64179E+0,-1.88094E+2,
8.75438E+0,1.64179E+0,-1.88094E+2,
8.75938E+0,1.48179E+0,-1.96094E+2,
8.76438E+0,1.48179E+0,-1.92094E+2,
8.76938E+0,1.48179E+0,-1.92094E+2,
8.77439E+0,1.64179E+0,-1.88094E+2,
8.77939E+0,1.64179E+0,-1.84094E+2,
8.78439E+0,1.48179E+0,-1.80094E+2,
8.78939E+0,1.64179E+0,-1.80094E+2,
8.7944E+0,1.48179E+0,-1.80094E+2,
8.7994E+0,1.56179E+0,-1.80094E+2,
8.8044E+0,1.56179E+0,-1.84094E+2,
8.8094E+0,1.56179E+0,-1.84094E+2,
8.81441E+0,1.64179E+0,-1.80094E+2,
8.81941E+0,1.56179E+0,-1.88094E+2,
8.82441E+0,1.72179E+0,-1.88094E+2,
8.82941E+0,1.56179E+0,-1.88094E+2,
8.83442E+0,1.56179E+0,-1.88094E+2,
8.83942E+0,1.48179E+0,-1.92094E+2,
8.84442E+0,1.56179E+0,-1.88094E+2,
8.84942E+0,1.48179E+0,-1.92094E+2,
8.85443E+0,1.64179E+0,-1.88094E+2,
8.85943E+0,1.56179E+0,-1.96094E+2,
8.86443E+0,1.56179E+0,-1.88094E+2,
8.86943E+0,1.64179E+0,-1.92094E+2,
8.87444E+0,1.56179E+0,-1.88094E+2,
8.87944E+0,1.48179E+0,-1.88094E+2,
8.88444E+0,1.64179E+0,-1.88094E+2,
8.88944E+0,1.72179E+0,-1.84094E+2,
8.89445E+0,1.56179E+0,-1.88094E+2,
8.89945E+0,1.48179E+0,-1.88094E+2,
8.90445E+0,1.64179E+0,-1.92094E+2,
8.90945E+0,1.64179E+0,-1.92094E+2,
8.91446E+0,1.64179E+0,-1.88094E+2,
8.91946E+0,1.56179E+0,-1.88094E+2,
8.92446E+0,1.56179E+0,-1.88094E+2,
8.92946E+0,1.64179E+0,-1.88094E+2,
8.93447E+0,1.64179E+0,-1.80094E+2,
8.93947E+0,1.56179E+0,-1.88094E+2,
8.94447E+0,1.56179E+0,-1.84094E+2,
8.94947E+0,1.64179E+0,-1.84094E+2,
8.95448E+0,1.64179E+0,-1.92094E+2,
8.95948E+0,1.64179E+0,-1.88094E+2,
8.96448E+0,1.64179E+0,-1.80094E+2,
8.96948E+0,1.64179E+0,-1.84094E+2,
8.97449E+0,1.56179E+0,-1.88094E+2,
8.97949E+0,1.56179E+0,-1.84094E+2,
8.98449E+0,1.56179E+0,-1.88094E+2,
8.98949E+0,1.64179E+0,-1.88094E+2,
8.9945E+0,1.64179E+0,-1.80094E+2,
8.9995E+0,1.64179E+0,-1.92094E+2,
9.0045E+0,1.72179E+0,-1.96094E+2,
9.0095E+0,1.56179E+0,-1.92094E+2,
9.01451E+0,1.56179E+0,-1.96094E+2,
9.01951E+0,1.56179E+0,-1.92094E+2,
9.02451E+0,1.56179E+0,-1.92094E+2,
9.02951E+0,1.72179E+0,-1.88094E+2,
9.03452E+0,1.64179E+0,-1.88094E+2,
9.03952E+0,1.64179E+0,-1.84094E+2,
9.04452E+0,1.64179E+0,-1.80094E+2,
9.04952E+0,1.64179E+0,-1.76094E+2,
9.05453E+0,1.56179E+0,-1.80094E+2,
9.05953E+0,1.72179E+0,-1.80094E+2,
9.06453E+0,1.64179E+0,-1.84094E+2,
9.06953E+0,1.64179E+0,-1.88094E+2,
9.07454E+0,1.64179E+0,-1.88094E+2,
9.07954E+0,1.72179E+0,-1.84094E+2,
9.08454E+0,1.64179E+0,-1.84094E+2,
9.08954E+0,1.72179E+0,-1.88094E+2,
9.09455E+0,1.56179E+0,-1.84094E+2,
9.09955E+0,1.72179E+0,-1.88094E+2,
9.10455E+0,1.72179E+0,-1.84094E+2,
9.10955E+0,1.72179E+0,-1.88094E+2,
9.11456E+0,1.56179E+0,-1.88094E+2,
9.11956E+0,1.64179E+0,-1.84094E+2,
9.12456E+0,1.64179E+0,-1.88094E+2,
9.12956E+0,1.64179E+0,-1.88094E+2,
9.13457E+0,1.64179E+0,-1.92094E+2,
9.13957E+0,1.80179E+0,-1.88094E+2,
9.14457E+0,1.64179E+0,-1.92094E+2,
9.14957E+0,1.64179E+0,-2.00094E+2,
9.15458E+0,1.64179E+0,-1.92094E+2,
9.15958E+0,1.80179E+0,-1.88094E+2,
9.16458E+0,1.56179E+0,-1.92094E+2,
9.16958E+0,1.72179E+0,-1.92094E+2,
9.17459E+0,1.64179E+0,-1.84094E+2,
9.17959E+0,1.72179E+0,-1.92094E+2,
9.18459E+0,1.72179E+0,-1.88094E+2,
9.18959E+0,1.72179E+0,-1.88094E+2,
9.1946E+0,1.64179E+0,-1.80094E+2,
9.1996E+0,1.80179E+0,-1.84094E+2,
9.2046E+0,1.72179E+0,-1.84094E+2,
9.2096E+0,1.64179E+0,-1.84094E+2,
9.21461E+0,1.72179E+0,-1.88094E+2,
9.21961E+0,1.72179E+0,-1.84094E+2,
9.22461E+0,1.72179E+0,-1.80094E+2,
9.22961E+0,1.80179E+0,-1.80094E+2,
9.23462E+0,1.72179E+0,-1.88094E+2,
9.23962E+0,1.72179E+0,-1.80094E+2,
9.24462E+0,1.80179E+0,-1.88094E+2,
9.24962E+0,1.80179E+0,-1.84094E+2,
9.25463E+0,1.72179E+0,-1.92094E+2,
9.25963E+0,1.64179E+0,-1.92094E+2,
9.26463E+0,1.72179E+0,-1.92094E+2,
9.26963E+0,1.64179E+0,-1.92094E+2,
9.27464E+0,1.64179E+0,-1.96094E+2,
9.27964E+0,1.80179E+0,-1.92094E+2,
9.28464E+0,1.72179E+0,-1.92094E+2,
9.28964E+0,1.80179E+0,-2.00094E+2,
9.29465E+0,1.72179E+0,-1.92094E+2,
9.29965E+0,1.64179E+0,-1.96094E+2,
9.30465E+0,1.64179E+0,-2.00094E+2,
9.30965E+0,1.72179E+0,-2.00094E+2,
9.31466E+0,1.80179E+0,-1.92094E+2,
9.31966E+0,1.72179E+0,-1.88094E+2,
9.32466E+0,1.72179E+0,-1.84094E+2,
9.32966E+0,1.80179E+0,-1.88094E+2,
9.33467E+0,1.72179E+0,-1.96094E+2,
9.33967E+0,1.80179E+0,-1.92094E+2,
9.34467E+0,1.72179E+0,-1.88094E+2,
9.34967E+0,1.88179E+0,-1.88094E+2,
9.35468E+0,1.80179E+0,-1.88094E+2,
9.35968E+0,1.80179E+0,-1.96094E+2,
9.36468E+0,1.64179E+0,-1.88094E+2,
9.36968E+0,1.72179E+0,-1.84094E+2,
9.37469E+0,1.80179E+0,-1.88094E+2,
9.37969E+0,1.88179E+0,-1.84094E+2,
9.38469E+0,1.88179E+0,-1.84094E+2,
9.38969E+0,1.72179E+0,-1.92094E+2,
9.3947E+0,1.80179E+0,-1.88094E+2,
9.3997E+0,1.80179E+0,-1.88094E+2,
9.4047E+0,1.72179E+0,-1.80094E+2,
9.4097E+0,1.88179E+0,-1.84094E+2,
9.41471E+0,1.72179E+0,-1.84094E+2,
9.41971E+0,1.72179E+0,-1.80094E+2,
9.42471E+0,1.72179E+0,-1.80094E+2,
9.42971E+0,1.72179E+0,-1.80094E+2,
9.43472E+0,1.72179E+0,-1.84094E+2,
9.43972E+0,1.80179E+0,-1.84094E+2,
9.44472E+0,1.72179E+0,-1.80094E+2,
9.44972E+0,1.80179E+0,-1.88094E+2,
9.45473E+0,1.72179E+0,-1.92094E+2,
9.45973E+0,1.80179E+0,-1.84094E+2,
9.46473E+0,1.72179E+0,-1.84094E+2,
9.46973E+0,1.88179E+0,-1.80094E+2,
9.47474E+0,1.80179E+0,-1.80094E+2,
9.47974E+0,1.80179E+0,-1.80094E+2,
9.48474E+0,1.72179E+0,-1.84094E+2,
9.48974E+0,1.88179E+0,-1.84094E+2,
9.49475E+0,1.80179E+0,-1.88094E+2,
9.49975E+0,1.72179E+0,-1.88094E+2,
9.50475E+0,1.72179E+0,-1.92094E+2,
9.50975E+0,1.80179E+0,-1.88094E+2,
9.51476E+0,1.80179E+0,-1.88094E+2,
9.51976E+0,1.80179E+0,-1.88094E+2,
9.52476E+0,1.72179E+0,-1.92094E+2,
9.52976E+0,1.80179E+0,-1.92094E+2,
9.53477E+0,1.80179E+0,-1.88094E+2,
9.53977E+0,1.72179E+0,-1.84094E+2,
9.54477E+0,1.80179E+0,-1.92094E+2,
9.54977E+0,1.88179E+0,-1.84094E+2,
9.55478E+0,1.80179E+0,-1.88094E+2,
9.55978E+0,1.80179E+0,-1.88094E+2,
9.56478E+0,1.88179E+0,-1.88094E+2,
9.56978E+0,1.88179E+0,-1.88094E+2,
9.57479E+0,1.80179E+0,-1.96094E+2,
9.57979E+0,1.88179E+0,-1.84094E+2,
9.58479E+0,1.80179E+0,-1.96094E+2,
9.58979E+0,1.72179E+0,-1.92094E+2,
9.5948E+0,1.88179E+0,-1.88094E+2,
9.5998E+0,1.88179E+0,-1.88094E+2,
9.6048E+0,1.80179E+0,-1.92094E+2,
9.6098E+0,1.80179E+0,-1.92094E+2,
9.61481E+0,1.88179E+0,-1.96094E+2,
9.61981E+0,1.72179E+0,-1.92094E+2,
9.62481E+0,1.80179E+0,-1.88094E+2,
9.62981E+0,1.80179E+0,-1.88094E+2,
9.63482E+0,1.88179E+0,-1.88094E+2,
9.63982E+0,1.88179E+0,-1.88094E+2,
9.64482E+0,1.72179E+0,-1.88094E+2,
9.64982E+0,1.88179E+0,-1.88094E+2,
9.65483E+0,1.88179E+0,-1.92094E+2,
9.65983E+0,1.72179E+0,-1.84094E+2,
9.66483E+0,1.96179E+0,-1.76094E+2,
9.66983E+0,1.80179E+0,-1.80094E+2,
9.67484E+0,1.80179E+0,-1.84094E+2,
9.67984E+0,1.88179E+0,-1.84094E+2,
9.68484E+0,1.88179E+0,-1.84094E+2,
9.68984E+0,1.88179E+0,-1.88094E+2,
9.69485E+0,1.72179E+0,-1.88094E+2,
9.69985E+0,1.88179E+0,-1.92094E+2,
9.70485E+0,1.88179E+0,-1.92094E+2,
9.70985E+0,1.96179E+0,-1.92094E+2,
9.71486E+0,1.88179E+0,-1.88094E+2,
9.71986E+0,1.96179E+0,-1.96094E+2,
9.72486E+0,1.88179E+0,-1.92094E+2,
9.72986E+0,1.88179E+0,-1.96094E+2,
9.73487E+0,1.88179E+0,-1.96094E+2,
9.73987E+0,1.88179E+0,-1.92094E+2,
9.74487E+0,1.88179E+0,-1.92094E+2,
9.74987E+0,1.88179E+0,-1.96094E+2,
9.75488E+0,1.88179E+0,-1.92094E+2,
9.75988E+0,1.88179E+0,-1.92094E+2,
9.76488E+0,1.96179E+0,-1.92094E+2,
9.76988E+0,1.88179E+0,-1.92094E+2,
9.77489E+0,1.72179E+0,-1.88094E+2,
9.77989E+0,1.88179E+0,-1.88094E+2,
9.78489E+0,1.80179E+0,-1.80094E+2,
9.78989E+0,1.96179E+0,-1.76094E+2,
9.7949E+0,1.88179E+0,-1.76094E+2,
9.7999E+0,2.04179E+0,-1.84094E+2,
9.8049E+0,1.96179E+0,-1.92094E+2,
9.8099E+0,1.88179E+0,-1.88094E+2,
9.81491E+0,1.88179E+0,-1.88094E+2,
9.81991E+0,1.88179E+0,-1.88094E+2,
9.82491E+0,1.96179E+0,-1.88094E+2,
9.82991E+0,1.88179E+0,-1.80094E+2,
9.83492E+0,1.88179E+0,-1.76094E+2,
9.83992E+0,1.96179E+0,-1.84094E+2,
9.84492E+0,1.88179E+0,-1.92094E+2,
9.84992E+0,1.96179E+0,-1.88094E+2,
9.85493E+0,1.88179E+0,-1.92094E+2,
9.85993E+0,1.88179E+0,-1.88094E+2,
9.86493E+0,1.96179E+0,-1.88094E+2,
9.86993E+0,1.96179E+0,-1.88094E+2,
9.87494E+0,1.88179E+0,-1.88094E+2,
9.87994E+0,1.80179E+0,-1.88094E+2,
9.88494E+0,1.96179E+0,-1.96094E+2,
9.88994E+0,1.80179E+0,-1.96094E+2,
9.89495E+0,1.96179E+0,-1.92094E+2,
9.89995E+0,1.88179E+0,-1.96094E+2,
9.90495E+0,1.96179E+0,-2.04094E+2,
9.90995E+0,1.96179E+0,-1.96094E+2,
9.91496E+0,1.88179E+0,-1.96094E+2,
9.91996E+0,1.80179E+0,-1.92094E+2,
9.92496E+0,2.04179E+0,-1.88094E+2,
9.92996E+0,1.88179E+0,-1.96094E+2,
9.93497E+0,1.88179E+0,-1.96094E+2,
9.93997E+0,1.96179E+0,-1.96094E+2,
9.94497E+0,2.04179E+0,-1.92094E+2,
9.94997E+0,1.96179E+0,-1.96094E+2,
9.95498E+0,1.96179E+0,-1.92094E+2,
9.95998E+0,1.96179E+0,-1.96094E+2,
9.96498E+0,1.88179E+0,-2.00094E+2,
9.96998E+0,1.88179E+0,-2.00094E+2,
9.97499E+0,1.88179E+0,-1.96094E+2,
9.97999E+0,1.96179E+0,-1.96094E+2,
9.98499E+0,1.80179E+0,-1.96094E+2,
9.98999E+0,2.04179E+0,-1.88094E+2,
9.995E+0,1.88179E+0,-1.92094E+2,
1.0E+1,1.96179E+0,-1.84094E+2,
