Time in s	CH I in Volt	CH II in Volt	
0.E+0	9.44E-01	5.00E-01
1.E-3	9.44E-01	4.80E-01
2.E-3	9.36E-01	4.80E-01
3.E-3	9.36E-01	5.00E-01
4.E-3	9.36E-01	5.00E-01
5.E-3	9.36E-01	5.00E-01
6.E-3	9.44E-01	5.00E-01
7.E-3	9.36E-01	5.00E-01
8.E-3	9.36E-01	5.00E-01
9.E-3	9.36E-01	4.80E-01
1.E-2	9.36E-01	5.00E-01
1.1E-2	9.36E-01	5.00E-01
1.2E-2	9.44E-01	5.00E-01
1.3E-2	9.44E-01	4.80E-01
1.4E-2	9.44E-01	4.80E-01
1.5E-2	9.44E-01	4.80E-01
1.6E-2	9.44E-01	4.80E-01
1.7E-2	9.36E-01	4.80E-01
1.8E-2	9.44E-01	4.80E-01
1.9E-2	9.52E-01	4.80E-01
2.E-2	9.52E-01	4.80E-01
2.1E-2	9.44E-01	5.00E-01
2.2E-2	9.52E-01	4.80E-01
2.3E-2	9.52E-01	4.80E-01
2.4E-2	9.52E-01	5.00E-01
2.5E-2	9.44E-01	4.80E-01
2.6E-2	9.60E-01	4.80E-01
2.7E-2	9.52E-01	4.80E-01
2.8E-2	9.44E-01	4.80E-01
2.9E-2	9.52E-01	4.80E-01
3.E-2	9.44E-01	4.80E-01
3.1E-2	9.52E-01	4.80E-01
3.2E-2	9.36E-01	4.60E-01
3.3E-2	9.28E-01	4.60E-01
3.4E-2	9.28E-01	4.80E-01
3.5E-2	9.28E-01	4.60E-01
3.6E-2	9.20E-01	4.60E-01
3.7E-2	9.20E-01	4.80E-01
3.8E-2	9.12E-01	4.60E-01
3.9E-2	9.12E-01	4.80E-01
4.E-2	9.20E-01	4.80E-01
4.1E-2	9.20E-01	4.80E-01
4.2E-2	9.28E-01	4.60E-01
4.3E-2	9.20E-01	4.60E-01
4.4E-2	9.36E-01	4.60E-01
4.5E-2	9.28E-01	4.60E-01
4.6E-2	9.28E-01	4.60E-01
4.7E-2	9.20E-01	4.60E-01
4.8E-2	9.20E-01	4.60E-01
4.9E-2	9.28E-01	4.60E-01
5.E-2	9.28E-01	4.60E-01
5.1E-2	9.28E-01	4.60E-01
5.2E-2	9.36E-01	4.60E-01
5.3E-2	9.36E-01	4.80E-01
5.4E-2	9.44E-01	4.60E-01
5.5E-2	9.44E-01	4.60E-01
5.6E-2	9.52E-01	4.60E-01
5.7E-2	9.44E-01	4.60E-01
5.8E-2	9.52E-01	4.60E-01
5.9E-2	9.44E-01	4.40E-01
6.E-2	9.36E-01	4.60E-01
6.1E-2	9.28E-01	4.60E-01
6.2E-2	9.20E-01	4.60E-01
6.3E-2	9.28E-01	4.60E-01
6.4E-2	9.28E-01	4.60E-01
6.5E-2	9.36E-01	4.60E-01
6.6E-2	9.44E-01	4.60E-01
6.7E-2	9.36E-01	4.60E-01
6.8E-2	9.44E-01	4.40E-01
6.9E-2	9.36E-01	4.40E-01
7.E-2	9.28E-01	4.60E-01
7.1E-2	9.28E-01	4.60E-01
7.2E-2	9.28E-01	4.40E-01
7.3E-2	9.28E-01	4.60E-01
7.4E-2	9.36E-01	4.60E-01
7.5E-2	9.28E-01	4.60E-01
7.6E-2	9.36E-01	4.40E-01
7.7E-2	9.36E-01	4.60E-01
7.8E-2	9.36E-01	4.60E-01
7.9E-2	9.36E-01	4.40E-01
8.E-2	9.44E-01	4.60E-01
8.1E-2	9.36E-01	4.40E-01
8.2E-2	9.36E-01	4.40E-01
8.3E-2	9.36E-01	4.60E-01
8.4E-2	9.44E-01	4.40E-01
8.5E-2	9.44E-01	4.40E-01
8.6E-2	9.44E-01	4.40E-01
8.7E-2	9.44E-01	4.60E-01
8.8E-2	9.44E-01	4.40E-01
8.9E-2	9.52E-01	4.20E-01
9.E-2	9.60E-01	4.60E-01
9.1E-2	9.52E-01	4.40E-01
9.2E-2	9.44E-01	4.40E-01
9.3E-2	9.44E-01	4.40E-01
9.4E-2	9.52E-01	4.40E-01
9.5E-2	9.44E-01	4.40E-01
9.6E-2	9.44E-01	4.40E-01
9.7E-2	9.36E-01	4.40E-01
9.8E-2	9.44E-01	4.40E-01
9.9E-2	9.36E-01	4.40E-01
1.E-1	9.36E-01	4.40E-01
1.01E-1	9.28E-01	4.40E-01
1.02E-1	9.36E-01	4.20E-01
1.03E-1	9.28E-01	4.20E-01
1.04E-1	9.28E-01	4.20E-01
1.05E-1	9.28E-01	4.40E-01
1.06E-1	9.20E-01	4.20E-01
1.07E-1	9.28E-01	4.40E-01
1.08E-1	9.28E-01	4.20E-01
1.09E-1	9.28E-01	4.20E-01
1.1E-1	9.28E-01	4.20E-01
1.11E-1	9.28E-01	4.40E-01
1.12E-1	9.12E-01	4.20E-01
1.13E-1	9.20E-01	4.20E-01
1.14E-1	9.28E-01	4.20E-01
1.15E-1	9.28E-01	4.20E-01
1.16E-1	9.28E-01	4.20E-01
1.17E-1	9.20E-01	4.20E-01
1.18E-1	9.28E-01	4.20E-01
1.19E-1	9.28E-01	4.20E-01
1.2E-1	9.44E-01	4.20E-01
1.21E-1	9.44E-01	4.20E-01
1.22E-1	9.44E-01	4.20E-01
1.23E-1	9.36E-01	4.20E-01
1.24E-1	9.28E-01	4.20E-01
1.25E-1	9.28E-01	4.40E-01
1.26E-1	9.36E-01	4.20E-01
1.27E-1	9.28E-01	4.20E-01
1.28E-1	9.28E-01	4.20E-01
1.29E-1	9.28E-01	4.40E-01
1.3E-1	9.36E-01	4.20E-01
1.31E-1	9.36E-01	4.20E-01
1.32E-1	9.36E-01	4.20E-01
1.33E-1	9.28E-01	4.20E-01
1.34E-1	9.20E-01	4.20E-01
1.35E-1	9.20E-01	4.00E-01
1.36E-1	9.44E-01	4.20E-01
1.37E-1	9.44E-01	4.20E-01
1.38E-1	9.36E-01	4.00E-01
1.39E-1	9.28E-01	4.20E-01
1.4E-1	9.28E-01	4.20E-01
1.41E-1	9.20E-01	4.00E-01
1.42E-1	9.20E-01	4.00E-01
1.43E-1	9.20E-01	4.20E-01
1.44E-1	9.12E-01	4.20E-01
1.45E-1	9.20E-01	4.00E-01
1.46E-1	9.20E-01	4.00E-01
1.47E-1	9.28E-01	4.20E-01
1.48E-1	9.28E-01	4.20E-01
1.49E-1	9.20E-01	4.00E-01
1.5E-1	9.20E-01	4.00E-01
1.51E-1	9.28E-01	4.20E-01
1.52E-1	9.20E-01	4.00E-01
1.53E-1	9.28E-01	4.00E-01
1.54E-1	9.28E-01	4.00E-01
1.55E-1	9.28E-01	4.00E-01
1.56E-1	9.28E-01	4.00E-01
1.57E-1	9.28E-01	4.20E-01
1.58E-1	9.44E-01	4.00E-01
1.59E-1	9.36E-01	4.20E-01
1.6E-1	9.44E-01	4.00E-01
1.61E-1	9.44E-01	4.00E-01
1.62E-1	9.36E-01	4.00E-01
1.63E-1	9.28E-01	4.00E-01
1.64E-1	9.28E-01	4.00E-01
1.65E-1	9.20E-01	4.00E-01
1.66E-1	9.28E-01	4.00E-01
1.67E-1	9.36E-01	4.00E-01
1.68E-1	9.36E-01	4.00E-01
1.69E-1	9.36E-01	3.80E-01
1.7E-1	9.36E-01	4.00E-01
1.71E-1	9.28E-01	3.80E-01
1.72E-1	9.20E-01	3.80E-01
1.73E-1	9.12E-01	4.00E-01
1.74E-1	9.20E-01	3.80E-01
1.75E-1	9.20E-01	3.80E-01
1.76E-1	9.12E-01	3.80E-01
1.77E-1	9.12E-01	3.80E-01
1.78E-1	9.20E-01	3.80E-01
1.79E-1	9.20E-01	4.00E-01
1.8E-1	9.20E-01	4.00E-01
1.81E-1	9.28E-01	3.80E-01
1.82E-1	9.20E-01	3.80E-01
1.83E-1	9.20E-01	3.80E-01
1.84E-1	9.28E-01	3.80E-01
1.85E-1	9.28E-01	3.80E-01
1.86E-1	9.28E-01	3.80E-01
1.87E-1	9.20E-01	3.80E-01
1.88E-1	9.20E-01	3.80E-01
1.89E-1	9.12E-01	4.00E-01
1.9E-1	9.20E-01	3.80E-01
1.91E-1	9.12E-01	3.80E-01
1.92E-1	9.12E-01	3.80E-01
1.93E-1	9.12E-01	3.80E-01
1.94E-1	9.20E-01	3.60E-01
1.95E-1	9.12E-01	3.80E-01
1.96E-1	9.12E-01	3.60E-01
1.97E-1	9.28E-01	3.60E-01
1.98E-1	9.28E-01	3.80E-01
1.99E-1	9.20E-01	3.80E-01
2.E-1	9.28E-01	3.60E-01
2.01E-1	9.20E-01	3.80E-01
2.02E-1	9.20E-01	3.60E-01
2.03E-1	9.12E-01	3.60E-01
2.04E-1	9.20E-01	3.80E-01
2.05E-1	9.12E-01	3.60E-01
2.06E-1	9.04E-01	3.60E-01
2.07E-1	9.04E-01	3.80E-01
2.08E-1	8.96E-01	3.60E-01
2.09E-1	8.96E-01	3.80E-01
2.1E-1	8.96E-01	3.80E-01
2.11E-1	8.96E-01	3.60E-01
2.12E-1	9.04E-01	3.60E-01
2.13E-1	9.04E-01	3.60E-01
2.14E-1	9.04E-01	3.60E-01
2.15E-1	9.12E-01	3.60E-01
2.16E-1	9.12E-01	3.60E-01
2.17E-1	9.12E-01	3.60E-01
2.18E-1	9.12E-01	3.60E-01
2.19E-1	9.04E-01	3.60E-01
2.2E-1	9.04E-01	3.60E-01
2.21E-1	9.04E-01	3.60E-01
2.22E-1	9.12E-01	3.60E-01
2.23E-1	9.12E-01	3.60E-01
2.24E-1	9.04E-01	3.60E-01
2.25E-1	9.04E-01	3.60E-01
2.26E-1	9.12E-01	3.60E-01
2.27E-1	9.12E-01	3.40E-01
2.28E-1	9.04E-01	3.60E-01
2.29E-1	9.12E-01	3.60E-01
2.3E-1	9.20E-01	3.40E-01
2.31E-1	9.20E-01	3.40E-01
2.32E-1	9.20E-01	3.40E-01
2.33E-1	9.12E-01	3.40E-01
2.34E-1	9.12E-01	3.40E-01
2.35E-1	9.20E-01	3.60E-01
2.36E-1	9.20E-01	3.40E-01
2.37E-1	9.12E-01	3.60E-01
2.38E-1	9.12E-01	3.40E-01
2.39E-1	9.12E-01	3.40E-01
2.4E-1	9.12E-01	3.60E-01
2.41E-1	9.04E-01	3.40E-01
2.42E-1	9.12E-01	3.40E-01
2.43E-1	9.20E-01	3.40E-01
2.44E-1	9.12E-01	3.40E-01
2.45E-1	9.20E-01	3.40E-01
2.46E-1	9.28E-01	3.40E-01
2.47E-1	9.20E-01	3.40E-01
2.48E-1	9.20E-01	3.40E-01
2.49E-1	9.28E-01	3.40E-01
2.5E-1	9.20E-01	3.40E-01
2.51E-1	9.20E-01	3.40E-01
2.52E-1	9.12E-01	3.20E-01
2.53E-1	9.12E-01	3.40E-01
2.54E-1	9.12E-01	3.40E-01
2.55E-1	9.20E-01	3.40E-01
2.56E-1	9.20E-01	3.60E-01
2.57E-1	9.12E-01	3.40E-01
2.58E-1	9.20E-01	3.40E-01
2.59E-1	9.04E-01	3.40E-01
2.6E-1	9.04E-01	3.40E-01
2.61E-1	8.96E-01	3.40E-01
2.62E-1	8.96E-01	3.20E-01
2.63E-1	8.96E-01	3.40E-01
2.64E-1	8.88E-01	3.40E-01
2.65E-1	8.88E-01	3.40E-01
2.66E-1	9.04E-01	3.40E-01
2.67E-1	8.96E-01	3.40E-01
2.68E-1	8.96E-01	3.40E-01
2.69E-1	9.04E-01	3.20E-01
2.7E-1	9.04E-01	3.20E-01
2.71E-1	9.12E-01	3.40E-01
2.72E-1	9.28E-01	3.40E-01
2.73E-1	9.28E-01	3.40E-01
2.74E-1	9.20E-01	3.40E-01
2.75E-1	9.28E-01	3.40E-01
2.76E-1	9.28E-01	3.20E-01
2.77E-1	9.36E-01	3.20E-01
2.78E-1	9.36E-01	3.40E-01
2.79E-1	9.36E-01	3.40E-01
2.8E-1	9.36E-01	3.20E-01
2.81E-1	9.52E-01	3.20E-01
2.82E-1	9.44E-01	3.40E-01
2.83E-1	9.44E-01	3.20E-01
2.84E-1	9.44E-01	3.20E-01
2.85E-1	9.60E-01	3.20E-01
2.86E-1	9.68E-01	3.20E-01
2.87E-1	9.68E-01	3.20E-01
2.88E-1	9.76E-01	3.20E-01
2.89E-1	9.68E-01	3.20E-01
2.9E-1	9.76E-01	3.00E-01
2.91E-1	9.76E-01	3.20E-01
2.92E-1	9.68E-01	3.20E-01
2.93E-1	9.76E-01	3.20E-01
2.94E-1	9.60E-01	3.20E-01
2.95E-1	9.60E-01	3.20E-01
2.96E-1	9.60E-01	3.20E-01
2.97E-1	9.52E-01	3.20E-01
2.98E-1	9.44E-01	3.20E-01
2.99E-1	9.44E-01	3.20E-01
3.E-1	9.36E-01	3.20E-01
3.01E-1	9.44E-01	3.00E-01
3.02E-1	9.52E-01	3.20E-01
3.03E-1	9.60E-01	3.20E-01
3.04E-1	9.52E-01	3.20E-01
3.05E-1	9.44E-01	3.20E-01
3.06E-1	9.44E-01	3.00E-01
3.07E-1	9.36E-01	3.00E-01
3.08E-1	9.36E-01	3.00E-01
3.09E-1	9.36E-01	3.00E-01
3.1E-1	9.44E-01	3.20E-01
3.11E-1	9.36E-01	3.00E-01
3.12E-1	9.28E-01	3.00E-01
3.13E-1	9.36E-01	3.00E-01
3.14E-1	9.28E-01	3.20E-01
3.15E-1	9.28E-01	3.00E-01
3.16E-1	9.20E-01	3.00E-01
3.17E-1	9.20E-01	3.00E-01
3.18E-1	9.28E-01	3.00E-01
3.19E-1	9.20E-01	3.20E-01
3.2E-1	9.28E-01	3.20E-01
3.21E-1	9.28E-01	3.20E-01
3.22E-1	9.28E-01	2.80E-01
3.23E-1	9.20E-01	3.00E-01
3.24E-1	9.12E-01	3.00E-01
3.25E-1	9.20E-01	3.00E-01
3.26E-1	9.20E-01	3.00E-01
3.27E-1	9.20E-01	3.00E-01
3.28E-1	9.20E-01	3.00E-01
3.29E-1	9.20E-01	2.80E-01
3.3E-1	9.20E-01	2.80E-01
3.31E-1	9.20E-01	3.00E-01
3.32E-1	9.20E-01	3.00E-01
3.33E-1	9.12E-01	3.00E-01
3.34E-1	9.04E-01	3.00E-01
3.35E-1	8.96E-01	3.00E-01
3.36E-1	8.96E-01	2.80E-01
3.37E-1	8.96E-01	2.80E-01
3.38E-1	8.96E-01	3.00E-01
3.39E-1	8.96E-01	3.00E-01
3.4E-1	9.12E-01	2.80E-01
3.41E-1	8.96E-01	3.00E-01
3.42E-1	8.96E-01	2.80E-01
3.43E-1	8.96E-01	3.00E-01
3.44E-1	9.04E-01	2.80E-01
3.45E-1	8.88E-01	3.00E-01
3.46E-1	8.96E-01	2.80E-01
3.47E-1	8.96E-01	2.60E-01
3.48E-1	8.96E-01	3.00E-01
3.49E-1	9.04E-01	2.80E-01
3.5E-1	9.04E-01	3.00E-01
3.51E-1	9.04E-01	2.80E-01
3.52E-1	9.04E-01	3.00E-01
3.53E-1	9.04E-01	2.80E-01
3.54E-1	9.04E-01	2.80E-01
3.55E-1	8.88E-01	2.80E-01
3.56E-1	8.96E-01	2.80E-01
3.57E-1	9.04E-01	2.80E-01
3.58E-1	9.12E-01	2.80E-01
3.59E-1	9.20E-01	2.60E-01
3.6E-1	9.36E-01	2.80E-01
3.61E-1	9.36E-01	2.80E-01
3.62E-1	9.36E-01	2.80E-01
3.63E-1	9.28E-01	2.60E-01
3.64E-1	9.28E-01	2.60E-01
3.65E-1	9.28E-01	2.80E-01
3.66E-1	9.28E-01	2.80E-01
3.67E-1	9.20E-01	2.80E-01
3.68E-1	9.20E-01	2.80E-01
3.69E-1	9.20E-01	2.80E-01
3.7E-1	9.28E-01	2.60E-01
3.71E-1	9.28E-01	2.80E-01
3.72E-1	9.36E-01	2.80E-01
3.73E-1	9.20E-01	2.80E-01
3.74E-1	9.12E-01	2.80E-01
3.75E-1	9.12E-01	2.80E-01
3.76E-1	9.20E-01	2.60E-01
3.77E-1	9.20E-01	2.60E-01
3.78E-1	9.12E-01	2.60E-01
3.79E-1	9.12E-01	2.80E-01
3.8E-1	9.04E-01	2.80E-01
3.81E-1	9.04E-01	2.60E-01
3.82E-1	9.04E-01	2.60E-01
3.83E-1	9.04E-01	2.60E-01
3.84E-1	9.12E-01	2.60E-01
3.85E-1	9.12E-01	2.60E-01
3.86E-1	9.12E-01	2.60E-01
3.87E-1	9.04E-01	2.60E-01
3.88E-1	9.20E-01	2.60E-01
3.89E-1	9.20E-01	2.60E-01
3.9E-1	9.20E-01	2.60E-01
3.91E-1	9.20E-01	2.60E-01
3.92E-1	9.20E-01	2.60E-01
3.93E-1	9.28E-01	2.60E-01
3.94E-1	9.20E-01	2.60E-01
3.95E-1	9.20E-01	2.60E-01
3.96E-1	9.20E-01	2.40E-01
3.97E-1	9.12E-01	2.60E-01
3.98E-1	9.04E-01	2.60E-01
3.99E-1	9.04E-01	2.60E-01
4.E-1	9.04E-01	2.60E-01
4.01E-1	9.04E-01	2.60E-01
4.02E-1	9.04E-01	2.60E-01
4.03E-1	9.04E-01	2.60E-01
4.04E-1	9.04E-01	2.60E-01
4.05E-1	9.04E-01	2.40E-01
4.06E-1	8.96E-01	2.40E-01
4.07E-1	8.96E-01	2.40E-01
4.08E-1	8.88E-01	2.40E-01
4.09E-1	8.88E-01	2.60E-01
4.1E-1	8.88E-01	2.40E-01
4.11E-1	8.88E-01	2.40E-01
4.12E-1	8.80E-01	2.60E-01
4.13E-1	8.80E-01	2.60E-01
4.14E-1	8.72E-01	2.40E-01
4.15E-1	8.72E-01	2.40E-01
4.16E-1	8.72E-01	2.40E-01
4.17E-1	8.72E-01	2.40E-01
4.18E-1	8.72E-01	2.40E-01
4.19E-1	8.80E-01	2.40E-01
4.2E-1	8.64E-01	2.40E-01
4.21E-1	8.72E-01	2.40E-01
4.22E-1	8.72E-01	2.40E-01
4.23E-1	8.72E-01	2.40E-01
4.24E-1	8.72E-01	2.40E-01
4.25E-1	8.72E-01	2.40E-01
4.26E-1	8.56E-01	2.60E-01
4.27E-1	8.64E-01	2.40E-01
4.28E-1	8.72E-01	2.40E-01
4.29E-1	8.72E-01	2.40E-01
4.3E-1	8.80E-01	2.40E-01
4.31E-1	8.80E-01	2.20E-01
4.32E-1	8.80E-01	2.20E-01
4.33E-1	8.88E-01	2.20E-01
4.34E-1	8.72E-01	2.20E-01
4.35E-1	8.72E-01	2.40E-01
4.36E-1	8.72E-01	2.20E-01
4.37E-1	8.72E-01	2.40E-01
4.38E-1	8.72E-01	2.20E-01
4.39E-1	8.72E-01	2.20E-01
4.4E-1	8.80E-01	2.40E-01
4.41E-1	8.80E-01	2.40E-01
4.42E-1	8.72E-01	2.20E-01
4.43E-1	8.72E-01	2.20E-01
4.44E-1	8.72E-01	2.40E-01
4.45E-1	8.72E-01	2.40E-01
4.46E-1	8.72E-01	2.20E-01
4.47E-1	8.64E-01	2.20E-01
4.48E-1	8.72E-01	2.20E-01
4.49E-1	8.72E-01	2.20E-01
4.5E-1	8.56E-01	2.40E-01
4.51E-1	8.72E-01	2.20E-01
4.52E-1	8.72E-01	2.20E-01
4.53E-1	8.72E-01	2.20E-01
4.54E-1	8.72E-01	2.20E-01
4.55E-1	8.64E-01	2.20E-01
4.56E-1	8.64E-01	2.20E-01
4.57E-1	8.64E-01	2.20E-01
4.58E-1	8.72E-01	2.20E-01
4.59E-1	8.72E-01	2.20E-01
4.6E-1	8.72E-01	2.20E-01
4.61E-1	8.88E-01	2.00E-01
4.62E-1	8.80E-01	2.20E-01
4.63E-1	8.80E-01	2.00E-01
4.64E-1	8.72E-01	2.20E-01
4.65E-1	8.64E-01	2.20E-01
4.66E-1	8.72E-01	2.20E-01
4.67E-1	8.72E-01	2.00E-01
4.68E-1	8.80E-01	2.20E-01
4.69E-1	8.80E-01	2.20E-01
4.7E-1	8.72E-01	2.20E-01
4.71E-1	8.80E-01	2.00E-01
4.72E-1	8.80E-01	2.00E-01
4.73E-1	8.80E-01	2.20E-01
4.74E-1	8.88E-01	2.20E-01
4.75E-1	8.96E-01	2.20E-01
4.76E-1	8.88E-01	2.00E-01
4.77E-1	8.96E-01	2.00E-01
4.78E-1	8.88E-01	2.00E-01
4.79E-1	8.88E-01	2.00E-01
4.8E-1	8.88E-01	2.00E-01
4.81E-1	8.96E-01	2.00E-01
4.82E-1	8.88E-01	2.00E-01
4.83E-1	8.88E-01	2.20E-01
4.84E-1	8.88E-01	2.00E-01
4.85E-1	8.88E-01	2.00E-01
4.86E-1	8.80E-01	2.20E-01
4.87E-1	8.72E-01	2.20E-01
4.88E-1	8.80E-01	2.00E-01
4.89E-1	8.80E-01	2.00E-01
4.9E-1	8.88E-01	2.00E-01
4.91E-1	8.88E-01	2.00E-01
4.92E-1	8.80E-01	2.00E-01
4.93E-1	8.72E-01	1.80E-01
4.94E-1	8.64E-01	1.80E-01
4.95E-1	8.56E-01	1.80E-01
4.96E-1	8.56E-01	1.80E-01
4.97E-1	8.56E-01	2.00E-01
4.98E-1	8.56E-01	1.80E-01
4.99E-1	8.48E-01	2.00E-01
5.E-1	8.48E-01	1.80E-01
5.01E-1	8.40E-01	1.80E-01
5.02E-1	8.40E-01	1.80E-01
5.03E-1	8.40E-01	2.00E-01
5.04E-1	8.40E-01	1.80E-01
5.05E-1	8.48E-01	1.80E-01
5.06E-1	8.48E-01	2.00E-01
5.07E-1	8.32E-01	1.80E-01
5.08E-1	8.32E-01	1.80E-01
5.09E-1	8.32E-01	2.00E-01
5.1E-1	8.40E-01	1.80E-01
5.11E-1	8.40E-01	1.80E-01
5.12E-1	8.40E-01	1.80E-01
5.13E-1	8.40E-01	1.80E-01
5.14E-1	8.40E-01	1.80E-01
5.15E-1	8.40E-01	1.80E-01
5.16E-1	8.40E-01	1.60E-01
5.17E-1	8.48E-01	2.00E-01
5.18E-1	8.40E-01	1.80E-01
5.19E-1	8.40E-01	1.80E-01
5.2E-1	8.48E-01	1.80E-01
5.21E-1	8.48E-01	1.80E-01
5.22E-1	8.56E-01	1.80E-01
5.23E-1	8.64E-01	1.80E-01
5.24E-1	8.64E-01	1.80E-01
5.25E-1	8.56E-01	1.80E-01
5.26E-1	8.48E-01	1.80E-01
5.27E-1	8.40E-01	1.80E-01
5.28E-1	8.40E-01	1.80E-01
5.29E-1	8.32E-01	1.80E-01
5.3E-1	8.32E-01	1.60E-01
5.31E-1	8.32E-01	1.80E-01
5.32E-1	8.24E-01	1.80E-01
5.33E-1	8.24E-01	1.80E-01
5.34E-1	8.24E-01	1.80E-01
5.35E-1	8.16E-01	1.60E-01
5.36E-1	8.24E-01	1.80E-01
5.37E-1	8.16E-01	1.80E-01
5.38E-1	8.24E-01	1.80E-01
5.39E-1	8.24E-01	1.60E-01
5.4E-1	8.24E-01	1.80E-01
5.41E-1	8.24E-01	1.60E-01
5.42E-1	8.24E-01	1.60E-01
5.43E-1	8.24E-01	1.60E-01
5.44E-1	8.16E-01	1.60E-01
5.45E-1	8.00E-01	1.80E-01
5.46E-1	8.00E-01	1.80E-01
5.47E-1	8.16E-01	1.60E-01
5.48E-1	8.16E-01	1.60E-01
5.49E-1	8.24E-01	1.60E-01
5.5E-1	8.24E-01	1.80E-01
5.51E-1	8.24E-01	1.60E-01
5.52E-1	8.16E-01	1.60E-01
5.53E-1	8.32E-01	1.60E-01
5.54E-1	8.24E-01	1.60E-01
5.55E-1	8.32E-01	1.60E-01
5.56E-1	8.32E-01	1.60E-01
5.57E-1	8.32E-01	1.60E-01
5.58E-1	8.32E-01	1.60E-01
5.59E-1	8.32E-01	1.60E-01
5.6E-1	8.32E-01	1.60E-01
5.61E-1	8.40E-01	1.60E-01
5.62E-1	8.32E-01	1.40E-01
5.63E-1	8.40E-01	1.60E-01
5.64E-1	8.32E-01	1.60E-01
5.65E-1	8.32E-01	1.60E-01
5.66E-1	8.32E-01	1.60E-01
5.67E-1	8.32E-01	1.60E-01
5.68E-1	8.40E-01	1.40E-01
5.69E-1	8.32E-01	1.60E-01
5.7E-1	8.32E-01	1.40E-01
5.71E-1	8.24E-01	1.60E-01
5.72E-1	8.24E-01	1.60E-01
5.73E-1	8.24E-01	1.60E-01
5.74E-1	8.32E-01	1.40E-01
5.75E-1	8.32E-01	1.40E-01
5.76E-1	8.32E-01	1.40E-01
5.77E-1	8.24E-01	1.40E-01
5.78E-1	8.24E-01	1.60E-01
5.79E-1	8.24E-01	1.40E-01
5.8E-1	8.16E-01	1.40E-01
5.81E-1	8.16E-01	1.60E-01
5.82E-1	8.24E-01	1.60E-01
5.83E-1	8.16E-01	1.40E-01
5.84E-1	8.24E-01	1.40E-01
5.85E-1	8.16E-01	1.40E-01
5.86E-1	8.16E-01	1.20E-01
5.87E-1	8.16E-01	1.40E-01
5.88E-1	8.08E-01	1.40E-01
5.89E-1	8.08E-01	1.40E-01
5.9E-1	8.16E-01	1.40E-01
5.91E-1	8.16E-01	1.40E-01
5.92E-1	8.24E-01	1.60E-01
5.93E-1	8.16E-01	1.40E-01
5.94E-1	8.16E-01	1.40E-01
5.95E-1	8.08E-01	1.40E-01
5.96E-1	8.08E-01	1.20E-01
5.97E-1	8.16E-01	1.40E-01
5.98E-1	8.16E-01	1.40E-01
5.99E-1	8.08E-01	1.20E-01
6.E-1	8.08E-01	1.40E-01
6.01E-1	8.08E-01	1.20E-01
6.02E-1	8.08E-01	1.40E-01
6.03E-1	8.08E-01	1.40E-01
6.04E-1	8.16E-01	1.40E-01
6.05E-1	8.08E-01	1.40E-01
6.06E-1	8.08E-01	1.20E-01
6.07E-1	8.08E-01	1.20E-01
6.08E-1	8.08E-01	1.20E-01
6.09E-1	8.16E-01	1.40E-01
6.1E-1	8.24E-01	1.20E-01
6.11E-1	8.24E-01	1.20E-01
6.12E-1	8.16E-01	1.20E-01
6.13E-1	8.24E-01	1.20E-01
6.14E-1	8.08E-01	1.20E-01
6.15E-1	8.08E-01	1.40E-01
6.16E-1	8.00E-01	1.20E-01
6.17E-1	8.00E-01	1.20E-01
6.18E-1	8.08E-01	1.40E-01
6.19E-1	8.16E-01	1.20E-01
6.2E-1	8.16E-01	1.20E-01
6.21E-1	8.00E-01	1.20E-01
6.22E-1	8.08E-01	1.20E-01
6.23E-1	8.00E-01	1.40E-01
6.24E-1	7.92E-01	1.20E-01
6.25E-1	7.92E-01	1.20E-01
6.26E-1	7.84E-01	1.20E-01
6.27E-1	7.84E-01	1.20E-01
6.28E-1	7.84E-01	1.20E-01
6.29E-1	7.76E-01	1.20E-01
6.3E-1	7.84E-01	1.20E-01
6.31E-1	8.00E-01	1.20E-01
6.32E-1	8.08E-01	1.00E-01
6.33E-1	8.00E-01	1.20E-01
6.34E-1	8.00E-01	1.00E-01
6.35E-1	8.00E-01	1.00E-01
6.36E-1	8.08E-01	1.20E-01
6.37E-1	7.92E-01	1.20E-01
6.38E-1	7.92E-01	1.20E-01
6.39E-1	7.92E-01	1.00E-01
6.4E-1	7.84E-01	1.20E-01
6.41E-1	8.00E-01	1.20E-01
6.42E-1	7.92E-01	1.20E-01
6.43E-1	7.84E-01	1.20E-01
6.44E-1	7.84E-01	1.00E-01
6.45E-1	7.92E-01	1.20E-01
6.46E-1	7.92E-01	1.00E-01
6.47E-1	7.92E-01	1.00E-01
6.48E-1	7.92E-01	1.00E-01
6.49E-1	7.76E-01	1.00E-01
6.5E-1	7.84E-01	1.20E-01
6.51E-1	7.92E-01	1.00E-01
6.52E-1	7.92E-01	1.00E-01
6.53E-1	7.84E-01	1.20E-01
6.54E-1	7.84E-01	1.20E-01
6.55E-1	7.84E-01	1.20E-01
6.56E-1	7.76E-01	1.00E-01
6.57E-1	7.84E-01	1.00E-01
6.58E-1	7.76E-01	1.00E-01
6.59E-1	7.76E-01	1.00E-01
6.6E-1	7.76E-01	8.00E-02
6.61E-1	7.68E-01	1.00E-01
6.62E-1	7.68E-01	1.20E-01
6.63E-1	7.60E-01	1.20E-01
6.64E-1	7.52E-01	1.00E-01
6.65E-1	7.52E-01	1.00E-01
6.66E-1	7.52E-01	1.00E-01
6.67E-1	7.52E-01	1.00E-01
6.68E-1	7.44E-01	8.00E-02
6.69E-1	7.36E-01	8.00E-02
6.7E-1	7.36E-01	8.00E-02
6.71E-1	7.44E-01	1.00E-01
6.72E-1	7.36E-01	1.00E-01
6.73E-1	7.28E-01	1.00E-01
6.74E-1	7.28E-01	8.00E-02
6.75E-1	7.36E-01	1.00E-01
6.76E-1	7.36E-01	8.00E-02
6.77E-1	7.36E-01	1.00E-01
6.78E-1	7.44E-01	8.00E-02
6.79E-1	7.52E-01	8.00E-02
6.8E-1	7.36E-01	8.00E-02
6.81E-1	7.36E-01	1.00E-01
6.82E-1	7.44E-01	1.00E-01
6.83E-1	7.44E-01	8.00E-02
6.84E-1	7.36E-01	8.00E-02
6.85E-1	7.36E-01	8.00E-02
6.86E-1	7.36E-01	8.00E-02
6.87E-1	7.36E-01	8.00E-02
6.88E-1	7.44E-01	8.00E-02
6.89E-1	7.44E-01	1.00E-01
6.9E-1	7.52E-01	8.00E-02
6.91E-1	7.44E-01	6.00E-02
6.92E-1	7.44E-01	1.00E-01
6.93E-1	7.44E-01	8.00E-02
6.94E-1	7.36E-01	8.00E-02
6.95E-1	7.28E-01	8.00E-02
6.96E-1	7.28E-01	8.00E-02
6.97E-1	7.28E-01	6.00E-02
6.98E-1	7.28E-01	8.00E-02
6.99E-1	7.36E-01	6.00E-02
7.E-1	7.28E-01	6.00E-02
7.01E-1	7.28E-01	8.00E-02
7.02E-1	7.20E-01	8.00E-02
7.03E-1	7.20E-01	8.00E-02
7.04E-1	7.04E-01	6.00E-02
7.05E-1	7.04E-01	6.00E-02
7.06E-1	7.04E-01	8.00E-02
7.07E-1	6.96E-01	6.00E-02
7.08E-1	7.04E-01	6.00E-02
7.09E-1	7.12E-01	6.00E-02
7.1E-1	6.96E-01	6.00E-02
7.11E-1	6.96E-01	8.00E-02
7.12E-1	7.04E-01	6.00E-02
7.13E-1	7.04E-01	6.00E-02
7.14E-1	7.12E-01	6.00E-02
7.15E-1	7.12E-01	6.00E-02
7.16E-1	7.04E-01	8.00E-02
7.17E-1	6.96E-01	6.00E-02
7.18E-1	6.96E-01	6.00E-02
7.19E-1	6.80E-01	6.00E-02
7.2E-1	6.80E-01	6.00E-02
7.21E-1	6.80E-01	6.00E-02
7.22E-1	6.72E-01	4.00E-02
7.23E-1	6.72E-01	6.00E-02
7.24E-1	6.64E-01	6.00E-02
7.25E-1	6.72E-01	6.00E-02
7.26E-1	6.72E-01	6.00E-02
7.27E-1	6.80E-01	6.00E-02
7.28E-1	6.80E-01	6.00E-02
7.29E-1	6.80E-01	6.00E-02
7.3E-1	6.80E-01	6.00E-02
7.31E-1	6.80E-01	4.00E-02
7.32E-1	6.80E-01	6.00E-02
7.33E-1	6.72E-01	6.00E-02
7.34E-1	6.72E-01	6.00E-02
7.35E-1	6.64E-01	6.00E-02
7.36E-1	6.64E-01	6.00E-02
7.37E-1	6.64E-01	6.00E-02
7.38E-1	6.64E-01	4.00E-02
7.39E-1	6.72E-01	4.00E-02
7.4E-1	6.64E-01	4.00E-02
7.41E-1	6.64E-01	4.00E-02
7.42E-1	6.64E-01	4.00E-02
7.43E-1	6.64E-01	4.00E-02
7.44E-1	6.56E-01	4.00E-02
7.45E-1	6.56E-01	4.00E-02
7.46E-1	6.56E-01	4.00E-02
7.47E-1	6.56E-01	4.00E-02
7.48E-1	6.40E-01	6.00E-02
7.49E-1	6.32E-01	4.00E-02
7.5E-1	6.32E-01	4.00E-02
7.51E-1	6.40E-01	4.00E-02
7.52E-1	6.32E-01	4.00E-02
7.53E-1	6.32E-01	6.00E-02
7.54E-1	6.24E-01	4.00E-02
7.55E-1	6.08E-01	4.00E-02
7.56E-1	6.24E-01	4.00E-02
7.57E-1	6.08E-01	4.00E-02
7.58E-1	6.08E-01	4.00E-02
7.59E-1	5.92E-01	4.00E-02
7.6E-1	5.84E-01	6.00E-02
7.61E-1	5.84E-01	2.00E-02
7.62E-1	5.84E-01	4.00E-02
7.63E-1	5.76E-01	4.00E-02
7.64E-1	5.76E-01	4.00E-02
7.65E-1	5.76E-01	4.00E-02
7.66E-1	5.84E-01	2.00E-02
7.67E-1	5.84E-01	4.00E-02
7.68E-1	5.76E-01	4.00E-02
7.69E-1	5.68E-01	2.00E-02
7.7E-1	5.68E-01	4.00E-02
7.71E-1	5.68E-01	4.00E-02
7.72E-1	5.68E-01	2.00E-02
7.73E-1	5.60E-01	4.00E-02
7.74E-1	5.60E-01	4.00E-02
7.75E-1	5.60E-01	2.00E-02
7.76E-1	5.68E-01	2.00E-02
7.77E-1	5.68E-01	2.00E-02
7.78E-1	5.60E-01	2.00E-02
7.79E-1	5.52E-01	2.00E-02
7.8E-1	5.44E-01	2.00E-02
7.81E-1	5.52E-01	4.00E-02
7.82E-1	5.44E-01	4.00E-02
7.83E-1	5.44E-01	4.00E-02
7.84E-1	5.44E-01	2.00E-02
7.85E-1	5.44E-01	4.00E-02
7.86E-1	5.36E-01	2.00E-02
7.87E-1	5.36E-01	2.00E-02
7.88E-1	5.36E-01	2.00E-02
7.89E-1	5.36E-01	4.00E-02
7.9E-1	5.36E-01	0.00E+00
7.91E-1	5.28E-01	2.00E-02
7.92E-1	5.28E-01	2.00E-02
7.93E-1	5.20E-01	2.00E-02
7.94E-1	5.12E-01	2.00E-02
7.95E-1	5.04E-01	4.00E-02
7.96E-1	5.04E-01	0.00E+00
7.97E-1	5.04E-01	2.00E-02
7.98E-1	4.96E-01	2.00E-02
7.99E-1	4.88E-01	2.00E-02
8.E-1	4.80E-01	2.00E-02
8.01E-1	4.72E-01	0.00E+00
8.02E-1	4.80E-01	2.00E-02
8.03E-1	4.80E-01	0.00E+00
8.04E-1	4.72E-01	0.00E+00
8.05E-1	4.56E-01	2.00E-02
8.06E-1	4.56E-01	0.00E+00
8.07E-1	4.56E-01	0.00E+00
8.08E-1	4.48E-01	2.00E-02
8.09E-1	4.40E-01	0.00E+00
8.1E-1	4.32E-01	0.00E+00
8.11E-1	4.32E-01	0.00E+00
8.12E-1	4.16E-01	2.00E-02
8.13E-1	4.16E-01	2.00E-02
8.14E-1	4.08E-01	2.00E-02
8.15E-1	4.08E-01	2.00E-02
8.16E-1	4.00E-01	2.00E-02
8.17E-1	3.92E-01	0.00E+00
8.18E-1	3.92E-01	0.00E+00
8.19E-1	3.84E-01	-2.00E-02
8.2E-1	3.76E-01	0.00E+00
8.21E-1	3.68E-01	0.00E+00
8.22E-1	3.68E-01	0.00E+00
8.23E-1	3.60E-01	0.00E+00
8.24E-1	3.60E-01	2.00E-02
8.25E-1	3.60E-01	2.00E-02
8.26E-1	3.44E-01	2.00E-02
8.27E-1	3.44E-01	0.00E+00
8.28E-1	3.36E-01	0.00E+00
8.29E-1	3.36E-01	-2.00E-02
8.3E-1	3.20E-01	0.00E+00
8.31E-1	3.12E-01	0.00E+00
8.32E-1	3.04E-01	-2.00E-02
8.33E-1	3.04E-01	-2.00E-02
8.34E-1	2.96E-01	0.00E+00
8.35E-1	2.96E-01	0.00E+00
8.36E-1	2.88E-01	0.00E+00
8.37E-1	2.80E-01	0.00E+00
8.38E-1	2.88E-01	0.00E+00
8.39E-1	2.80E-01	0.00E+00
8.4E-1	2.88E-01	-2.00E-02
8.41E-1	2.88E-01	-2.00E-02
8.42E-1	2.80E-01	-2.00E-02
8.43E-1	2.64E-01	-2.00E-02
8.44E-1	2.64E-01	-2.00E-02
8.45E-1	2.48E-01	-2.00E-02
8.46E-1	2.48E-01	-2.00E-02
8.47E-1	2.48E-01	0.00E+00
8.48E-1	2.48E-01	-2.00E-02
8.49E-1	2.40E-01	0.00E+00
8.5E-1	2.40E-01	0.00E+00
8.51E-1	2.48E-01	0.00E+00
8.52E-1	2.32E-01	-2.00E-02
8.53E-1	2.40E-01	-2.00E-02
8.54E-1	2.32E-01	-2.00E-02
8.55E-1	2.32E-01	-2.00E-02
8.56E-1	2.16E-01	-4.00E-02
8.57E-1	2.08E-01	-2.00E-02
8.58E-1	2.00E-01	-2.00E-02
8.59E-1	1.92E-01	-2.00E-02
8.6E-1	1.92E-01	-2.00E-02
8.61E-1	1.84E-01	-2.00E-02
8.62E-1	1.92E-01	-2.00E-02
8.63E-1	1.84E-01	-2.00E-02
8.64E-1	1.76E-01	-4.00E-02
8.65E-1	1.76E-01	-2.00E-02
8.66E-1	1.84E-01	0.00E+00
8.67E-1	1.84E-01	-2.00E-02
8.68E-1	1.68E-01	-4.00E-02
8.69E-1	1.68E-01	-2.00E-02
8.7E-1	1.68E-01	-4.00E-02
8.71E-1	1.76E-01	-2.00E-02
8.72E-1	1.76E-01	-2.00E-02
8.73E-1	1.76E-01	-4.00E-02
8.74E-1	1.76E-01	-4.00E-02
8.75E-1	1.76E-01	-4.00E-02
8.76E-1	1.76E-01	-2.00E-02
8.77E-1	1.76E-01	-4.00E-02
8.78E-1	1.84E-01	-2.00E-02
8.79E-1	1.76E-01	-2.00E-02
8.8E-1	1.68E-01	-4.00E-02
8.81E-1	1.76E-01	-2.00E-02
8.82E-1	2.00E-01	-4.00E-02
8.83E-1	1.92E-01	-4.00E-02
8.84E-1	1.84E-01	-4.00E-02
8.85E-1	1.84E-01	-4.00E-02
8.86E-1	1.84E-01	-4.00E-02
8.87E-1	1.84E-01	-4.00E-02
8.88E-1	1.76E-01	-4.00E-02
8.89E-1	1.84E-01	-4.00E-02
8.9E-1	1.76E-01	-4.00E-02
8.91E-1	1.68E-01	-4.00E-02
8.92E-1	1.60E-01	-6.00E-02
8.93E-1	1.60E-01	-6.00E-02
8.94E-1	1.60E-01	-6.00E-02
8.95E-1	1.52E-01	-4.00E-02
8.96E-1	1.60E-01	-6.00E-02
8.97E-1	1.52E-01	-4.00E-02
8.98E-1	1.44E-01	-4.00E-02
8.99E-1	1.36E-01	-6.00E-02
9.E-1	1.44E-01	-6.00E-02
9.01E-1	1.52E-01	-6.00E-02
9.02E-1	1.44E-01	-4.00E-02
9.03E-1	1.52E-01	-6.00E-02
9.04E-1	1.52E-01	-4.00E-02
9.05E-1	1.44E-01	-4.00E-02
9.06E-1	1.28E-01	-4.00E-02
9.07E-1	1.36E-01	-4.00E-02
9.08E-1	1.36E-01	-4.00E-02
9.09E-1	1.36E-01	-6.00E-02
9.1E-1	1.36E-01	-6.00E-02
9.11E-1	1.52E-01	-4.00E-02
9.12E-1	1.52E-01	-8.00E-02
9.13E-1	1.44E-01	-6.00E-02
9.14E-1	1.44E-01	-6.00E-02
9.15E-1	1.44E-01	-6.00E-02
9.16E-1	1.36E-01	-6.00E-02
9.17E-1	1.44E-01	-6.00E-02
9.18E-1	1.44E-01	-4.00E-02
9.19E-1	1.44E-01	-4.00E-02
9.2E-1	1.44E-01	-6.00E-02
9.21E-1	1.36E-01	-6.00E-02
9.22E-1	1.44E-01	-4.00E-02
9.23E-1	1.28E-01	-6.00E-02
9.24E-1	1.36E-01	-6.00E-02
9.25E-1	1.44E-01	-6.00E-02
9.26E-1	1.36E-01	-6.00E-02
9.27E-1	1.44E-01	-6.00E-02
9.28E-1	1.36E-01	-6.00E-02
9.29E-1	1.44E-01	-8.00E-02
9.3E-1	1.52E-01	-8.00E-02
9.31E-1	1.44E-01	-6.00E-02
9.32E-1	1.52E-01	-6.00E-02
9.33E-1	1.60E-01	-6.00E-02
9.34E-1	1.60E-01	-6.00E-02
9.35E-1	1.60E-01	-6.00E-02
9.36E-1	1.68E-01	-6.00E-02
9.37E-1	1.68E-01	-8.00E-02
9.38E-1	1.84E-01	-8.00E-02
9.39E-1	2.00E-01	-6.00E-02
9.4E-1	1.92E-01	-8.00E-02
9.41E-1	1.92E-01	-8.00E-02
9.42E-1	1.84E-01	-6.00E-02
9.43E-1	1.84E-01	-6.00E-02
9.44E-1	1.92E-01	-8.00E-02
9.45E-1	2.00E-01	-6.00E-02
9.46E-1	2.00E-01	-6.00E-02
9.47E-1	2.08E-01	-6.00E-02
9.48E-1	2.08E-01	-8.00E-02
9.49E-1	2.16E-01	-6.00E-02
9.5E-1	2.24E-01	-8.00E-02
9.51E-1	2.16E-01	-8.00E-02
9.52E-1	2.24E-01	-8.00E-02
9.53E-1	2.24E-01	-8.00E-02
9.54E-1	2.32E-01	-8.00E-02
9.55E-1	2.40E-01	-8.00E-02
9.56E-1	2.40E-01	-8.00E-02
9.57E-1	2.56E-01	-1.00E-01
9.58E-1	2.64E-01	-8.00E-02
9.59E-1	2.72E-01	-8.00E-02
9.6E-1	2.72E-01	-8.00E-02
9.61E-1	2.72E-01	-1.00E-01
9.62E-1	2.72E-01	-8.00E-02
9.63E-1	2.72E-01	-8.00E-02
9.64E-1	2.80E-01	-1.00E-01
9.65E-1	2.80E-01	-8.00E-02
9.66E-1	2.88E-01	-8.00E-02
9.67E-1	2.88E-01	-1.00E-01
9.68E-1	2.88E-01	-8.00E-02
9.69E-1	2.96E-01	-1.00E-01
9.7E-1	2.96E-01	-1.00E-01
9.71E-1	2.96E-01	-8.00E-02
9.72E-1	2.96E-01	-8.00E-02
9.73E-1	3.04E-01	-1.00E-01
9.74E-1	3.04E-01	-1.00E-01
9.75E-1	3.04E-01	-1.00E-01
9.76E-1	3.12E-01	-1.00E-01
9.77E-1	3.12E-01	-1.00E-01
9.78E-1	3.04E-01	-8.00E-02
9.79E-1	3.20E-01	-1.00E-01
9.8E-1	3.20E-01	-8.00E-02
9.81E-1	3.20E-01	-1.00E-01
9.82E-1	3.20E-01	-1.20E-01
9.83E-1	3.36E-01	-8.00E-02
9.84E-1	3.44E-01	-1.00E-01
9.85E-1	3.44E-01	-1.00E-01
9.86E-1	3.52E-01	-1.00E-01
9.87E-1	3.52E-01	-1.00E-01
9.88E-1	3.60E-01	-1.00E-01
9.89E-1	3.68E-01	-8.00E-02
9.9E-1	3.68E-01	-1.00E-01
9.91E-1	3.76E-01	-8.00E-02
9.92E-1	3.76E-01	-1.00E-01
9.93E-1	3.92E-01	-1.00E-01
9.94E-1	3.92E-01	-1.00E-01
9.95E-1	3.84E-01	-1.00E-01
9.96E-1	4.00E-01	-1.00E-01
9.97E-1	4.00E-01	-1.00E-01
9.98E-1	4.00E-01	-1.20E-01
9.99E-1	4.00E-01	-1.00E-01
1.E+0	4.08E-01	-1.20E-01
1.001E+0	4.24E-01	-1.00E-01
1.002E+0	4.24E-01	-1.00E-01
1.003E+0	4.32E-01	-1.20E-01
1.004E+0	4.40E-01	-1.00E-01
1.005E+0	4.40E-01	-1.20E-01
1.006E+0	4.48E-01	-1.20E-01
1.007E+0	4.40E-01	-1.00E-01
1.008E+0	4.40E-01	-1.20E-01
1.009E+0	4.40E-01	-1.20E-01
1.01E+0	4.40E-01	-1.20E-01
1.011E+0	4.48E-01	-1.20E-01
1.012E+0	4.56E-01	-1.00E-01
1.013E+0	4.72E-01	-1.20E-01
1.014E+0	4.72E-01	-1.20E-01
1.015E+0	4.72E-01	-1.20E-01
1.016E+0	4.72E-01	-1.20E-01
1.017E+0	4.72E-01	-1.00E-01
1.018E+0	4.88E-01	-1.20E-01
1.019E+0	4.88E-01	-1.20E-01
1.02E+0	4.88E-01	-1.20E-01
1.021E+0	4.96E-01	-1.20E-01
1.022E+0	5.04E-01	-1.20E-01
1.023E+0	5.04E-01	-1.20E-01
1.024E+0	4.96E-01	-1.40E-01
1.025E+0	4.96E-01	-1.20E-01
1.026E+0	5.04E-01	-1.20E-01
1.027E+0	5.04E-01	-1.20E-01
1.028E+0	5.12E-01	-1.20E-01
1.029E+0	5.20E-01	-1.20E-01
1.03E+0	5.20E-01	-1.20E-01
1.031E+0	5.28E-01	-1.20E-01
1.032E+0	5.36E-01	-1.20E-01
1.033E+0	5.36E-01	-1.20E-01
1.034E+0	5.36E-01	-1.40E-01
1.035E+0	5.36E-01	-1.20E-01
1.036E+0	5.36E-01	-1.20E-01
1.037E+0	5.36E-01	-1.40E-01
1.038E+0	5.44E-01	-1.40E-01
1.039E+0	5.44E-01	-1.20E-01
1.04E+0	5.52E-01	-1.20E-01
1.041E+0	5.52E-01	-1.40E-01
1.042E+0	5.52E-01	-1.20E-01
1.043E+0	5.52E-01	-1.20E-01
1.044E+0	5.60E-01	-1.40E-01
1.045E+0	5.68E-01	-1.40E-01
1.046E+0	5.76E-01	-1.40E-01
1.047E+0	5.84E-01	-1.20E-01
1.048E+0	5.84E-01	-1.40E-01
1.049E+0	5.92E-01	-1.40E-01
1.05E+0	5.84E-01	-1.40E-01
1.051E+0	5.92E-01	-1.40E-01
1.052E+0	6.00E-01	-1.40E-01
1.053E+0	6.00E-01	-1.40E-01
1.054E+0	6.00E-01	-1.40E-01
1.055E+0	6.00E-01	-1.40E-01
1.056E+0	6.00E-01	-1.60E-01
1.057E+0	6.00E-01	-1.20E-01
1.058E+0	6.16E-01	-1.60E-01
1.059E+0	6.16E-01	-1.40E-01
1.06E+0	6.24E-01	-1.40E-01
1.061E+0	6.24E-01	-1.40E-01
1.062E+0	6.32E-01	-1.60E-01
1.063E+0	6.32E-01	-1.20E-01
1.064E+0	6.32E-01	-1.40E-01
1.065E+0	6.40E-01	-1.60E-01
1.066E+0	6.48E-01	-1.40E-01
1.067E+0	6.56E-01	-1.40E-01
1.068E+0	6.64E-01	-1.40E-01
1.069E+0	6.64E-01	-1.40E-01
1.07E+0	6.56E-01	-1.40E-01
1.071E+0	6.64E-01	-1.40E-01
1.072E+0	6.64E-01	-1.60E-01
1.073E+0	6.72E-01	-1.40E-01
1.074E+0	6.64E-01	-1.40E-01
1.075E+0	6.64E-01	-1.60E-01
1.076E+0	6.72E-01	-1.60E-01
1.077E+0	6.72E-01	-1.60E-01
1.078E+0	6.72E-01	-1.40E-01
1.079E+0	6.64E-01	-1.40E-01
1.08E+0	6.72E-01	-1.60E-01
1.081E+0	6.72E-01	-1.60E-01
1.082E+0	6.80E-01	-1.60E-01
1.083E+0	6.88E-01	-1.40E-01
1.084E+0	6.80E-01	-1.40E-01
1.085E+0	6.80E-01	-1.60E-01
1.086E+0	6.80E-01	-1.60E-01
1.087E+0	6.88E-01	-1.60E-01
1.088E+0	6.88E-01	-1.60E-01
1.089E+0	6.88E-01	-1.60E-01
1.09E+0	6.80E-01	-1.60E-01
1.091E+0	7.04E-01	-1.60E-01
1.092E+0	7.04E-01	-1.60E-01
1.093E+0	7.04E-01	-1.60E-01
1.094E+0	6.96E-01	-1.60E-01
1.095E+0	7.04E-01	-1.80E-01
1.096E+0	7.04E-01	-1.80E-01
1.097E+0	7.12E-01	-1.60E-01
1.098E+0	7.04E-01	-1.60E-01
1.099E+0	7.04E-01	-1.80E-01
1.1E+0	6.96E-01	-1.60E-01
1.101E+0	6.96E-01	-1.60E-01
1.102E+0	7.04E-01	-1.80E-01
1.103E+0	7.04E-01	-1.80E-01
1.104E+0	7.04E-01	-1.60E-01
1.105E+0	7.04E-01	-1.80E-01
1.106E+0	7.12E-01	-1.80E-01
1.107E+0	7.12E-01	-1.60E-01
1.108E+0	7.20E-01	-1.80E-01
1.109E+0	7.28E-01	-1.80E-01
1.11E+0	7.28E-01	-1.80E-01
1.111E+0	7.28E-01	-1.60E-01
1.112E+0	7.28E-01	-1.80E-01
1.113E+0	7.36E-01	-1.80E-01
1.114E+0	7.36E-01	-2.00E-01
1.115E+0	7.28E-01	-1.60E-01
1.116E+0	7.36E-01	-1.80E-01
1.117E+0	7.44E-01	-1.60E-01
1.118E+0	7.44E-01	-1.80E-01
1.119E+0	7.52E-01	-1.80E-01
1.12E+0	7.52E-01	-1.60E-01
1.121E+0	7.60E-01	-1.80E-01
1.122E+0	7.60E-01	-1.80E-01
1.123E+0	7.60E-01	-1.80E-01
1.124E+0	7.68E-01	-1.80E-01
1.125E+0	7.60E-01	-1.60E-01
1.126E+0	7.52E-01	-1.80E-01
1.127E+0	7.52E-01	-1.80E-01
1.128E+0	7.52E-01	-1.80E-01
1.129E+0	7.60E-01	-1.80E-01
1.13E+0	7.52E-01	-1.80E-01
1.131E+0	7.52E-01	-1.80E-01
1.132E+0	7.60E-01	-1.80E-01
1.133E+0	7.52E-01	-2.00E-01
1.134E+0	7.52E-01	-2.00E-01
1.135E+0	7.52E-01	-2.00E-01
1.136E+0	7.60E-01	-1.80E-01
1.137E+0	7.60E-01	-2.00E-01
1.138E+0	7.68E-01	-1.80E-01
1.139E+0	7.76E-01	-2.00E-01
1.14E+0	7.60E-01	-2.00E-01
1.141E+0	7.68E-01	-1.80E-01
1.142E+0	7.76E-01	-2.00E-01
1.143E+0	7.76E-01	-1.80E-01
1.144E+0	7.76E-01	-1.80E-01
1.145E+0	7.84E-01	-1.80E-01
1.146E+0	7.92E-01	-2.00E-01
1.147E+0	7.92E-01	-2.00E-01
1.148E+0	7.92E-01	-2.00E-01
1.149E+0	7.92E-01	-1.80E-01
1.15E+0	7.92E-01	-1.80E-01
1.151E+0	7.92E-01	-2.00E-01
1.152E+0	8.00E-01	-2.00E-01
1.153E+0	8.08E-01	-1.80E-01
1.154E+0	8.16E-01	-2.00E-01
1.155E+0	8.16E-01	-2.00E-01
1.156E+0	8.24E-01	-2.00E-01
1.157E+0	8.16E-01	-2.00E-01
1.158E+0	8.16E-01	-2.00E-01
1.159E+0	8.24E-01	-2.00E-01
1.16E+0	8.24E-01	-2.00E-01
1.161E+0	8.24E-01	-2.00E-01
1.162E+0	8.40E-01	-2.20E-01
1.163E+0	8.40E-01	-2.00E-01
1.164E+0	8.40E-01	-1.80E-01
1.165E+0	8.40E-01	-2.00E-01
1.166E+0	8.40E-01	-2.20E-01
1.167E+0	8.40E-01	-2.00E-01
1.168E+0	8.32E-01	-2.00E-01
1.169E+0	8.24E-01	-2.00E-01
1.17E+0	8.16E-01	-2.20E-01
1.171E+0	8.24E-01	-2.00E-01
1.172E+0	8.32E-01	-2.00E-01
1.173E+0	8.32E-01	-2.00E-01
1.174E+0	8.32E-01	-2.20E-01
1.175E+0	8.32E-01	-2.00E-01
1.176E+0	8.24E-01	-2.20E-01
1.177E+0	8.24E-01	-2.00E-01
1.178E+0	8.24E-01	-2.00E-01
1.179E+0	8.16E-01	-2.00E-01
1.18E+0	8.08E-01	-2.20E-01
1.181E+0	8.08E-01	-2.20E-01
1.182E+0	8.08E-01	-2.00E-01
1.183E+0	8.16E-01	-2.20E-01
1.184E+0	8.08E-01	-2.20E-01
1.185E+0	8.08E-01	-2.20E-01
1.186E+0	8.08E-01	-2.20E-01
1.187E+0	7.92E-01	-2.20E-01
1.188E+0	8.00E-01	-2.20E-01
1.189E+0	8.08E-01	-2.20E-01
1.19E+0	8.08E-01	-2.20E-01
1.191E+0	8.00E-01	-2.20E-01
1.192E+0	8.00E-01	-2.20E-01
1.193E+0	8.00E-01	-2.40E-01
1.194E+0	8.00E-01	-2.20E-01
1.195E+0	8.00E-01	-2.20E-01
1.196E+0	8.08E-01	-2.20E-01
1.197E+0	8.00E-01	-2.20E-01
1.198E+0	8.00E-01	-2.40E-01
1.199E+0	8.00E-01	-2.20E-01
1.2E+0	8.08E-01	-2.40E-01
1.201E+0	8.16E-01	-2.20E-01
1.202E+0	8.24E-01	-2.20E-01
1.203E+0	8.24E-01	-2.40E-01
1.204E+0	8.32E-01	-2.40E-01
1.205E+0	8.32E-01	-2.40E-01
1.206E+0	8.32E-01	-2.40E-01
1.207E+0	8.48E-01	-2.20E-01
1.208E+0	8.32E-01	-2.40E-01
1.209E+0	8.24E-01	-2.20E-01
1.21E+0	8.24E-01	-2.20E-01
1.211E+0	8.24E-01	-2.40E-01
1.212E+0	8.24E-01	-2.20E-01
1.213E+0	8.32E-01	-2.40E-01
1.214E+0	8.40E-01	-2.20E-01
1.215E+0	8.40E-01	-2.20E-01
1.216E+0	8.40E-01	-2.40E-01
1.217E+0	8.40E-01	-2.40E-01
1.218E+0	8.48E-01	-2.40E-01
1.219E+0	8.56E-01	-2.40E-01
1.22E+0	8.48E-01	-2.40E-01
1.221E+0	8.48E-01	-2.40E-01
1.222E+0	8.56E-01	-2.40E-01
1.223E+0	8.56E-01	-2.40E-01
1.224E+0	8.48E-01	-2.60E-01
1.225E+0	8.56E-01	-2.40E-01
1.226E+0	8.48E-01	-2.40E-01
1.227E+0	8.56E-01	-2.40E-01
1.228E+0	8.56E-01	-2.40E-01
1.229E+0	8.64E-01	-2.40E-01
1.23E+0	8.72E-01	-2.40E-01
1.231E+0	8.64E-01	-2.40E-01
1.232E+0	8.72E-01	-2.40E-01
1.233E+0	8.72E-01	-2.60E-01
1.234E+0	8.72E-01	-2.60E-01
1.235E+0	8.72E-01	-2.40E-01
1.236E+0	8.72E-01	-2.60E-01
1.237E+0	8.80E-01	-2.60E-01
1.238E+0	8.72E-01	-2.60E-01
1.239E+0	8.72E-01	-2.60E-01
1.24E+0	8.64E-01	-2.40E-01
1.241E+0	8.72E-01	-2.60E-01
1.242E+0	8.72E-01	-2.60E-01
1.243E+0	8.64E-01	-2.40E-01
1.244E+0	8.64E-01	-2.40E-01
1.245E+0	8.64E-01	-2.40E-01
1.246E+0	8.72E-01	-2.60E-01
1.247E+0	8.80E-01	-2.60E-01
1.248E+0	8.80E-01	-2.60E-01
1.249E+0	8.72E-01	-2.60E-01
1.25E+0	8.72E-01	-2.60E-01
1.251E+0	8.72E-01	-2.40E-01
1.252E+0	8.72E-01	-2.40E-01
1.253E+0	8.80E-01	-2.60E-01
1.254E+0	8.72E-01	-2.60E-01
1.255E+0	8.80E-01	-2.60E-01
1.256E+0	8.88E-01	-2.60E-01
1.257E+0	8.72E-01	-2.60E-01
1.258E+0	8.72E-01	-2.60E-01
1.259E+0	8.80E-01	-2.60E-01
1.26E+0	8.72E-01	-2.60E-01
1.261E+0	8.80E-01	-2.60E-01
1.262E+0	8.80E-01	-2.80E-01
1.263E+0	8.64E-01	-2.60E-01
1.264E+0	8.72E-01	-2.80E-01
1.265E+0	8.72E-01	-2.60E-01
1.266E+0	8.64E-01	-2.60E-01
1.267E+0	8.64E-01	-2.60E-01
1.268E+0	8.80E-01	-2.80E-01
1.269E+0	8.80E-01	-2.60E-01
1.27E+0	8.80E-01	-2.60E-01
1.271E+0	8.72E-01	-2.60E-01
1.272E+0	8.72E-01	-2.60E-01
1.273E+0	8.72E-01	-2.60E-01
1.274E+0	8.72E-01	-2.60E-01
1.275E+0	8.64E-01	-2.80E-01
1.276E+0	8.56E-01	-2.80E-01
1.277E+0	8.56E-01	-2.80E-01
1.278E+0	8.56E-01	-2.80E-01
1.279E+0	8.48E-01	-2.80E-01
1.28E+0	8.48E-01	-2.80E-01
1.281E+0	8.40E-01	-2.60E-01
1.282E+0	8.48E-01	-2.80E-01
1.283E+0	8.40E-01	-2.80E-01
1.284E+0	8.40E-01	-2.80E-01
1.285E+0	8.48E-01	-2.80E-01
1.286E+0	8.40E-01	-2.80E-01
1.287E+0	8.48E-01	-2.80E-01
1.288E+0	8.48E-01	-2.80E-01
1.289E+0	8.48E-01	-2.60E-01
1.29E+0	8.48E-01	-2.80E-01
1.291E+0	8.48E-01	-2.80E-01
1.292E+0	8.56E-01	-3.00E-01
1.293E+0	8.56E-01	-2.80E-01
1.294E+0	8.64E-01	-2.80E-01
1.295E+0	8.64E-01	-2.80E-01
1.296E+0	8.72E-01	-2.80E-01
1.297E+0	8.72E-01	-3.00E-01
1.298E+0	8.72E-01	-3.00E-01
1.299E+0	8.72E-01	-2.80E-01
1.3E+0	8.72E-01	-2.80E-01
1.301E+0	8.64E-01	-3.00E-01
1.302E+0	8.64E-01	-2.80E-01
1.303E+0	8.72E-01	-2.80E-01
1.304E+0	8.80E-01	-3.00E-01
1.305E+0	8.72E-01	-2.80E-01
1.306E+0	8.72E-01	-3.00E-01
1.307E+0	8.80E-01	-2.80E-01
1.308E+0	8.88E-01	-3.00E-01
1.309E+0	8.88E-01	-3.00E-01
1.31E+0	8.88E-01	-3.00E-01
1.311E+0	8.96E-01	-2.80E-01
1.312E+0	9.04E-01	-3.00E-01
1.313E+0	9.04E-01	-2.80E-01
1.314E+0	9.04E-01	-3.00E-01
1.315E+0	8.96E-01	-3.00E-01
1.316E+0	8.88E-01	-3.20E-01
1.317E+0	8.96E-01	-3.00E-01
1.318E+0	8.88E-01	-3.00E-01
1.319E+0	8.88E-01	-3.00E-01
1.32E+0	8.80E-01	-3.00E-01
1.321E+0	8.80E-01	-3.00E-01
1.322E+0	8.80E-01	-3.00E-01
1.323E+0	8.80E-01	-3.00E-01
1.324E+0	8.80E-01	-3.00E-01
1.325E+0	8.80E-01	-2.80E-01
1.326E+0	8.80E-01	-2.80E-01
1.327E+0	8.80E-01	-2.80E-01
1.328E+0	8.80E-01	-3.00E-01
1.329E+0	8.80E-01	-3.00E-01
1.33E+0	8.88E-01	-3.00E-01
1.331E+0	8.88E-01	-3.00E-01
1.332E+0	8.88E-01	-3.20E-01
1.333E+0	9.04E-01	-3.00E-01
1.334E+0	8.88E-01	-3.00E-01
1.335E+0	8.96E-01	-3.00E-01
1.336E+0	8.96E-01	-3.00E-01
1.337E+0	8.96E-01	-3.00E-01
1.338E+0	9.04E-01	-3.00E-01
1.339E+0	8.96E-01	-3.00E-01
1.34E+0	9.04E-01	-3.20E-01
1.341E+0	9.04E-01	-3.00E-01
1.342E+0	8.96E-01	-3.20E-01
1.343E+0	9.04E-01	-3.00E-01
1.344E+0	9.12E-01	-3.20E-01
1.345E+0	9.12E-01	-3.20E-01
1.346E+0	9.12E-01	-3.00E-01
1.347E+0	9.20E-01	-3.00E-01
1.348E+0	9.04E-01	-3.20E-01
1.349E+0	8.96E-01	-3.20E-01
1.35E+0	8.88E-01	-3.00E-01
1.351E+0	8.72E-01	-3.20E-01
1.352E+0	8.72E-01	-3.20E-01
1.353E+0	8.80E-01	-3.20E-01
1.354E+0	8.80E-01	-3.20E-01
1.355E+0	8.64E-01	-3.20E-01
1.356E+0	8.64E-01	-3.20E-01
1.357E+0	8.72E-01	-3.20E-01
1.358E+0	8.80E-01	-3.20E-01
1.359E+0	8.80E-01	-3.20E-01
1.36E+0	8.88E-01	-3.40E-01
1.361E+0	8.80E-01	-3.20E-01
1.362E+0	8.88E-01	-3.20E-01
1.363E+0	8.96E-01	-3.20E-01
1.364E+0	8.96E-01	-3.40E-01
1.365E+0	8.96E-01	-3.20E-01
1.366E+0	8.88E-01	-3.20E-01
1.367E+0	8.88E-01	-3.20E-01
1.368E+0	8.80E-01	-3.20E-01
1.369E+0	8.80E-01	-3.00E-01
1.37E+0	8.72E-01	-3.40E-01
1.371E+0	8.72E-01	-3.20E-01
1.372E+0	8.80E-01	-3.40E-01
1.373E+0	8.72E-01	-3.20E-01
1.374E+0	8.80E-01	-3.20E-01
1.375E+0	8.80E-01	-3.20E-01
1.376E+0	8.80E-01	-3.20E-01
1.377E+0	8.80E-01	-3.20E-01
1.378E+0	8.88E-01	-3.40E-01
1.379E+0	8.80E-01	-3.20E-01
1.38E+0	8.80E-01	-3.40E-01
1.381E+0	8.80E-01	-3.20E-01
1.382E+0	8.88E-01	-3.40E-01
1.383E+0	8.96E-01	-3.40E-01
1.384E+0	8.96E-01	-3.20E-01
1.385E+0	8.96E-01	-3.20E-01
1.386E+0	8.96E-01	-3.40E-01
1.387E+0	8.96E-01	-3.40E-01
1.388E+0	8.96E-01	-3.40E-01
1.389E+0	8.88E-01	-3.40E-01
1.39E+0	8.96E-01	-3.40E-01
1.391E+0	8.96E-01	-3.40E-01
1.392E+0	9.04E-01	-3.20E-01
1.393E+0	9.04E-01	-3.40E-01
1.394E+0	9.04E-01	-3.40E-01
1.395E+0	9.04E-01	-3.40E-01
1.396E+0	9.12E-01	-3.40E-01
1.397E+0	9.04E-01	-3.40E-01
1.398E+0	9.04E-01	-3.40E-01
1.399E+0	9.12E-01	-3.60E-01
1.4E+0	9.12E-01	-3.40E-01
1.401E+0	9.20E-01	-3.60E-01
1.402E+0	9.12E-01	-3.40E-01
1.403E+0	9.12E-01	-3.60E-01
1.404E+0	9.28E-01	-3.40E-01
1.405E+0	9.28E-01	-3.60E-01
1.406E+0	9.28E-01	-3.60E-01
1.407E+0	9.12E-01	-3.40E-01
1.408E+0	9.12E-01	-3.60E-01
1.409E+0	9.12E-01	-3.60E-01
1.41E+0	9.20E-01	-3.40E-01
1.411E+0	9.20E-01	-3.60E-01
1.412E+0	9.20E-01	-3.40E-01
1.413E+0	9.12E-01	-3.40E-01
1.414E+0	9.04E-01	-3.60E-01
1.415E+0	8.88E-01	-3.40E-01
1.416E+0	8.96E-01	-3.40E-01
1.417E+0	8.96E-01	-3.40E-01
1.418E+0	8.96E-01	-3.60E-01
1.419E+0	8.96E-01	-3.60E-01
1.42E+0	9.04E-01	-3.40E-01
1.421E+0	9.12E-01	-3.60E-01
1.422E+0	9.12E-01	-3.60E-01
1.423E+0	9.04E-01	-3.40E-01
1.424E+0	9.04E-01	-3.60E-01
1.425E+0	8.96E-01	-3.60E-01
1.426E+0	9.04E-01	-3.40E-01
1.427E+0	8.96E-01	-3.60E-01
1.428E+0	8.96E-01	-3.60E-01
1.429E+0	9.04E-01	-3.80E-01
1.43E+0	9.04E-01	-3.80E-01
1.431E+0	9.04E-01	-3.40E-01
1.432E+0	8.96E-01	-3.60E-01
1.433E+0	9.04E-01	-3.80E-01
1.434E+0	9.04E-01	-3.60E-01
1.435E+0	9.12E-01	-3.60E-01
1.436E+0	9.12E-01	-3.60E-01
1.437E+0	9.12E-01	-3.60E-01
1.438E+0	9.20E-01	-3.60E-01
1.439E+0	9.28E-01	-3.60E-01
1.44E+0	9.36E-01	-3.80E-01
1.441E+0	9.36E-01	-3.60E-01
1.442E+0	9.28E-01	-3.80E-01
1.443E+0	9.20E-01	-3.80E-01
1.444E+0	9.36E-01	-3.60E-01
1.445E+0	9.28E-01	-3.80E-01
1.446E+0	9.28E-01	-3.80E-01
1.447E+0	9.28E-01	-3.80E-01
1.448E+0	9.36E-01	-3.60E-01
1.449E+0	9.28E-01	-3.60E-01
1.45E+0	9.44E-01	-3.60E-01
1.451E+0	9.36E-01	-3.80E-01
1.452E+0	9.44E-01	-4.00E-01
1.453E+0	9.44E-01	-3.80E-01
1.454E+0	9.36E-01	-3.80E-01
1.455E+0	9.44E-01	-3.80E-01
1.456E+0	9.44E-01	-3.80E-01
1.457E+0	9.36E-01	-3.80E-01
1.458E+0	9.36E-01	-3.80E-01
1.459E+0	9.28E-01	-3.80E-01
1.46E+0	9.36E-01	-3.80E-01
1.461E+0	9.20E-01	-3.80E-01
1.462E+0	9.12E-01	-3.80E-01
1.463E+0	9.20E-01	-3.80E-01
1.464E+0	9.28E-01	-3.80E-01
1.465E+0	9.20E-01	-3.80E-01
1.466E+0	9.20E-01	-3.80E-01
1.467E+0	9.20E-01	-3.80E-01
1.468E+0	9.28E-01	-3.80E-01
1.469E+0	9.36E-01	-3.80E-01
1.47E+0	9.44E-01	-4.00E-01
1.471E+0	9.36E-01	-3.80E-01
1.472E+0	9.36E-01	-4.00E-01
1.473E+0	9.36E-01	-4.00E-01
1.474E+0	9.36E-01	-4.00E-01
1.475E+0	9.28E-01	-3.80E-01
1.476E+0	9.28E-01	-3.80E-01
1.477E+0	9.36E-01	-3.80E-01
1.478E+0	9.44E-01	-3.80E-01
1.479E+0	9.52E-01	-4.00E-01
1.48E+0	9.36E-01	-3.80E-01
1.481E+0	9.36E-01	-4.00E-01
1.482E+0	9.28E-01	-4.00E-01
1.483E+0	9.28E-01	-4.00E-01
1.484E+0	9.28E-01	-4.00E-01
1.485E+0	9.36E-01	-4.00E-01
1.486E+0	9.36E-01	-4.00E-01
1.487E+0	9.36E-01	-4.00E-01
1.488E+0	9.36E-01	-4.00E-01
1.489E+0	9.44E-01	-4.00E-01
1.49E+0	9.44E-01	-4.00E-01
1.491E+0	9.44E-01	-4.00E-01
1.492E+0	9.36E-01	-4.00E-01
1.493E+0	9.36E-01	-3.80E-01
1.494E+0	9.36E-01	-4.20E-01
1.495E+0	9.36E-01	-4.00E-01
1.496E+0	9.36E-01	-4.00E-01
1.497E+0	9.28E-01	-4.00E-01
1.498E+0	9.28E-01	-4.20E-01
1.499E+0	9.28E-01	-4.00E-01
1.5E+0	9.28E-01	-4.20E-01
1.501E+0	9.28E-01	-4.00E-01
1.502E+0	9.28E-01	-4.00E-01
1.503E+0	9.20E-01	-4.20E-01
1.504E+0	9.28E-01	-4.00E-01
1.505E+0	9.28E-01	-4.00E-01
1.506E+0	9.20E-01	-4.20E-01
1.507E+0	9.20E-01	-4.00E-01
1.508E+0	9.20E-01	-4.20E-01
1.509E+0	9.20E-01	-4.20E-01
1.51E+0	9.28E-01	-4.20E-01
1.511E+0	9.36E-01	-4.00E-01
1.512E+0	9.36E-01	-4.20E-01
1.513E+0	9.44E-01	-4.20E-01
1.514E+0	9.36E-01	-4.00E-01
1.515E+0	9.28E-01	-4.20E-01
1.516E+0	9.28E-01	-4.20E-01
1.517E+0	9.20E-01	-4.20E-01
1.518E+0	9.12E-01	-4.00E-01
1.519E+0	9.20E-01	-4.00E-01
1.52E+0	9.12E-01	-4.20E-01
1.521E+0	9.12E-01	-4.00E-01
1.522E+0	9.20E-01	-4.20E-01
1.523E+0	9.20E-01	-4.00E-01
1.524E+0	9.20E-01	-4.20E-01
1.525E+0	9.20E-01	-4.20E-01
1.526E+0	9.36E-01	-4.20E-01
1.527E+0	9.28E-01	-4.20E-01
1.528E+0	9.28E-01	-4.20E-01
1.529E+0	9.28E-01	-4.00E-01
1.53E+0	9.20E-01	-4.20E-01
1.531E+0	9.28E-01	-4.20E-01
1.532E+0	9.36E-01	-4.40E-01
1.533E+0	9.20E-01	-4.20E-01
1.534E+0	9.28E-01	-4.20E-01
1.535E+0	9.36E-01	-4.20E-01
1.536E+0	9.36E-01	-4.40E-01
1.537E+0	9.36E-01	-4.40E-01
1.538E+0	9.44E-01	-4.40E-01
1.539E+0	9.44E-01	-4.20E-01
1.54E+0	9.52E-01	-4.40E-01
1.541E+0	9.36E-01	-4.40E-01
1.542E+0	9.36E-01	-4.40E-01
1.543E+0	9.28E-01	-4.20E-01
1.544E+0	9.28E-01	-4.20E-01
1.545E+0	9.28E-01	-4.40E-01
1.546E+0	9.28E-01	-4.40E-01
1.547E+0	9.28E-01	-4.40E-01
1.548E+0	9.20E-01	-4.40E-01
1.549E+0	9.20E-01	-4.40E-01
1.55E+0	9.20E-01	-4.40E-01
1.551E+0	9.20E-01	-4.40E-01
1.552E+0	9.12E-01	-4.40E-01
1.553E+0	9.12E-01	-4.40E-01
1.554E+0	9.04E-01	-4.20E-01
1.555E+0	9.04E-01	-4.40E-01
1.556E+0	9.04E-01	-4.40E-01
1.557E+0	9.12E-01	-4.40E-01
1.558E+0	9.20E-01	-4.40E-01
1.559E+0	9.20E-01	-4.40E-01
1.56E+0	9.28E-01	-4.40E-01
1.561E+0	9.28E-01	-4.40E-01
1.562E+0	9.28E-01	-4.40E-01
1.563E+0	9.36E-01	-4.40E-01
1.564E+0	9.28E-01	-4.40E-01
1.565E+0	9.36E-01	-4.40E-01
1.566E+0	9.36E-01	-4.40E-01
1.567E+0	9.28E-01	-4.40E-01
1.568E+0	9.20E-01	-4.40E-01
1.569E+0	9.20E-01	-4.40E-01
1.57E+0	9.20E-01	-4.60E-01
1.571E+0	9.20E-01	-4.60E-01
1.572E+0	9.28E-01	-4.40E-01
1.573E+0	9.28E-01	-4.60E-01
1.574E+0	9.28E-01	-4.40E-01
1.575E+0	9.28E-01	-4.60E-01
1.576E+0	9.28E-01	-4.60E-01
1.577E+0	9.36E-01	-4.40E-01
1.578E+0	9.20E-01	-4.60E-01
1.579E+0	9.04E-01	-4.40E-01
1.58E+0	9.04E-01	-4.60E-01
1.581E+0	9.04E-01	-4.60E-01
1.582E+0	9.04E-01	-4.40E-01
1.583E+0	9.04E-01	-4.60E-01
1.584E+0	9.04E-01	-4.60E-01
1.585E+0	9.04E-01	-4.60E-01
1.586E+0	9.04E-01	-4.60E-01
1.587E+0	9.04E-01	-4.60E-01
1.588E+0	9.04E-01	-4.60E-01
1.589E+0	8.96E-01	-4.40E-01
1.59E+0	8.96E-01	-4.60E-01
1.591E+0	8.88E-01	-4.40E-01
1.592E+0	8.88E-01	-4.40E-01
1.593E+0	8.96E-01	-4.60E-01
1.594E+0	8.96E-01	-4.60E-01
1.595E+0	8.96E-01	-4.40E-01
1.596E+0	8.96E-01	-4.40E-01
1.597E+0	9.04E-01	-4.80E-01
1.598E+0	9.04E-01	-4.60E-01
1.599E+0	9.04E-01	-4.60E-01
1.6E+0	9.04E-01	-4.60E-01
1.601E+0	9.12E-01	-4.80E-01
1.602E+0	9.12E-01	-4.60E-01
1.603E+0	9.12E-01	-4.60E-01
1.604E+0	9.20E-01	-4.60E-01
1.605E+0	9.20E-01	-4.60E-01
1.606E+0	9.28E-01	-4.60E-01
1.607E+0	9.28E-01	-4.80E-01
1.608E+0	9.28E-01	-4.60E-01
1.609E+0	9.28E-01	-4.80E-01
1.61E+0	9.36E-01	-4.80E-01
1.611E+0	9.36E-01	-4.60E-01
1.612E+0	9.28E-01	-4.60E-01
1.613E+0	9.36E-01	-4.80E-01
1.614E+0	9.36E-01	-4.60E-01
1.615E+0	9.28E-01	-4.60E-01
1.616E+0	9.36E-01	-4.60E-01
1.617E+0	9.28E-01	-4.80E-01
1.618E+0	9.28E-01	-4.80E-01
1.619E+0	9.36E-01	-4.60E-01
1.62E+0	9.28E-01	-4.80E-01
1.621E+0	9.36E-01	-4.80E-01
1.622E+0	9.44E-01	-4.80E-01
1.623E+0	9.44E-01	-4.80E-01
1.624E+0	9.44E-01	-4.60E-01
1.625E+0	9.52E-01	-4.60E-01
1.626E+0	9.44E-01	-4.80E-01
1.627E+0	9.52E-01	-4.60E-01
1.628E+0	9.52E-01	-4.80E-01
1.629E+0	9.44E-01	-4.80E-01
1.63E+0	9.44E-01	-5.00E-01
1.631E+0	9.52E-01	-4.80E-01
1.632E+0	9.60E-01	-5.00E-01
1.633E+0	9.52E-01	-4.80E-01
1.634E+0	9.60E-01	-4.80E-01
1.635E+0	9.60E-01	-4.80E-01
1.636E+0	9.52E-01	-5.00E-01
1.637E+0	9.44E-01	-4.80E-01
1.638E+0	9.44E-01	-4.80E-01
1.639E+0	9.52E-01	-4.80E-01
1.64E+0	9.52E-01	-5.00E-01
1.641E+0	9.60E-01	-4.80E-01
1.642E+0	9.52E-01	-5.00E-01
1.643E+0	9.52E-01	-4.80E-01
1.644E+0	9.52E-01	-4.80E-01
1.645E+0	9.44E-01	-4.60E-01
1.646E+0	9.44E-01	-5.00E-01
1.647E+0	9.52E-01	-5.00E-01
1.648E+0	9.60E-01	-5.00E-01
1.649E+0	9.60E-01	-5.00E-01
1.65E+0	9.52E-01	-5.00E-01
1.651E+0	9.68E-01	-5.00E-01
1.652E+0	9.68E-01	-5.00E-01
1.653E+0	9.76E-01	-5.00E-01
1.654E+0	9.68E-01	-5.00E-01
1.655E+0	9.68E-01	-5.00E-01
1.656E+0	9.60E-01	-5.00E-01
1.657E+0	9.60E-01	-5.00E-01
1.658E+0	9.68E-01	-5.00E-01
1.659E+0	9.76E-01	-5.00E-01
1.66E+0	9.76E-01	-5.00E-01
1.661E+0	9.68E-01	-4.80E-01
1.662E+0	9.60E-01	-5.00E-01
1.663E+0	9.60E-01	-5.00E-01
1.664E+0	9.60E-01	-5.00E-01
1.665E+0	9.60E-01	-5.00E-01
1.666E+0	9.60E-01	-5.00E-01
1.667E+0	9.52E-01	-5.00E-01
1.668E+0	9.52E-01	-5.00E-01
1.669E+0	9.60E-01	-5.00E-01
1.67E+0	9.52E-01	-5.20E-01
1.671E+0	9.44E-01	-5.00E-01
1.672E+0	9.44E-01	-5.00E-01
1.673E+0	9.36E-01	-5.00E-01
1.674E+0	9.36E-01	-5.20E-01
1.675E+0	9.36E-01	-5.00E-01
1.676E+0	9.36E-01	-5.20E-01
1.677E+0	9.36E-01	-5.00E-01
1.678E+0	9.36E-01	-5.00E-01
1.679E+0	9.20E-01	-5.00E-01
1.68E+0	9.36E-01	-5.20E-01
1.681E+0	9.28E-01	-5.20E-01
1.682E+0	9.36E-01	-5.20E-01
1.683E+0	9.44E-01	-5.00E-01
1.684E+0	9.52E-01	-5.20E-01
1.685E+0	9.52E-01	-5.20E-01
1.686E+0	9.52E-01	-5.20E-01
1.687E+0	9.44E-01	-5.00E-01
1.688E+0	9.36E-01	-5.20E-01
1.689E+0	9.36E-01	-5.20E-01
1.69E+0	9.28E-01	-5.20E-01
1.691E+0	9.36E-01	-5.20E-01
1.692E+0	9.44E-01	-5.00E-01
1.693E+0	9.36E-01	-5.40E-01
1.694E+0	9.44E-01	-5.00E-01
1.695E+0	9.36E-01	-5.20E-01
1.696E+0	9.36E-01	-5.40E-01
1.697E+0	9.36E-01	-5.20E-01
1.698E+0	9.44E-01	-5.40E-01
1.699E+0	9.44E-01	-5.20E-01
1.7E+0	9.44E-01	-5.20E-01
1.701E+0	9.44E-01	-5.20E-01
1.702E+0	9.52E-01	-5.20E-01
1.703E+0	9.44E-01	-5.40E-01
1.704E+0	9.52E-01	-5.20E-01
1.705E+0	9.36E-01	-5.40E-01
1.706E+0	9.36E-01	-5.40E-01
1.707E+0	9.44E-01	-5.20E-01
1.708E+0	9.44E-01	-5.40E-01
1.709E+0	9.44E-01	-5.20E-01
1.71E+0	9.44E-01	-5.20E-01
1.711E+0	9.44E-01	-5.40E-01
1.712E+0	9.52E-01	-5.40E-01
1.713E+0	9.36E-01	-5.20E-01
1.714E+0	9.36E-01	-5.40E-01
1.715E+0	9.36E-01	-5.40E-01
1.716E+0	9.36E-01	-5.20E-01
1.717E+0	9.36E-01	-5.20E-01
1.718E+0	9.36E-01	-5.40E-01
1.719E+0	9.28E-01	-5.40E-01
1.72E+0	9.28E-01	-5.20E-01
1.721E+0	9.28E-01	-5.20E-01
1.722E+0	9.28E-01	-5.40E-01
1.723E+0	9.20E-01	-5.40E-01
1.724E+0	9.20E-01	-5.40E-01
1.725E+0	9.28E-01	-5.40E-01
1.726E+0	9.20E-01	-5.40E-01
1.727E+0	9.20E-01	-5.20E-01
1.728E+0	9.12E-01	-5.40E-01
1.729E+0	9.12E-01	-5.40E-01
1.73E+0	9.12E-01	-5.40E-01
1.731E+0	9.12E-01	-5.40E-01
1.732E+0	9.12E-01	-5.60E-01
1.733E+0	8.96E-01	-5.40E-01
1.734E+0	9.04E-01	-5.40E-01
1.735E+0	9.12E-01	-5.40E-01
1.736E+0	9.04E-01	-5.40E-01
1.737E+0	9.12E-01	-5.40E-01
1.738E+0	9.12E-01	-5.60E-01
1.739E+0	9.12E-01	-5.40E-01
1.74E+0	9.12E-01	-5.40E-01
1.741E+0	9.04E-01	-5.40E-01
1.742E+0	9.12E-01	-5.60E-01
1.743E+0	9.12E-01	-5.40E-01
1.744E+0	9.12E-01	-5.60E-01
1.745E+0	9.12E-01	-5.40E-01
1.746E+0	9.12E-01	-5.40E-01
1.747E+0	9.04E-01	-5.60E-01
1.748E+0	9.12E-01	-5.60E-01
1.749E+0	9.04E-01	-5.60E-01
1.75E+0	9.12E-01	-5.40E-01
1.751E+0	9.20E-01	-5.60E-01
1.752E+0	9.12E-01	-5.60E-01
1.753E+0	9.28E-01	-5.40E-01
1.754E+0	9.44E-01	-5.80E-01
1.755E+0	9.44E-01	-5.40E-01
1.756E+0	9.44E-01	-5.60E-01
1.757E+0	9.44E-01	-5.60E-01
1.758E+0	9.44E-01	-5.60E-01
1.759E+0	9.52E-01	-5.60E-01
1.76E+0	9.60E-01	-5.60E-01
1.761E+0	9.60E-01	-5.40E-01
1.762E+0	9.52E-01	-5.60E-01
1.763E+0	9.52E-01	-5.40E-01
1.764E+0	9.52E-01	-5.80E-01
1.765E+0	9.52E-01	-5.60E-01
1.766E+0	9.44E-01	-5.60E-01
1.767E+0	9.36E-01	-5.60E-01
1.768E+0	9.44E-01	-5.80E-01
1.769E+0	9.44E-01	-5.60E-01
1.77E+0	9.44E-01	-5.60E-01
1.771E+0	9.44E-01	-5.60E-01
1.772E+0	9.44E-01	-5.60E-01
1.773E+0	9.44E-01	-5.80E-01
1.774E+0	9.44E-01	-5.80E-01
1.775E+0	9.36E-01	-5.60E-01
1.776E+0	9.36E-01	-5.60E-01
1.777E+0	9.44E-01	-5.80E-01
1.778E+0	9.52E-01	-5.60E-01
1.779E+0	9.44E-01	-5.80E-01
1.78E+0	9.36E-01	-5.80E-01
1.781E+0	9.28E-01	-5.80E-01
1.782E+0	9.36E-01	-5.80E-01
1.783E+0	9.36E-01	-5.60E-01
1.784E+0	9.28E-01	-5.80E-01
1.785E+0	9.36E-01	-5.80E-01
1.786E+0	9.36E-01	-5.80E-01
1.787E+0	9.44E-01	-5.60E-01
1.788E+0	9.44E-01	-5.80E-01
1.789E+0	9.52E-01	-5.80E-01
1.79E+0	9.52E-01	-5.80E-01
1.791E+0	9.52E-01	-5.80E-01
1.792E+0	9.52E-01	-5.80E-01
1.793E+0	9.60E-01	-5.80E-01
1.794E+0	9.60E-01	-6.00E-01
1.795E+0	9.60E-01	-5.80E-01
1.796E+0	9.60E-01	-5.80E-01
1.797E+0	9.60E-01	-5.80E-01
1.798E+0	9.60E-01	-6.00E-01
1.799E+0	9.60E-01	-5.80E-01
1.8E+0	9.68E-01	-5.80E-01
1.801E+0	9.76E-01	-5.80E-01
1.802E+0	9.68E-01	-5.80E-01
1.803E+0	9.60E-01	-5.80E-01
1.804E+0	9.52E-01	-5.80E-01
1.805E+0	9.60E-01	-5.60E-01
1.806E+0	9.60E-01	-6.00E-01
1.807E+0	9.60E-01	-6.00E-01
1.808E+0	9.60E-01	-6.00E-01
1.809E+0	9.60E-01	-5.80E-01
1.81E+0	9.60E-01	-6.00E-01
1.811E+0	9.52E-01	-5.80E-01
1.812E+0	9.36E-01	-6.00E-01
1.813E+0	9.44E-01	-5.80E-01
1.814E+0	9.44E-01	-6.00E-01
1.815E+0	9.44E-01	-5.80E-01
1.816E+0	9.52E-01	-5.80E-01
1.817E+0	9.52E-01	-5.80E-01
1.818E+0	9.44E-01	-6.00E-01
1.819E+0	9.52E-01	-5.80E-01
1.82E+0	9.52E-01	-6.00E-01
1.821E+0	9.44E-01	-6.00E-01
1.822E+0	9.52E-01	-6.00E-01
1.823E+0	9.52E-01	-6.00E-01
1.824E+0	9.44E-01	-6.00E-01
1.825E+0	9.44E-01	-6.00E-01
1.826E+0	9.36E-01	-6.00E-01
1.827E+0	9.28E-01	-6.00E-01
1.828E+0	9.28E-01	-6.00E-01
1.829E+0	9.20E-01	-5.80E-01
1.83E+0	9.36E-01	-6.00E-01
1.831E+0	9.36E-01	-5.80E-01
1.832E+0	9.36E-01	-6.20E-01
1.833E+0	9.28E-01	-6.00E-01
1.834E+0	9.36E-01	-6.20E-01
1.835E+0	9.36E-01	-6.00E-01
1.836E+0	9.36E-01	-6.00E-01
1.837E+0	9.36E-01	-6.00E-01
1.838E+0	9.44E-01	-6.00E-01
1.839E+0	9.44E-01	-6.00E-01
1.84E+0	9.44E-01	-6.20E-01
1.841E+0	9.44E-01	-6.00E-01
1.842E+0	9.60E-01	-6.00E-01
1.843E+0	9.60E-01	-6.00E-01
1.844E+0	9.60E-01	-6.20E-01
1.845E+0	9.60E-01	-6.00E-01
1.846E+0	9.60E-01	-6.20E-01
1.847E+0	9.60E-01	-6.00E-01
1.848E+0	9.60E-01	-6.20E-01
1.849E+0	9.60E-01	-6.00E-01
1.85E+0	9.52E-01	-6.00E-01
1.851E+0	9.52E-01	-6.20E-01
1.852E+0	9.60E-01	-6.20E-01
1.853E+0	9.60E-01	-6.20E-01
1.854E+0	9.52E-01	-6.20E-01
1.855E+0	9.52E-01	-6.20E-01
1.856E+0	9.52E-01	-6.20E-01
1.857E+0	9.60E-01	-6.20E-01
1.858E+0	9.68E-01	-6.20E-01
1.859E+0	9.60E-01	-6.20E-01
1.86E+0	9.52E-01	-6.20E-01
1.861E+0	9.44E-01	-6.20E-01
1.862E+0	9.44E-01	-6.20E-01
1.863E+0	9.44E-01	-6.40E-01
1.864E+0	9.52E-01	-6.20E-01
1.865E+0	9.44E-01	-6.20E-01
1.866E+0	9.44E-01	-6.20E-01
1.867E+0	9.36E-01	-6.20E-01
1.868E+0	9.36E-01	-6.20E-01
1.869E+0	9.44E-01	-6.20E-01
1.87E+0	9.60E-01	-6.20E-01
1.871E+0	9.60E-01	-6.20E-01
1.872E+0	9.52E-01	-6.20E-01
1.873E+0	9.52E-01	-6.20E-01
1.874E+0	9.44E-01	-6.20E-01
1.875E+0	9.44E-01	-6.20E-01
1.876E+0	9.36E-01	-6.40E-01
1.877E+0	9.36E-01	-6.20E-01
1.878E+0	9.44E-01	-6.40E-01
1.879E+0	9.52E-01	-6.20E-01
1.88E+0	9.52E-01	-6.20E-01
1.881E+0	9.36E-01	-6.20E-01
1.882E+0	9.44E-01	-6.40E-01
1.883E+0	9.44E-01	-6.40E-01
1.884E+0	9.52E-01	-6.40E-01
1.885E+0	9.60E-01	-6.40E-01
1.886E+0	9.60E-01	-6.20E-01
1.887E+0	9.52E-01	-6.20E-01
1.888E+0	9.60E-01	-6.40E-01
1.889E+0	9.44E-01	-6.40E-01
1.89E+0	9.52E-01	-6.40E-01
1.891E+0	9.52E-01	-6.40E-01
1.892E+0	9.52E-01	-6.20E-01
1.893E+0	9.52E-01	-6.40E-01
1.894E+0	9.60E-01	-6.40E-01
1.895E+0	9.52E-01	-6.40E-01
1.896E+0	9.44E-01	-6.40E-01
1.897E+0	9.28E-01	-6.40E-01
1.898E+0	9.20E-01	-6.40E-01
1.899E+0	9.20E-01	-6.40E-01
1.9E+0	9.36E-01	-6.40E-01
1.901E+0	9.36E-01	-6.40E-01
1.902E+0	9.44E-01	-6.40E-01
1.903E+0	9.52E-01	-6.40E-01
1.904E+0	9.52E-01	-6.40E-01
1.905E+0	9.52E-01	-6.60E-01
1.906E+0	9.44E-01	-6.60E-01
1.907E+0	9.44E-01	-6.40E-01
1.908E+0	9.28E-01	-6.40E-01
1.909E+0	9.28E-01	-6.20E-01
1.91E+0	9.36E-01	-6.40E-01
1.911E+0	9.28E-01	-6.40E-01
1.912E+0	9.28E-01	-6.60E-01
1.913E+0	9.28E-01	-6.60E-01
1.914E+0	9.36E-01	-6.40E-01
1.915E+0	9.44E-01	-6.40E-01
1.916E+0	9.44E-01	-6.60E-01
1.917E+0	9.44E-01	-6.40E-01
1.918E+0	9.52E-01	-6.60E-01
1.919E+0	9.60E-01	-6.60E-01
1.92E+0	9.52E-01	-6.60E-01
1.921E+0	9.60E-01	-6.40E-01
1.922E+0	9.60E-01	-6.60E-01
1.923E+0	9.52E-01	-6.60E-01
1.924E+0	9.60E-01	-6.60E-01
1.925E+0	9.60E-01	-6.60E-01
1.926E+0	9.60E-01	-6.60E-01
1.927E+0	9.52E-01	-6.60E-01
1.928E+0	9.60E-01	-6.60E-01
1.929E+0	9.52E-01	-6.80E-01
1.93E+0	9.52E-01	-6.60E-01
1.931E+0	9.52E-01	-6.60E-01
1.932E+0	9.60E-01	-6.60E-01
1.933E+0	9.60E-01	-6.60E-01
1.934E+0	9.76E-01	-6.80E-01
1.935E+0	9.68E-01	-6.80E-01
1.936E+0	9.68E-01	-6.60E-01
1.937E+0	9.76E-01	-6.60E-01
1.938E+0	9.84E-01	-6.60E-01
1.939E+0	9.76E-01	-6.60E-01
1.94E+0	9.84E-01	-6.60E-01
1.941E+0	9.84E-01	-6.60E-01
1.942E+0	9.76E-01	-6.60E-01
1.943E+0	9.76E-01	-6.80E-01
1.944E+0	9.84E-01	-6.60E-01
1.945E+0	9.84E-01	-6.60E-01
1.946E+0	9.68E-01	-6.80E-01
1.947E+0	9.76E-01	-6.80E-01
1.948E+0	9.76E-01	-6.80E-01
1.949E+0	9.76E-01	-6.60E-01
1.95E+0	9.84E-01	-6.80E-01
1.951E+0	9.76E-01	-6.60E-01
1.952E+0	9.76E-01	-6.80E-01
1.953E+0	9.60E-01	-6.80E-01
1.954E+0	9.60E-01	-6.80E-01
1.955E+0	9.60E-01	-6.80E-01
1.956E+0	9.60E-01	-7.00E-01
1.957E+0	9.52E-01	-6.80E-01
1.958E+0	9.52E-01	-6.80E-01
1.959E+0	9.52E-01	-6.80E-01
1.96E+0	9.44E-01	-6.80E-01
1.961E+0	9.44E-01	-6.80E-01
1.962E+0	9.44E-01	-6.80E-01
1.963E+0	9.52E-01	-6.80E-01
1.964E+0	9.60E-01	-6.80E-01
1.965E+0	9.60E-01	-7.00E-01
1.966E+0	9.60E-01	-6.80E-01
1.967E+0	9.68E-01	-6.80E-01
1.968E+0	9.76E-01	-6.80E-01
1.969E+0	9.68E-01	-6.80E-01
1.97E+0	9.68E-01	-6.80E-01
1.971E+0	9.68E-01	-6.80E-01
1.972E+0	9.68E-01	-7.00E-01
1.973E+0	9.60E-01	-6.80E-01
1.974E+0	9.60E-01	-7.00E-01
1.975E+0	9.60E-01	-6.80E-01
1.976E+0	9.60E-01	-6.80E-01
1.977E+0	9.60E-01	-6.80E-01
1.978E+0	9.52E-01	-7.00E-01
1.979E+0	9.60E-01	-7.00E-01
1.98E+0	9.60E-01	-7.00E-01
1.981E+0	9.68E-01	-6.80E-01
1.982E+0	9.60E-01	-7.00E-01
1.983E+0	9.60E-01	-6.80E-01
1.984E+0	9.60E-01	-7.00E-01
1.985E+0	9.60E-01	-7.00E-01
1.986E+0	9.44E-01	-7.00E-01
1.987E+0	9.44E-01	-6.80E-01
1.988E+0	9.44E-01	-7.00E-01
1.989E+0	9.36E-01	-7.00E-01
1.99E+0	9.28E-01	-7.00E-01
1.991E+0	9.44E-01	-7.00E-01
1.992E+0	9.44E-01	-7.00E-01
1.993E+0	9.44E-01	-6.80E-01
1.994E+0	9.44E-01	-7.00E-01
1.995E+0	9.36E-01	-7.00E-01
1.996E+0	9.36E-01	-7.00E-01
1.997E+0	9.36E-01	-7.00E-01
1.998E+0	9.44E-01	-7.00E-01
1.999E+0	9.36E-01	-7.00E-01
2.E+0	9.44E-01	-7.20E-01
2.001E+0	9.44E-01	-7.00E-01
2.002E+0	9.44E-01	-7.00E-01
2.003E+0	9.44E-01	-7.20E-01
2.004E+0	9.44E-01	-7.00E-01
2.005E+0	9.36E-01	-7.20E-01
2.006E+0	9.36E-01	-7.20E-01
2.007E+0	9.36E-01	-7.00E-01
2.008E+0	9.36E-01	-7.20E-01
2.009E+0	9.28E-01	-7.00E-01
2.01E+0	9.28E-01	-7.20E-01
2.011E+0	9.28E-01	-7.00E-01
2.012E+0	9.36E-01	-7.20E-01
2.013E+0	9.28E-01	-7.00E-01
2.014E+0	9.44E-01	-7.20E-01
2.015E+0	9.36E-01	-7.20E-01
2.016E+0	9.36E-01	-7.20E-01
2.017E+0	9.36E-01	-7.20E-01
2.018E+0	9.52E-01	-7.00E-01
2.019E+0	9.44E-01	-7.00E-01
2.02E+0	9.44E-01	-7.00E-01
2.021E+0	9.36E-01	-7.20E-01
2.022E+0	9.36E-01	-7.00E-01
2.023E+0	9.28E-01	-7.20E-01
2.024E+0	9.28E-01	-7.20E-01
2.025E+0	9.36E-01	-7.00E-01
2.026E+0	9.36E-01	-7.20E-01
2.027E+0	9.36E-01	-7.00E-01
2.028E+0	9.44E-01	-7.20E-01
2.029E+0	9.52E-01	-7.20E-01
2.03E+0	9.44E-01	-7.20E-01
2.031E+0	9.52E-01	-7.20E-01
2.032E+0	9.44E-01	-7.20E-01
2.033E+0	9.52E-01	-7.40E-01
2.034E+0	9.52E-01	-7.20E-01
2.035E+0	9.52E-01	-7.20E-01
2.036E+0	9.52E-01	-7.20E-01
2.037E+0	9.52E-01	-7.20E-01
2.038E+0	9.52E-01	-7.20E-01
2.039E+0	9.52E-01	-7.40E-01
2.04E+0	9.52E-01	-7.20E-01
2.041E+0	9.44E-01	-7.20E-01
2.042E+0	9.44E-01	-7.20E-01
2.043E+0	9.52E-01	-7.20E-01
2.044E+0	9.60E-01	-7.20E-01
2.045E+0	9.60E-01	-7.20E-01
