20_1		143.819		3.8
20_2		149.985		3.8
20_3		149.268		3.8
20_4		150.49		3.8
20_5		149.436		3.8
20_6		146.678		3.8
20_7		140.835		3.8
20_8		141.936		3.8
20_9		148.569		3.8
20_10		146.591		3.8
20_11		142.526		3.8
20_12		147.007		3.8
20_13		153.965		3.8
20_14		149.565		3.8
