<?xml version="1.0" encoding="UTF-8" standalone="no"?>
<!-- Created with Inkscape (http://www.inkscape.org/) -->

<svg
   xmlns:dc="http://purl.org/dc/elements/1.1/"
   xmlns:cc="http://creativecommons.org/ns#"
   xmlns:rdf="http://www.w3.org/1999/02/22-rdf-syntax-ns#"
   xmlns:svg="http://www.w3.org/2000/svg"
   xmlns="http://www.w3.org/2000/svg"
   xmlns:sodipodi="http://sodipodi.sourceforge.net/DTD/sodipodi-0.dtd"
   xmlns:inkscape="http://www.inkscape.org/namespaces/inkscape"
   width="210mm"
   height="297mm"
   viewBox="0 0 210 297"
   version="1.1"
   id="svg8"
   inkscape:version="0.92.3 (2405546, 2018-03-11)"
   sodipodi:docname="EVOLUTIVOA5_01.svg"
   inkscape:export-filename="/home/simoes/Documents/EVOLUTIVOA5_01.png"
   inkscape:export-xdpi="96"
   inkscape:export-ydpi="96">
  <defs
     id="defs2" />
  <sodipodi:namedview
     id="base"
     pagecolor="#ffffff"
     bordercolor="#666666"
     borderopacity="1.0"
     inkscape:pageopacity="0.0"
     inkscape:pageshadow="2"
     inkscape:zoom="0.35"
     inkscape:cx="-171.10855"
     inkscape:cy="1136.9894"
     inkscape:document-units="mm"
     inkscape:current-layer="layer1"
     showgrid="false"
     inkscape:window-width="1366"
     inkscape:window-height="741"
     inkscape:window-x="0"
     inkscape:window-y="27"
     inkscape:window-maximized="1" />
  <metadata
     id="metadata5">
    <rdf:RDF>
      <cc:Work
         rdf:about="">
        <dc:format>image/svg+xml</dc:format>
        <dc:type
           rdf:resource="http://purl.org/dc/dcmitype/StillImage" />
        <dc:title />
      </cc:Work>
    </rdf:RDF>
  </metadata>
  <g
     inkscape:label="Layer 1"
     inkscape:groupmode="layer"
     id="layer1">
    <rect
       style="fill:#ff0000;stroke-width:0.26458332"
       id="rect10"
       width="190.02863"
       height="8.5526247"
       x="12.027128"
       y="23.048735" />
    <text
       xml:space="preserve"
       style="font-style:normal;font-weight:normal;font-size:6.46961689px;line-height:1.25;font-family:sans-serif;letter-spacing:0px;word-spacing:0px;fill:#000000;fill-opacity:1;stroke:none;stroke-width:0.40435106"
       x="18.380531"
       y="20.625666"
       id="text14"
       transform="scale(0.65434062,1.528256)"><tspan
         sodipodi:role="line"
         id="tspan12"
         x="18.380531"
         y="20.625666"
         style="stroke-width:0.40435106"> 0 1 1 1 0 1 1 0 1..                                                                                                       0 1 1</tspan></text>
    <text
       xml:space="preserve"
       style="font-style:normal;font-weight:normal;font-size:6.69684982px;line-height:1.25;font-family:sans-serif;letter-spacing:0px;word-spacing:0px;fill:#000000;fill-opacity:1;stroke:none;stroke-width:0.41855311"
       x="313.29663"
       y="26.508583"
       id="text18"
       transform="scale(0.63213798,1.5819331)"><tspan
         sodipodi:role="line"
         id="tspan16"
         x="313.29663"
         y="26.508583"
         style="stroke-width:0.41855311">0</tspan></text>
    <path
       style="fill:none;stroke:#000000;stroke-width:0.26458332px;stroke-linecap:butt;stroke-linejoin:miter;stroke-opacity:1"
       d="m 12.561668,141.98367 c 0.590884,-1.77265 0.534539,-1.04016 0.534539,-2.13815 0,-0.17818 0.03494,-0.35982 0,-0.53454 -0.05525,-0.27626 -0.17818,-0.53454 -0.26727,-0.80181 -0.17818,-0.53454 -0.397881,-1.05699 -0.534539,-1.60362 -0.02161,-0.0864 0,-0.17818 0,-0.26727 0,-0.26727 0,-0.53454 0,-0.80181 0,-0.17818 0.04322,-0.36168 0,-0.53453 -0.04832,-0.19327 -0.218954,-0.34128 -0.267269,-0.53454 -0.04322,-0.17287 0,-0.35636 0,-0.53455 0,-0.62362 0,-1.24725 0,-1.87088 0,-0.44545 0,-0.8909 0,-1.33635 0,-0.17818 0,-0.35636 0,-0.53454 0,-0.0891 -0.02817,-0.18275 0,-0.26727 0.063,-0.18899 0.204273,-0.34555 0.267269,-0.53454 0.72028,-0.26461 0.162639,-0.91782 0.26727,-1.33634 0.06833,-0.27332 0.19894,-0.5285 0.267269,-0.80181 0.02161,-0.0864 -0.02817,-0.18275 0,-0.26727 0.063,-0.18899 0.204274,-0.34555 0.26727,-0.53454 0.02817,-0.0845 -0.02817,-0.18275 0,-0.26727 0.063,-0.18899 0.178179,-0.35636 0.267269,-0.53454 0.08909,-0.17818 0.156767,-0.36879 0.26727,-0.53454 0.06989,-0.10483 0.197381,-0.16244 0.267269,-0.26727 0.296712,-0.44507 0.492162,-1.19075 0.801809,-1.60362 0.15119,-0.20158 0.383349,-0.33295 0.534539,-0.53453 0.0789,-0.1052 0.772565,-1.48665 0.801809,-1.60362 0.04321,-0.17286 -0.07969,-0.37517 0,-0.53454 0.11269,-0.22538 0.383348,-0.33295 0.534539,-0.53454 0.119526,-0.15937 0.147742,-0.37517 0.267269,-0.53454 0.151191,-0.20159 0.383349,-0.33295 0.534539,-0.53454 0.324573,-0.43276 0.125801,-0.52931 0.534539,-0.80181 0.165754,-0.1105 0.37517,-0.14774 0.534539,-0.26727 0.0073,-0.005 1.004669,-0.94025 1.069078,-1.06907 0.03984,-0.0797 -0.03984,-0.18759 0,-0.26727 0.05635,-0.11269 0.197382,-0.16244 0.26727,-0.26727 0.110502,-0.16576 0.156767,-0.36879 0.267269,-0.53454 0.139776,-0.20967 0.421849,-0.30916 0.534539,-0.53454 0.125992,-0.25198 0.141278,-0.54983 0.26727,-0.80181 0.160362,-0.32072 0.641447,-0.48109 0.801808,-0.80181 0.03984,-0.0797 -0.03984,-0.18758 0,-0.26727 0.05635,-0.11269 0.17818,-0.17818 0.26727,-0.26727 0.08909,-0.0891 0.17818,-0.17818 0.267269,-0.26727 0.383762,-0.38376 0.9167,-1.00063 1.336348,-1.33634 0.250829,-0.20067 0.55098,-0.33388 0.801809,-0.53454 0.196766,-0.15742 0.356359,-0.35636 0.534539,-0.53454 0.267269,-0.17818 0.544834,-0.34181 0.801808,-0.53454 0.100794,-0.0756 0.162438,-0.19738 0.26727,-0.26727 0.165753,-0.1105 0.37517,-0.14774 0.534538,-0.26727 0.201589,-0.15119 0.324877,-0.39476 0.534541,-0.53454 0.07412,-0.0494 0.195998,0.0535 0.267269,0 0.302381,-0.22679 0.534537,-0.53454 0.801809,-0.80181 0.356359,-0.35636 0.712718,-0.71272 1.069078,-1.06908 0.267269,-0.26726 0.506658,-0.56569 0.801809,-0.8018 0.155556,-0.12445 0.375169,-0.14775 0.534538,-0.26727 0.201586,-0.15119 0.318465,-0.4049 0.53454,-0.53454 0.241578,-0.14495 0.560229,-0.12233 0.801807,-0.26727 1.336349,-0.80181 0,-0.26727 0.801809,-0.80181 0.165753,-0.1105 0.375171,-0.14775 0.53454,-0.26727 0.201586,-0.15119 0.35636,-0.35636 0.534538,-0.53454 0.356359,-0.35636 0.712719,-0.71272 1.069078,-1.06908 0.08909,-0.0891 0.15458,-0.21092 0.267269,-0.26727 0.251984,-0.12599 0.549825,-0.14127 0.801809,-0.26727 0.287306,-0.14365 0.526367,-0.36927 0.801809,-0.53454 0.170823,-0.10249 0.35636,-0.17818 0.534538,-0.26727 0.267271,-0.17817 0.526367,-0.36927 0.801809,-0.53453 0.170823,-0.1025 0.378981,-0.14283 0.53454,-0.26728 0.295148,-0.23611 0.506659,-0.565682 0.801807,-0.801802 0.155559,-0.124447 0.356359,-0.178181 0.53454,-0.267271 0.178179,-0.08909 0.35636,-0.178179 0.534538,-0.267269 0.53454,-0.267269 1.069078,-0.534538 1.603618,-0.801809 0.178179,-0.08909 0.349576,-0.193284 0.534538,-0.267269 0.261578,-0.10463 0.540234,-0.16264 0.801809,-0.267269 0.369927,-0.147971 0.699154,-0.386569 1.069078,-0.53454 0.523156,-0.209262 1.085723,-0.312584 1.603619,-0.534538 0.366207,-0.156946 0.712718,-0.356359 1.069078,-0.53454 0.178178,-0.08909 0.338037,-0.234519 0.534538,-0.267269 0.351512,-0.05858 0.726432,0.0979 1.069078,0 0.308858,-0.08824 0.514503,-0.390885 0.801809,-0.534538 0.251984,-0.125992 0.530921,-0.189876 0.801809,-0.267271 0.353192,-0.100913 0.720601,-0.151109 1.069078,-0.267269 0.188987,-0.063 0.349575,-0.193284 0.534538,-0.267269 0.261577,-0.104632 0.53454,-0.178181 0.801809,-0.267269 0.53454,-0.178181 1.080463,-0.325279 1.603618,-0.53454 1.000094,-0.400037 0.08137,-0.174318 1.336347,-0.80181 0.267269,-0.08909 0.534538,-0.178178 0.801809,-0.267268 0.08909,0 0.182751,0.02817 0.267269,0 0.188989,-0.063 0.35636,-0.178179 0.534538,-0.267269 0.53454,-0.267269 1.069078,-0.534541 1.603618,-0.801809 0.178181,-0.08909 0.349576,-0.193284 0.534541,-0.267269 0.261575,-0.104632 0.540231,-0.16264 0.801806,-0.267269 1.966309,-0.786524 -1.322916,0.35188 1.33635,-0.53454 0.534537,-0.178181 1.08572,-0.312585 1.603616,-0.534541 0.366207,-0.156945 0.696023,-0.394642 1.069078,-0.534538 0.687877,-0.257952 1.434486,-0.323437 2.138156,-0.53454 0.539691,-0.161906 1.063926,-0.372631 1.603618,-0.534538 0.351835,-0.10555 0.712719,-0.178181 1.069078,-0.267268 0.712719,-0.178181 1.422315,-0.369346 2.138156,-0.534541 0.442638,-0.102147 0.888257,-0.192587 1.336347,-0.267269 0.62139,-0.103565 1.257059,-0.125616 1.870887,-0.267268 0.549024,-0.126699 1.056987,-0.397884 1.603616,-0.534541 0.525732,-0.131432 1.094333,-0.08207 1.603619,-0.267269 0.488201,-0.177527 0.848145,-0.624281 1.336346,-0.801809 0.509286,-0.185195 1.07223,-0.160991 1.603619,-0.267269 0.360193,-0.07204 0.715883,-0.166356 1.069078,-0.267269 0.270886,-0.07739 0.542859,-0.156292 0.801806,-0.267271 0.36621,-0.156946 0.682554,-0.437907 1.069078,-0.534538 0.345721,-0.08643 0.717569,0.05858 1.069079,0 0.393001,-0.0655 0.676079,-0.46904 1.069078,-0.53454 0.351512,-0.05858 0.717568,0.05859 1.069078,0 0.1965,-0.03275 0.349578,-0.193284 0.53454,-0.267269 0.261578,-0.104629 0.530921,-0.189873 0.801809,-0.267269 0.353192,-0.100912 0.715883,-0.166357 1.069078,-0.267269 0.270886,-0.0774 0.528492,-0.198943 0.801809,-0.267271 0.08643,-0.02162 0.180838,0.02162 0.267269,0 0.273315,-0.06833 0.530921,-0.189873 0.801809,-0.267269 0.353193,-0.100912 0.715884,-0.166357 1.069079,-0.267269 0.270885,-0.0774 0.53092,-0.189873 0.801806,-0.267269 0.706387,-0.201827 1.420998,-0.375171 2.138156,-0.53454 3.290528,-0.731229 -0.376782,0.04187 2.405428,-0.267269 0.837335,0.0016 1.5904,-0.432662 2.405425,-0.53454 0.353607,-0.0442 0.716297,0.0504 1.069077,0 0.2789,-0.03984 0.52226,-0.232326 0.80181,-0.267269 0.70722,-0.0884 1.4326,0.100793 2.13816,0 0.19286,0.479457 1.80218,-0.784633 1.87088,-0.801809 0.63353,-0.158383 1.47295,0.09503 2.13816,0 2.76417,-0.39488 -0.84241,-0.173668 2.40542,-0.534538 0.35418,-0.03935 0.71547,0.0442 1.06908,0 0.36449,-0.04556 0.71272,-0.178181 1.06908,-0.267269 0.44545,-0.08909 0.88485,-0.217104 1.33635,-0.267271 0.88545,-0.09838 1.78545,0.08066 2.67269,0 0.45241,-0.04113 0.88941,-0.186008 1.33635,-0.267269 0.53317,-0.09694 1.07223,-0.160991 1.60362,-0.267269 1.65902,-0.331806 0.61201,-0.305575 2.67269,-0.53454 0.53127,-0.05903 1.06908,0 1.60362,0 0.35636,0 0.71757,0.05859 1.06908,0 0.1965,-0.03275 0.34127,-0.218954 0.53454,-0.267269 0.34572,-0.08643 0.731,0.112691 1.06908,0 0.37797,-0.125992 0.68598,-0.425085 1.06907,-0.534538 0.25699,-0.07343 0.53454,0 0.80181,0 0.62363,0 1.24726,0 1.87089,0 1.24726,0 2.49452,0 3.74177,0 0.53454,0 1.07235,0.05903 1.60362,0 0.28,-0.03111 0.52291,-0.227428 0.80181,-0.267271 0.35278,-0.0504 0.71272,0 1.06908,0 0.71272,0 1.42543,0 2.13815,0 1.87089,0 3.74178,0 5.61266,0 6.23629,0 12.47258,0 18.70887,0 2.22725,0 4.45449,0 6.68174,0 0.71272,0 1.42543,0 2.13815,0 0.35636,0 0.71547,0.0442 1.06908,0 0.36449,-0.04556 0.70675,-0.206881 1.06908,-0.267269 0.17575,-0.02929 0.37517,0.07968 0.53454,0 0.22538,-0.112692 0.30058,-0.440955 0.53454,-0.534541 0.24815,-0.09926 0.53817,0.04394 0.80181,0 0.55578,-0.09263 1.0511,-0.424034 1.60361,-0.534537 0.42312,-0.08463 1.20352,0.100025 1.60362,0 0.19326,-0.04832 0.33804,-0.234519 0.53454,-0.267269 0.35151,-0.05859 0.7163,0.05039 1.06908,0 0.27889,-0.03984 0.52225,-0.232326 0.80181,-0.267272 0.70721,-0.0884 1.4326,0.100796 2.13815,0 0.67675,0.02529 1.23113,-0.42791 1.87089,-0.534537 0.26363,-0.04394 0.53454,0 0.80181,0 0.44545,0 0.89089,0 1.33634,0 1.69271,0 3.38542,0 5.07813,0 2.31633,0 4.63267,0 6.949,0 0.71272,0 1.42544,0 2.13816,0 0.26727,0 0.53454,0 0.80181,0 0.0891,0 0.18758,0.03984 0.26727,0 0.11269,-0.05635 0.15458,-0.210924 0.26727,-0.267269 0.0797,-0.03984 0.17818,0 0.26727,0 0.0891,0 0.17818,0 0.26727,0"
       id="path20"
       inkscape:connector-curvature="0" />
    <text
       xml:space="preserve"
       style="font-style:normal;font-weight:normal;font-size:6.69684982px;line-height:1.25;font-family:sans-serif;letter-spacing:0px;word-spacing:0px;fill:#000000;fill-opacity:1;stroke:none;stroke-width:0.41855311"
       x="21.125404"
       y="27.313749"
       id="text18-3"
       transform="scale(0.63213798,1.5819331)"><tspan
         sodipodi:role="line"
         id="tspan16-6"
         x="21.125404"
         y="27.313749"
         style="stroke-width:0.41855311">1 0 0 0 0 1 0 0 0 ....</tspan></text>
    <rect
       style="fill:#00ffff;stroke-width:0.26458332"
       id="rect40"
       width="190.56317"
       height="2.9399648"
       x="12.027128"
       y="43.093948" />
  </g>
</svg>
