<?xml version="1.0" encoding="UTF-8" standalone="no"?>
<!-- Created with Inkscape (http://www.inkscape.org/) -->

<svg
   version="1.1"
   id="svg69"
   width="1062.7677"
   height="928.60321"
   viewBox="0 0 1062.7677 928.60321"
   sodipodi:docname="ORG_A04.svg"
   inkscape:version="1.1 (c4e8f9ed74, 2021-05-24)"
   xmlns:inkscape="http://www.inkscape.org/namespaces/inkscape"
   xmlns:sodipodi="http://sodipodi.sourceforge.net/DTD/sodipodi-0.dtd"
   xmlns:xlink="http://www.w3.org/1999/xlink"
   xmlns="http://www.w3.org/2000/svg"
   xmlns:svg="http://www.w3.org/2000/svg">
  <defs
     id="defs73" />
  <sodipodi:namedview
     id="namedview71"
     pagecolor="#ffffff"
     bordercolor="#666666"
     borderopacity="1.0"
     inkscape:pageshadow="2"
     inkscape:pageopacity="1"
     inkscape:pagecheckerboard="0"
     showgrid="false"
     inkscape:zoom="0.76421055"
     inkscape:cx="644.4559"
     inkscape:cy="268.25068"
     inkscape:window-width="1366"
     inkscape:window-height="699"
     inkscape:window-x="0"
     inkscape:window-y="32"
     inkscape:window-maximized="1"
     inkscape:current-layer="g75" />
  <g
     inkscape:groupmode="layer"
     inkscape:label="Image"
     id="g75"
     transform="translate(0,295.26987)">
    <image
       width="682.66669"
       height="633.33331"
       preserveAspectRatio="none"
       xlink:href="data:image/png;base64,iVBORw0KGgoAAAANSUhEUgAABAAAAAO2CAIAAAD5S3IyAAAAAXNSR0IArs4c6QAAAARnQU1BAACx jwv8YQUAAAAJcEhZcwAAFiUAABYlAUlSJPAAAEWPSURBVHhe7d07cttYFy5s6szi5JIDl0dAj0Dq xJHTL6NCKelMJ3PmhArNrFNHTiyNwByBy4Gl/B+Gfmxg834RSfECYD1PVVcDIEjRAAisF9gbOHt5 eekAAAAx/J/8fwAAIAABAAAAAhEAAAAgEAEAAAACEQAAACAQAQAAAAIRAAAAIBABAAAAAhEAAAAg EAEAAAACEQAAACAQAQAAAAIRAAAAIBABAAAAAhEAAAAgEAEAAAACEQAAACAQAQAAAAIRAAAAIBAB AAAAAhEAAAAgEAEAAAACEQAAACAQAQAAAAIRAAAAIBABAAAAAhEAAAAgEAEAAAACEQAAACAQAQAA AAIRAAAAIBABAAAAAhEAAAAgEAEAAAACEQAAACAQAQAAAAIRAAAAIBABAAAAAhEAAAAgEAEAAAAC EQAAACAQAQAAAAIRAAAAIBABAAAAAhEAAAAgEAEAAAACEQAAACAQAQAAAAIRAAAAIBABAAAAAhEA AAAgEAEAAAACEQAAACAQAQAAAAIRAAAAIBABAAAAAhEAAAAgEAEAAAACEQAAACAQAQAAAAIRAAAA IBABAAAAAhEAAAAgEAEAAAACEQAAACAQAQAAAAIRAAAAIBABAAAAAhEAAAAgEAEAAAACEQAAACAQ AQAAAAIRAAAAIBABAAAAAhEAAAAgEAEAAAACEQAAACAQAQAAAAIRAAAAIBABAAAAAhEAAAAgEAEA AAACEQAAACAQAQAAAAIRAAAAIBABAAAAAhEAAAAgEAEAAAACEQAAACAQAQAAAAIRAAAAIBABAAAA AhEAAAAgEAEAAAACEQAAACAQAQAAAAIRAAAAIBABAAAAAhEAAAAgEAEAAAACEQAAACAQAQAAAAIR AAAAIBABAAAAAhEAAAAgEAEAAAACEQAAACAQAQAAAAIRAAAAIBABAAAAAhEAAAAgEAEAAAACEQAA ACAQAQAAAAIRAAAAIBABAAAAAhEAAAAgEAEAAAACEQAAACAQAQAAAAIRAAAAIBABAAAAAhEAAAAg EAEAAAACEQAAACAQAQAAAAIRAAAAIBABAAAAAhEAAAAgEAEAAAACEQAAACAQAQAAAAIRAAAAIBAB AAAAAhEAAAAgEAEAAAACEQAAACAQAQAAAAIRAAAAIBABAAAAAhEAAAAgEAEAAAACEQAAACAQAQAA AAIRAAAAIBABAAAAAjl7eXnJgwC01NnZWR5qCwcvgJ0JAADt1L6ifxUHMoCtCAAAbROn9J/mcAaw IQEAoD1ilv7THNQAXqUTMEBLqP4LFgLAq1wBAGiJ9bVvm/b2r1b5Dm0AawgAAG2wtCaOsIcP+w8H 2JkmQAAtVFTAQYrgOP9SgH0RAAAAIBABAAAAAhEAAAAgEAEAAAACEQAAACAQAQCA7PH67Oz6MY8A 0FICAAAHJFQA1I0AAAAAgQgAACx6vv94dv2YTt+XPt4/j6cXw0unT53oz6f908SrQaczuErzug4A UA8CAADLDa6+vH9Kz9l96A1v/zcq9TvD24s8/anfub1YU9ef3/wq3tvp9B7S3N8u82QATkoAAGC5 3sOvm/M0cPmp1xn+eSonFsbTz2/uep3BD2f2ARpFAAAAgEAEAAB29fz3d6f7/iKPAdAIAgAA2xlc 5b6/zz+/Dzsf3qXmQOfvPowbAz1ep56/U37/HfUfAOD0BAAAttN7uPtzke7rc3Hb6T/lvr2X3x56 1d1+zn58eup3y4mFy3/73eFtmt1dgADq4ezl5SUPAtBYRYGdh0oH27c/33+8+HNXuzv6HOufD9AG rgAAAEAgAgAAAASiCRBAGwRvA6MJEMDmXAEAAIBABAAAAAhEAABoobkmMe0W6h8L8HYCAEA7FWVx 6yvjCP9GgL3TCRigJTYphZu+z4/wbwQ4NAEAoCWcC684rgGsJwAAtErwGOCgBvAqAQCgbWJmAIcz gA0JAACtFSEJOIoBbEsAAIiluanAAQtgLwQAAAAIxHMAAAAgEAEAAAACEQAAACAQfQAAeJO5XsUO KwA15woAAAAEIgAAAEAgAgAAAAQiAAAAQCACAAAABCIAAABAIAIAAAAEIgAAAEAgAgAAAAQiAAAA QCACAAAABCIAAABAIAIAAAAEIgAAAEAgAgAAAAQiAAAAQCACAAAABCIAAABAIAIAAAAEIgAAAEAg AgAAAAQiAAAAQCACAAAABCIAAABAIAIAAAAEIgAAAEAgAgAAAAQiANAwZ1PyJAAANiYA0BiLRf/i FAAA1hMAaIY1hb4MAACwOQGABni1xJcBAAA2JABQdxsW9zIAAMAmBAAAAAhEAKDWtjqv7yIAAMCr BAAAAAjk7OXlJQ+G5JwxMC34LnE3cztSyxCg5kJfAVD9A3PsFgBoPU2AAAAgEAEAAAACEQAAACCQ 0J2AdVxrhM3bZFuD7Mau4I0sQIBmcQUAgEZ6vD47u37MIwBsTACg7jY8m+ikI7TB8/3Hs2yr2j6F gWXvyZ/38f45T0jKmTf8+KkvJG0AbSEA0ACvFveqf2iFx+uL207/qfhFv7w8vf+yfcE9+DH7lsev t8Nut5vHklT8Xw3yyKumv9BDb3A1GyQAGkoAoBmKo28eWrDmJaBJnv/+7nQ//3Nejpzf/Pp2WQ5t qtfvdwdfpkv0xx+Dbv/ucx4rPF5fFVOeHnp5fL3n+y/F3P/dVF/o8t9+d/j9pwQANJ8AQGOU5+Dm a33VP7TH+bsPneHt18Xz/hu2w3n3z+eZEj3V/5//uchjyeW3l5dfuaB/3dOfYefDu/Hc5df785TH AJpLAACgJi6/PfQ6g6uizJ9qa1NU/xe3Hx6qUwBP/d9r2uGcTyeA8vz96HrCLtIFiRkX77ud339d AgAaTwAAoDbSKfqiyu8Oby/yyf7nn9+H3f6/uTXQ+c1db007nKkEkN7Xu9v4bD9AIAIAAPVyfvMr hYDOuEF/GQeyq8G6djhlQEitiMr6/9N2nQjmpCY/M+aaBAE0lQAAQP2kc/l5sNPp5hvxjKzrHXz5 qdcZ/Lj+evvW+n+hyU/ZR/n9dJcCgGYSAACohdTVd9zFt7yBZ2rBX7bqWdYzeJUyAQwGnTfX/3N/ On2jUZuidDNRtwQFGksAAKAWzm9+PXRSD+Cypc/v/lN1v55icur6m6cnrzwfICWAzqTbwLT8vLD0 IICyr/ErVXz6Rr1qxuobbXljUoB6OnsJfBfFYoeeh0qRF0WDWGvsnY3qjeItwCJHfHmf8wlA8wgA E476jWCtsXerNqrp6ba0NaL9Kp/vP/6v85/yH2guTYAAZhTlbCWPl+ZGNzDToJ0ay82CFqxce+c3 v1T/QKMJAABvNF1Bvlrzlw+1lQxqpHz0wBLa+wOtJQAAcVU1ex7ZUVHQXw16+Tm1qcfoNjeHSdFB GADguAQAIJyq7i/k8Q0UxX0empceDjW+4WS6/8yap1Ql6SFXTi4DcEICAE2yVcUGS21b91fy+BLp YVGjJ9Y+33+Zu/38uHXQ5LrA6Kx/ags0uR1ldR1gujGR28wDcBgCAA22tiyD3VVFfyGPr1Pepb5z e5Fq9ovvn5+mz+4Prr68Lx9hW84x19YnXQp46HU6VfOh4l2pMdHvySNv9TMF4DAEAIAZRe2dhzb0 /PP7sKjj+/1uZzhb5vcechV/fnPX6wx+rG/tf/7uQ2f4/afz/pvSgwJgNwIAEMtcfb91uT/n+f7j xe2Hh5eXbzepcf+2vYBnXH57efhQXUsI2wCovElSZavaPjeeWnhP/rzZxVnOvMXHbzs/QM0JAEA4 qYHNSJ60s5k+wKt7AT///Z2H1hvdkjIFgYAZ4PH64raTW0E9vf+yfc09f5Xl8evtsNvt5rEkFfOp 68Wmtp0foAEEAIA3KPsAj6vOshdw9/1FHh1fDShbCc30Dp74/XdJnZ8+Np4Uk7qf/6n6Ppzf/Nry ZkmpFdaoP3bl8ceg27/7nMcKj9dXxZSn1PdiI9vOD9AIAgDAGxRlamr2k5qZFMrz1+Peu93+w+fv Ve/gNH1JOXv5b787LBv9XD+W55pHUrOieL2Ay14Qt18Xz/tPNQxa1xTn3T+fu9O9KFL9//mfURxL 0hWWbZbrtvMDNIIAAPA2M0+SHVeLRTL4dXOZ+gXMTi9nH2eBdCugUjFl5nNiPirg8ttDr7ov6lT7 p3E3i+Sp/3tNJ4vz6QSQLseMrycAMCEAAFAbZQp6ytdFypP9qflUt/9vzkPpfkprbpU0lQDS+3p3 zt4DLBIAqIXq0n4hj+9P/lxPEIPmSNdFihAwfsBaur1q/iGXPXLXPGy5DAipFVFZ/y/vdQEQnQDA 6RWH9Dy072f9Hu6TgcNK5/LzYOpNMX4+Wmld+6h0I6bBj+uvt+p/gBUEgHpLnQLD3Xx6X5W6ih+a JXX1He/wyht4phb8ZaueZT2DVykTwGCw6q5LsLu0jR7m/rzHP9yHLDAYEwD26XB7hjnTd8QozP7N 6Reb+tuuvn0e2ckb3x5LgMNAtUUV8vj28vttV4eU7qjUGd1Q6er36H5KxeTU9TdPT17ZXFMC6Ey6 DUzLd1pKN/avbt30yi572/k5vryOFjaKfCzc6xorYmmn/9+KjiXlHzzWrjT/qydavg9n7wSAxhpf En/qd6aeGDT9HJ03PZP0iIqvmodmFbu0PLSNal+YR6as+iuNU4+cmZRHoAYcdYpvmYfesFHloV0/ gQ1N3Qlp+u6b45slVXILoOn7Kc3cWymNTN6e3jwam/r8yvRfWWLb+TmZ158B92bpvlJ16lfey7fG KpT3Im7C8Z7aEACaL/V5G/WJK297Nz49Ud5ifPXtMuqk2H/loVnbFlur5l/1+bxiRc6siv+GPh51 XxsVUBcbPANuD1KUXNP9pIyp67qnHFCRVB96w9v/iQBsSgA4glVtclZMn0z+eP83T9vU059h58O7 8emJ8qk6q2+XUS+ravRiQeSh16yac9Uns4XpnJnK/2Y/HvXtGxVQJ68/A27FMTedy7h+HDeoKaaP Z5s+ob7qvR/vH6tX0szVZ+UXVx3ip6083G/w3gWzp/xWfMK2f3G8YAouMLSLAHBoxY9q8gib8iJd 9dNK0//cVZPL6fkX93z/v9thvq539+d2g1Os6ax/7u2WnqM/4+J9t/P7b2N+s+W/ekmxXu188sgK q2ZY+oFttGL3vWr6ZPL2ObNqF9GcphA7bwPF0slDU8JsUdAkrz0DbuZYPPc4ucHVj09pcvUUunxo njqhPvPeqeN4YXh7Vc0+t0NMb1l2iJ+26nC/7quuMznlt+qvb/QXJ//AYnLqilNN1vytbQSAA0ut EHsPk1aqaf9SNlScuZQ4qdNnHnlTzr7K+L7Y5c/8RFcdD6LYz+ShWUurscrSl6pdVh5puRW7760P A6tN5cwmKv6deWhkzea0xuLnALWw/hlwax8nNzpIl73Hp0eqcnrlcTyZvDBjxSF+2qrD/dqvupkt C4xV/8AyUWz7t2kKAeB0itos1e/Jxe0wT5xrw7NGbpz91O9OevqmX+uMzT+uXrYqs4oFmIemxCrU 5MwNLG4SS7ecscVXY21U0DCvPgNu88fJ7cPSQ/y0dcfnnb5qagPQfV81e3pjgZGlngUf8lfRAKht BIATmTljm6r4PH3rNjvnN/+lh+bne2TPvX16d9A0xWLJQ6uVe6Xw1f96B8iZbVIsljw0a3G6jQrq 7pVnwI3vaZAd8IzGqkP8tHWH+12+annbo7Ld094KjMLoPlgpCMgArSIAHFi5Pxo3/qu6To6u7I2l n20enL7iVvyGN7nNStk7M1+PnH1iTnleuEa3LNtWtdvJIxvb4S2tdaCc2VjFQshDUxZrfdU/NFN5 xF36DLitHyc3ZaPj+BpTh/hpqw73O33Vx+uz9LWWPKJggwJjk39gOmrQKgLAvk1fuEs/p/LeXIP8 CJvpJ9sUBdVo8pf3/XEbjMtv5f0W0+SLP3fLzxvMK3+81Q3Qzm9+zf65RjfaKG1VewUt1I6cM5tM KQ8tlvaFnaXleXFw3O5xclNWHMfXWHmIn7bqcL/xVx39gULZWXf0tbYuMFb8A6dvAZTOJekF3Cpn kQ+HxSadh0oqgzqbW1lLBVmD5Wn9qfNJvYfy8nB5Aqia0p0cn6Zm7vb7H26/v88vTV7oPTy9/5Ka +M+HxTTL98+TQ136C/nIMPXHKlN/sgk22ZzG7BledZx96fivWCMAbyQATDio1Nyaos26Y1sbZgCb 1iaOsC+1uwbYI02AaIzikL/0qK8UYAebbDY2LQBayRWAiVYuig1Pc3IgKsiaW/MDse425woAQLO4 AgAwT30JQIu5AjDRykXhCsBpxfl92dJOpQ7bmCsAHI59SxP5hdafKwAAABCIAAAAAIFoAjTRykXh uvmRhV3gLtOfSh22sSNs9nZlYdm3NJFfaP25AtBIxQ5xUX4NAABWcwVgoimL4i21vlB+aA3dqN4u 7D/8+Gq4qI/wlWxgYVn1jWA1NY4rAMASxd58qfwybClvQLtuQuoJgD0SAIB5a6q0qoZblF+GZaa3 kMWtpdyCkjy+ga1mBmCOANA8zoQBrTFdyivrAY5DAGikIgMslV+uvef7j+l038jH++f8QjL94vVj ngi0R/HbzkMLql9+HgHgMASAVsk5YEp+oYa6/afqKz71O7cX4wzweH1x28kvPfQGV7PhgOMoFn4e gn3YdouSAQAOSgDg1M5v7nqd4Z+nNPx8/2XQ7f93c16+cvlvvzv8/lMCOIUygi2X54A3eLXElwEA DkcAoE6e/gw7H95V5X/h/N2HUTSgPnIOmJVfgxUWN5JNMoAYAHAIAgCnls76d3qfLtPg39/VtJGL 993O778uAfAma/ucJI/XxWQdTmqqWDd5CIA9EQA4keHtRVmNnV38uXt5+ZbqfziYFX1OquL/apBH OKgdLgJUNpwNgA0JAJxILsie+t1JT9/U5GfGXJMgeLPpPiep/L8aFJviQ68a5eQWQ0JFBgDYIwGA 0zq/+a/fHd5+rZpfzDX5SU2Cuu8v8hjs3eW3l5dfudM5R7Cqvp+WzgzoVQJwSAIAp1aekR38KBPA +T+fJ2mg8/j1dti7U52xT1N9TjiJDYt7GQDgcAQATu/yU5EAvpTNgM5vfqW7/6e+AWdnV7/7TzoH sBf6nBxRtaTH8tTtyQAAB3IWeQ87d2Rq5aKI8G+slbALvM7/8Of7jxffPz+lpj5pMD1pbq7Zz+P1 2VXnoSG5oIaLeu4rvcXSf86qz7dDiyDsTrVZrKbGcQUAiGO2zwkNsaqY2GPwAAhFAAAime5zQnOs yQBiAMC2BAAglqk+J9UjwKoHAVRdTxafEsbrjnO5v/gra2JAHgJgA/oATLRyUUT4N9ZK2AVuSzua Ji7que+8xuSfU/bXGFbDvZkOGqs+zVbXSvYtjWA1NY4AMNHKRbH5cZdDiPP7svc/mnYs6lW7ptE/ 5/H67Menqupf1nN7zZ7Nttcy9i2NYDU1jgAw0cpFseYwyRHE+X3Z+x9NOxb1ql3T0n/Oqrs0bfUh NJR9SyNYTY2jDwAAh1KUBZU8Xpob3dmqImNfnw/QVq4ATLRyUTgQnlac35ct7VTqvI0t3ceu31SW /HPKJkAfVj+mYekHxvnptd7SrYi6sZoaxxUAAI5hfem/wvP9/26HvYc1D2krSg3Vxq6KdHV27aa4 EI8A0HLVoZFTyasBKG2bAR6vy/6/a8p/NpXveVt6teZPwUAygBYTAAA4iFcz8PoZUt/fQe9h+u4/ 7Kgo6NOyLM9LvDz0BlfbPPEiRQdhANpFAADgUNaX+Gvk6n9ly3+28vRn2Ol9yssyPQtv+OepGlnu /ObXi2UPLSYAAHtQnVlsrvzPGMlTmyB/4wZa9+Wf778Miv9Vj2eueEjzW1y8746ff10u3HEaSMat gyYLeXTWP7UFmjwpu7oOMJ69YLVAMwkA1Fo+xuzSdxCohaWF/ivRpTwBPUtLoLcoFuhTv3N7kfam F98/P02f3R9cfXn/lBZxOcdcW5+0Jh565cOYC8W7UmOi3/1y/uRtq6Xcuyd5HDgWAYD6mj4qOEJA cxWFYh4a8Ys+tuef34dFHd/vdzvD2TJ/3M3i/Oau1xn8WN/a//zdh87w+889nPe3h4cTEgAAODgZ 4JSe87MUXr7dpGsr2/YCnnH57eXhQ3UtQQMgaCwBgMZQLkDL+FEfyUwf4NW9gJ///s5D6xUZoJSC wN4ygI0BjkkAoL4WTxkCzbXDL7rsbuoOlG9W9gEet+0pewF331/k0fHVgLKV0Ezv4Inff5fU+elj d2cPDyckANAkThFBExW/3Eoe30gq/tP9Z3i785tfqdlPXgvlw9XGvXe7/YfP36vewSseunb5b787 LBv9FFls+hZAqVnRPjtnFx+Zh4ADO4scwef2Nc5G1NPiIcGaYu/sDdY7WmU2XvJFnZluNnP35+Kq s8nTAKzBhnp1D2/NNoLV1DiuAADRHa26Pa3in7mz/BFHlJqZu/MnwGEIANTd4omEk5QjtFWzNqey Gt9R/gioE3t4OAkBgAZwMZEDOX6pUZbiu8ufAvuTt63TbV328HB8AgCNdMJjFa2xZitav4GlWmlX +SPCKGq7VfIcnNT0Nlmf7TPgLwWOTACgGZQLHFmq1lfIc4RR1eu7yR+xIOBirKH6rIU1mwpwCAIA TaWA4C2ibT9VOb6b/BH748dbBzVfCzYSOCgBgMY4RCECTVHV4jvLn1IDGxZ2+Xbz6UEA1f3r9/bE WQrFAs1DU067ndRqK4XWEwBosKXHMKitshTfUf6IhtvkN1uV/unu/zN+/fPzY3phNgiUM3tU8HaK RZaHphSLOA/VxtLvCeyFAECTLB6iHCE4srIY3VH+iKi2+7UOfsyW9Y9fb4fdbjePJan4X/Wo4OJv tV7+p+5DTTbOxa+x338mMCYAACSLxUeq2Rfk19jS0kpu5fLs9fvdwZfpc/2PPwbd/t3nPFZ4vL4q pjw99KrRgKumTAG7yO+fkl+ogfyFgAMTAGiYxcO8YwZ7YUM6nKXLdm3J/u6fz93h95/jBJDq/8// XOSxxKOCAXYmANA8zsLyRpvU+jazfdm++k/OpxPA8/2XVP+r9gH2QwCgDZy7hXrarfpPphLA88/v w96ds/0A+yIA0EjOzrIzp/+PZvfqPzm/uesNb78+VvX/p8s8eWPFH2q3/O8E2J4AQEu4CMAmFreT uUJKabUvb6v+S5efep3Bj+uvt7vU/+1XbauvynPPyq/VVf6WwMEIADTV4kFCBmA3Vc1RyZM4gO0X b5kABoOO+n+var6d25PDEQgAQBSvnv7ncHZb1CkBdLr9f5fU/4uPCs4vsJZtHiicRd4XFEeMPFSy W2yiuZVYsB5ZxU/+yMYLfM2i3uNKsX5X2WRF1MTcSlxktdaTX1/juAJAs9nLsKFXCwv2qFja1QIv fqF+pCdXrYVCHq+rxR9p/b8zNJQAQNssHkJAYXFM00vb75EN2VTgmAQAGk8lB3VWFHZqO9ZbuoXY t8PhCAC0kGqDaYvbg8Li+PwqWUX1D8cnANAGi4cK1QarKCwObdUSLn6VfpjMWbpJ+JHCoQkAtJZq g4Jt4CTWFHDWCOup/uEIBABaTrUR2eLaV1scTbGoVy3tYr34YVLwC4VTEQAAOJQ19ZwMEJzqH05I AKAN1lcS6oyYlBc1USz2VUvebzMsqx5Oy5OAJyIviqZzLIF2eMt+uK279Mfrs6tBHi71Hl6+Xebh fUp/qHOgz56xdI+9YUp0pK4nq6lxXAEAgHorav6Rh97g6uzj/XN+ZZWimj+7fswjtVf8u/IQcBQC AACNF+cy4OW3IgMMb//3agRoDNU/HJ8AAEA9Pd9/LAr7yrqz2cXLeSiGy3/73eH3nzkBLC6lNCW1 GhpcTaZtvDBLaebrx3QVofT6BYetTFf8qn84CQEAgDp6vL647fSfigqxaveyogot6tM8NKXlZeX5 uw+d4Z+nYqio1C/+3JXLqFpKqbY/v/lVDI8aDqU2/Utne8Xg6sv7cukf4oJD+UWSPA4clwBAG2xy FKkONrReXt9T8gvUQF4lm3i+/zLo9v+7OS/HZs95T0Ss/mekWn/ca/fifbfz+++ySn3D2Wb0Hn5V S//yUy/HDaAtBACiWFoo0DKLazlSLVh32/0Gn/4MOx/eVeV/YXLOeyJu9f/893en+/6iGp407bm4 HZaTltlwNiAGAYCWUOexyFZRH0XdmYemrFlBqcSdMX/aetsPbJPHr7fD7ud/inSUmvbcfhjdIuip 381zzNlwNiAMAYD2qI5teWSZpRUDrWH91tbei/XQ1X96LMCkcdSUlAvyYGV5O5+F2YB4BADapkwB E3kqbbdYEVr7NbFbsZ6a/MyYNAmKWP1X9/MpXf3uP73k1vmd85v/+t3Ri1/e93vl1KTsNXF7UUy+ flwzGxCTJwFPKBdaaW4tF9av6PH8todm2XZFcxyL66UwvWpW7odTq5Xvn59Gle5otChpy/EZ1nWL rdxCqBOrqXEEgAnba1ttvqJtEg01t+IK1l0dLK6XwtyqWf2jG7VbL29ek9q9dNKwdR2N3XIjWE2N IwBM2F7bavOKwSZRK+PV8eqK2HwVczSLK6WwuF7W/ujK5u7VYLf/9OvmwoqOx265EaymxhEAJmyv LbbhurZJ1Mfm62JuzoIVd3KLK6WwdL1Y0ay3+RbCCVlNjaMTMBEtrU6WTqRxHHhObulP6Y3rZfEz rWiAnQkAhLBYK7xa7isvGkFsa4S9V/8AvIUAADSVs8KNcIjq34oGeAsBgCgWKwanFeEQpn9rqn+A GhIACGRN3SAMNI7T/3VWrItKHt+JXyXAgQgAtEdRLlTy+AZWzfzGwoW3m1sFr65Wq6xlptd4ShJT 8lQAdiUA0BLT5UIxXMnjU1QP7bB05dIa1i/AQQkAtFmZApI8TissrlC5rk3m1q+VC7B3AgAhlCkg VxXT9UQ1PFdwAKfixwhwBAIALbHJacIyBSTFzJX8wqxV06mDYvXloZFX11e10gt5HABiEwBoj7Kk 36h2z/WgirD51q/xubVsjTfOU7+bhwDYn3QqNA/GM1cNRF4UrbRztWdLqImlv9BNfrZrVr2VWzdW Futt8pPn5KymxnEFgNYqdkCVPE4rTK/QxZVbHITmjkM0lF8uwOEIALRfCgGlPL7WhrNxQtXaLOTx 0ial/9xbqC1rCuCgBAACKYtGhUVjbLiyNiz9rfqmsKYADk0AIJyqFizkcRpiscpX+rfA9NqxsgCO QwAgrqraKOTx2VqE2qrq/kIeX2Fu5VJb1Zoq5HEADkwAAPVHY2xe9xfyOAAwy21AJ1QMm3i1/Jpj qfIWW21vNjZoH0fqRrCaGkcAmLC9vmrb6v9wrKwgNtzkbA/QVo7UjWA1NY4mQDRSsa85hPzpNEdx mHGkgTd4vv94dv2YR4AgBACYyDlgr/JHs5NVxX1V9xfyOPC6x+u8Wyq8WvOnYCAZQFsJAGxBvbWD fLTdt/zpAcwV+nOjwGaKgv5q0HuofkEPvcHVx/vn/NLrUnQQBqBFBAC2s7T2qo4oS+U52LecAzaW 39ZYeXuyRcGOnv4MO71Pl9XI5adeZ/jnqRpZ7vzm18vLtzw/0DICAHuwpr7MVdu+5U9nYy3IAMAb XLzvdgZfqrP+z/dfBpM0kIxbB02uC4zO+qe2QFeDTmdwlV6vrgNMNyba5koCUBMCAFurQ/1dxYD9 yh/dXsWROg+tVR3TOaG8JmCfzm9+PfU7txdpE7v4/vlp+uz+4OrL+6e0GyznmGvrky4FPPQ6nar5 UPGu1Jjod7+cP/l1c57nBBpDAGAXxT4/D420oGqpjmV7lz+9Hl5dTarPOrAWOIjnn9+HRR3f73c7 w9kyv/eQq/jzm7teZ/BjfWv/83cfOsPvP533hwYTANjRYmmralmqigF7lz99e2tWkzUIrfV8//Hi 9sPDy8u3m9S4f9tewDMuv708fKiuJWgABM0kALBPKsijyTlgA/kNU5auJusO2mymD/DqXsDPf3/n ofWKDFBKQUAGgOYRANjd0uKSutlkNan+a8Uvi/0r+wCP2/aUvYC77y/y6PhqQNlKaKZ38MTvv0vq /PSxQPMIALzJYqWilKyh9atp6Sor3sKh5WU9a9V0eJPzm1+p2U/xc08ubjv9p3Hv3W7/4fP3qndw mr7k3p+X//a7w7LRz/XjzC2AUrMivYChec4iH2yKfVceKjnu7mxuSRYszBpaupoWJxasviOw5GET jtSNYDU1jisAHMTS4oa6UYOeiiUPwAkJAOyBwqURNllNVuURqP4BOC0BgP1YLF9cBKih9VWmGvQI VP/USrFBVvI4EIMAwN7IAI2wqtZUgx7B0l+EJc+pTG+QdtcQigDAYTmo1NBixakGPQLVP7Vi5wyR CQDsk2qmKabXlLV2BKp/akX1D8EJAOzZYk3jSFNPxZqq5HEORvVPrdggAQGA/Vs8kMgAhKXYov5s kBCNB4FN2APu12LdYwkTjep/Z84asIpfUA0pqBrHFQCOxxGdUFT/O7OvYA2bB7ydAMChKHSITPUP QG0JABzQYrnjzA0RqP4BqDMBgMOSAYhG9f92Fhdr2Dzg7XQCnrBPORD1EHHY2vfF/nlfmr5N2hIa wWpqHFcAODg7AoJQ/dMItklAAOAYFo83S0slaC7VP41gmwQKAgBHIgPQYqp/amt6O7RNAhUBgFOS AWgB1T81V2yNlTwOhCcAcDwOP7SP6h+AxhEAOKrFwshFAJpL9Q9AEwkAHJsMQDuo/gFoKAGAWpAB aBbVPwDNJQBwAuokGk31D0CjCQCchoZANJQNFYCmEwBa6/G6KFTGPt4/5+n1IQPQOKs2Uaf/AWgQ AaCVUvF/1XkoipLKU79ze3F2/ZhfrjMZgNpS/QPQDmeRD11zh/PWLIqi/L/63X/6dXOeJyRLJ9bB YlGlnKKGVP9H1tb9M9uyJTSC1dQ4rgC0z+OPQad3N1/oX37qdYbff6aGQM/3Hz/eP4+bCJ24ddDi bqL4TnkI6mHVNukgB0ATCQCt8/z3dx6adfG+m4cKw9uLL++fiuqlah104sZBMgBNpPoHoKEEgKB6 D7kx0PnNXa8z+FG/7gEyADWxdFNU/QPQXAJA65y/+5CHZj39GXY+vKtbD4AR5RT1pPoHoH0EgPZJ rf0XT+mnngHd9xd5bEpqMrT0hWPTEIi6Uf0D0EoCQAtd/tvvDq6m7/qZbgE06Pb/m/QMHlzlvr/P P7/X58pAnAyQumDP9ryYnvJ8/3Fl3+yq83YjbunacKp/ANpKAGij85tfLw+9IgOMpBuAvszcAbT3 cPfnIr10cdvpP327zJPrqPiSeYjySk6vV89eG62ydKtT/XMc43u0jRw28c/+uTo+NRLYOwGgrS6/ FdXK2JLb/49nqNejAYovlIdY9Hz/ZdD79C1d4pEADqcogvLQFFsmR9WbPMmxPJ3zel2+eF1xA+lN Ozw1cqe/BdSIAEDtFAehPDSytCALKLXX6n267Jz/81kCOBTVP3Vz+a3IAMPb/+3/1PzjdWocOn0N +Pzm10OvM/jiMgC0nADASulq8InkbzBl6cRgRvV/cZBOCcAhev+Wbmaqf04u9ezKT3IspF5CI9V5 +DTlapB6d02mLZltziZPjZx6Zz7tv/RvAQ0jAASUugi82uq/2LHnodqo4Vc6qkn9XyWASTnAXizd wFT/1EK6v/Pwz1MxVNTfF3/uig0zSa2DUgledfwaNRxK+/els83a6KmRixb/FtA8AgA0Q3m/pnHP 7ovb4egkHftQLNM8NKUob/IQ1MXMGZxUq//+u2w/sOFsQFACAE2ytEprqpnj8auPY3j8ejuc6haY Ouu5BrAvqn/qbnoPMdW0J50JWOXV2Zr51EhgLwQAlqtt9VMczPJQk5Uteied+p7v/3c77H7+Z/Uh t2ysm9v/VLQC2pOlW5Tqn1pJJwCqPURq2nP7YXQu4Km/orXORrNt+dRIoEUEAFbKh45Ty99mShsy wPnNr+p+e6XySD17P9bh6LXC9eNi/Z8TwO1XXfDeoli6eWjK0q0OTuVx4UmOIykX5MHK8nY+C7ON vPbUyHSNYJQQ0h2DyoERbYpooqW3sI15X9uqxoopL4KRPJX6yWtoSn4B3iBvTLPya5xaXh8jeWoM qYvttG7/Kb+STJ3O7/b7vcmr4xfKxoIrZ5s3+9fmZxu/2ntInzhqhzj7tw6q+jtjeSo1k1fPSJ76 BlMbcLJy+93WpAP7RDWt/IszL6Xps3942bsLi29tgLPiv7x045k7+Rd5UdTf4pla64u3cO6/5uyf qdgSGmHvqym1Yvv++am6NF42aev089ibpItcnYeZ21cVk768Lz67M/0nq+lXg5QAZqbMvbk0anJX vrBqprrRBIhmWNybLC3gYBOqf4DGOL+56+X74O5desJ+1cFmrmdd2fO+uzBlWf+YdNOt+lf8cwQA GkMGYC9U/wBN9rziIXcrpk8mf7z/m6eNpDtsj27BUT5uY1Tvl4/eufuvyASj4DE16+N18VGP1cd+ vH9O4+UfTH9p+0fynYYAQLMVv6c8BBtYusGo/gHqK52lH98Io6inJ7e4eur/vkoVeJ6+7OF35W32 cgP9uz+3s33ZqzJ/1MSnfAx2Ve+X1f77i+mO8E9/pu/WN7y9qv7adLukxcfkrfq2pycA0CTF7ycP wfZU/wCNMb4bXlnY5yY2ZWXe/ze3t0mNg/JJ+xUPv5uZ//JbKs8nyifsTN1hb3Jr3FG1P5ny+CM3 Fcp6Dxs0+ln5bU9PAKBhFsu1pVUdzFm6naj+AWoq34HnKd2tdubE+fR9sq8G494BU21tJg+/W/dg u8U7bI/q/Um1n6akKJHm3e0BeSu+7akJADSPDMC2lm4hqn+A2ju/+S89OnPqqTfzNwVdaGszdRfR ybWABcuesFPN/vj397jaL6YMv/9MU+bn3dCyb1sDAgAtIQOwiuofoMHKuwDlpvgbPQNz6uF30z17 i5Aw9Ty7dJZ/3DpnpPr4q6mWQYtTXjdOHDV+YqcAQCOp3tiQ6h+g6cqmOV/KZkDlg/R/l7fZycre vuV1guruO2dnX973x239L7+Nn7t/8edufGlgcvvPWalkL/43dbvPPGXT+j89YLtq9ZO+14pvWwMe BDahJmicuTVYsBKZtriFFGwkjWD/TMWW0AiNW02pxdD0U7/iEQAm7FaaaLHCsx6pLG4bBZtHU9g/ U7ElNELTVlOq///c1aU5/kkIABN2K02kyGMpG0bT2T9TsSU0gtXUOALAhO21oRZLPasyuMVNomCr aBb7Zyq2hEZYutc9AtvDznQCpvEWf/+n2hNRB6p/gCAc7ncmANAGMgAV1T8AvEoAoLVkgGhU/wCw CQGAllDnBaf6B4jGTn5nOgFP2IxawFn/QsAtWfXfPvbPVGwJjWA1NY4AMGF7bYeltSDR+Dk3nf0z FVtCI1hNjaMJENA2jj0AsIYAQNso/oKzAQDAegIALaQEDMuqB4BX6QMwoXSgufR8KPgJt4n9MxVb QiNYTY0jAEzYXmkuGzMtY5OmYktoBKupcTQBAgCAQAQAAAAIRAAAAIBABAAAAAhEAAAAgEAEAAAA CEQAAACAQAQAAAAIRAAAAIBABAAAAAhEAAAAgEAEAAAACEQAAACAQAQAAAAIRAAAAIBABAAAAAhE AAAAgEAEAAAACEQAAACAQAQAAAAIRAAAAIBABAAAAAhEAAAAgEAEAAAACEQAAACAQAQAAAAIRAAA AIBABAAAAAhEAAAAgEAEAAAACEQAAACAQAQAAAAIRAAAAIBABAAAAAhEAAAAgEAEAAAACEQAAACA QAQAAAAIRAAAAIBABAAAAAhEAAAAgEAEAAAACEQAAACAQAQAAAAIRAAAAIBABAAAAAhEAAAAgEAE AAAACEQAAACAQAQAAAAIRAAAAIBABAAAAAhEAAAAgEAEAAAACEQAgH06G8njAAA1IwDA3kzX/TIA AFBPAgDsx2LFLwMAADV09vLykgfjmavPIi8K3mhVrX+0jcrGTMvYpKk4k9JEfrD15woAvJXjEwDQ IAIAvInqHwBoFgEAdqf6BwAaRwCAHan+AYAm0gl4Qp8VNre0+i82oVNtVDZmWsYmTYstPYJUbOoc hysAsLVV1X8eAoAV1lT/hfWvwr4IALAd1T8Au9mkvpcBOAIBALag+gdgN5tX9jIAhyYAwJuo/gFY ryjot63pZQAOSgCATS3ujlX/AKynlKeGBADYiOofgG2tqv4XjyCLUyQHDkcAgNfZCwOwrc2r/4oM wNEIAPCKpftfp/8BWGPb6n8VGYBDEABgHdU/ANtadex49fCxdAYZgL0TAGAl1T8A23rjscNRhiMQ AGA51T8Ae7HtsWNxfhcB2C8BAJZQ/QOwF7sdO2QADkoAgHnHrP6Lv1XJ4wA03PTxwpkj6kkAgBlL a/HDVf95yKkdgBYpjhqVPL6TN74d1hAAYOJo1X/xh1T8AKw3fQCSB9gjAQCyY1b/eQgA1ioOQ5U8 DvsgAMDK8/GH2OGuqv7t3AGA4xAAiO5oFXmZMlT/AJzE8/3Hs+vHPEJwAgAscYjqPw/NKv6Q6h+A vXq8rs45Ja/W/CkYSAbRCAAw75jVfx4CgP0oCvqrQe+hPL/08tAbXH28f84vvS5FB2EgAAEAZuy3 KK9Ov+SRWfv9QwA0XXXIKOTxHT39GXZ6ny6rkctPvc7wz1M1stz5za+Xl295foIQAODYypMyqn8A Jqbr/rdlgIv33c7gS3XW//n+y2CSBpJx66DJdYHRWf/UFuhq0OkMrtLr1XWA6cZE21xJoOYEADgq pT8Ah3R+8+up37m9SDX7xffPT9Nn9wdXX94/pZNQ5RxzbX3SpYCHXqdTNR8q3pUaE/3ul/Mnv27O 85w0ngAAGyq7SWUrG0gWe8g8tEL+gH3Lnw5AExx2v/388/uwqOP7/W5nOFvm9x5yFX9+c9frDH6s OphVzt996Ay//3Tev4UEANjI4/XFbSefB9m2TxUAVDY5a/PquaR1nu8/Xtx+eHh5+XaTGve/6Yh1 +e3l4UN1LUEDoHYRAGADqRVlt/9fvvp5+W+/65wIAFvapPR/U/VfmOkDvLoX8PPf33lovSIDlFIQ kAHaQwCADaT96Yd348aP5VXR9XdVOKG3HjwAOLqqzM4jb1H2AR637Sl7AXff/3/XZ2f/70/qA5CL +LKV0Ezv4Inff5fU+eljaQ8BAF63cKIk7QiX7iFPTvUPENr5za/U7KdstnN2VrZe/XXzf6vXuv2H z9+r3sFp+pJ7f5aXuMtGP9ePM7cASs2K9AJuj7PI5UKxPeehksoppk02g1GLyvG+Mk34/rnYpy7Z F8594DTbGGzI/pm2WnWMsJFzTK4AwOtSk58Zc02CNrUmGwAQQVHoV/I4nIIAABuYa/KTmgR131/k sa3IAAAcjn66bEIToAlxPKbNNoOZRkCP12dXnakGQbM2LPFtb7CG/TOtZyPnhASACb+9mDbeDFLZ P6gGu6lL1aoGQIsfODdlzCYHq9g/03o2ck5IAJjw24tp75vB0g+cmzhmq4Ol7J9pPRs5J6QPABxD sWdfunNfFQwAAA5EAIDjkQEAgJMTAOCoZAAA4LQEADi2pRkAAOA4BAA4ARkAADgVAQBOYzoDyAMA wNEIAHAyRd1fyeMAAIcnAAAAQCACAAAABCIAAABAIAIAAMCxTXcA0xmMIxMAAABOoLwNRJLH4VgE AAAACEQAgCUer8+S68c8PvJ8/zFN/3j/PDNeWpgZAKCGBABYbfBjtqh//Ho77Ha7eayICRd/7qrL t0/97uBqnAsAAGpLAIAVev2iqP8yXdM//hh0+3ef81inc/nt5dtlNXh+c9frDP88VWMAALUlAMAq 7/753B1+/zlOAKn+//zPRR4DAGgkAQBWOp9OAM/3X1L9f16OLEivdnqf8vUAAIDaEgAmcldOgsmr f6mpBPD88/uwd3ezvP5/vv/f7bD3MGoPBABQXwIArJGa9g9vvz5W9f+KE/yP1xe3nf6T8h8AaAIB ANa6/NTrDH5cf71dUf8/Xp9dDXoPv1ZcGwCAN0q3pnarafZJAID1ygQwWN7AP1f/43sBAcAy04+N KSnoOSUBAF6REkCn2/93ocgvO/52OoOrvDcveBIAACt0+0/Vo2MSZ444pbNiG8yDIRUlWzUQfDlE Nt4GKm/fEvb+gRCQ3xEt83z/8eL756fd2oumy80dV5vZo+hXAIqDSiWPAwAcSWoZdP2Y2viXpi4j T9oMfbz/m6fBvmgCBABweMPbi1zTz/QAGFx9eV+2DXroDW//V0WAfHfp8hTl3Z/b1N4U9kgAAAA4 vKk+ANOtecY3kktdzoZ/noqhdOvpcd+zy28PvXIA9kYAAACok6c/w86Hd24vzcEIAAAAdXLxvtv5 /ddt5TgYAQAAoE7O333oDL//zN0BPl7pA8CeCQBQF7lr2OzdDwFoialOwK89COzy21O/U81+8efu qd/N02E/oj8HAIq9ax4qvf0XsdsH7v1rQKP5RQAcjisAcGJFoTNX6wAAHI4AAKek9AcAjkwAgNNY c+JfawcA4HAEADiBNSf+Vf8AwEEJAHBU60/8q/4BgEMTAOB4nPgHAE5OAIAjceIfAKgDAQAOrmz1 o78vAFALAgAclhP/AECtCABwAkp/AOBUBAA4Kif+AYDTOlOLENxcE51NfhGP12dXg97Dy7fLPGHG qjY/wM4cqgD2yBUA2EpR/BfVfx4BAGgcAQC28Hh9Nej2nx56eRw4ChfWAPZIAIAtXH57efl1c57H ltNWAQCoMwEAAAAC0QmY6HboBFz2Au6s6gRcWN9cwY8ONrHLbxOADbgCAAAAgQgAcGy6MwIAJyQA wMFpugAA1IcAADPOSnlkQXoKQCE9CGBwlYY+3j/nl7ZSvDMPAQAcl07ARLeqFn/LT2PuM6uPWjoR WMVPBuBAXAEgulVVxaFP0h/68wEAlhIA4EgZwPlLAKAOBABIiup8aYFeZIDDnao/3CcDAKwiAMDE qpP0+6rUFz9fBgAAjkwAgBmHzgAAAKclAMC8g2YAFwEAgNMSAGCJokxfGgOKYv3t9frSTwYAOA4B AFZaVanv/Zz93j8QAGAVAQDWOVAGcBEAADgVAQBecbTrAAAARyAAwOuKDLA0BhQZYOcYMP2BSz8c AOAQBADY1Koy/S0ZoJLHAQAOTwCAPdg5AwAAHJkAAPshAwAAjSAAwN6kDgFiAABQbwIA7JkMAADU mQAAu9N/FwBoHAEA3kQGAACaRQCAtyrv5CkGAADNIADAfsgAAEAjCACwN6sygG7BAEB9CACwT64D AAA1JwDAnqUOAWIAAFBXAgAcxHQGkAcAgPoQAOBQyisBSR4HAKgBAQAAAAIRAGBHTu0DAE0kAMCm 3M0TAGgBAQAAAAIRAAAAIBABAAAAAhEAAAAgEAEAgGY7G8njAKwlAABwGrlsf1vhPv32N34UQBAC AAAnsJfCXcUPsAMBAIDT26GUV/0D7EYAAKAWtirol87s+dwAmxAAADiBpcX6hhlA9Q/wFgIAAKex WwZQ/QO8kQAAwMlsW7ir/gHeTgCATU0XGQoO2JfFX9OqiwCqf4C9OLPrBODkXm35s5RDGMAOXAEA 4PR2KOVV/wC7EQAAaB7VP8DOBAAAamHzml71D/AWAgAAdbFJZa/6B3gjAQCAGllf36v+Ad7OXYAA WG63O/O0nuMm0HSuAMChPF6fnV0/5hGovaLcn5NfYFZeOlPyCwANIQDANp7vP+Yj/u61fQoGy96f P/vj/fPMeEmQ4JCqrSyPsL1qARbyOEC9CQCwucfri9tO/+kleXr/5W1V+eDH7Nsfv94Ou91uHkt/ 689d+ZdenvrdwdU4F8C+5KJV2bo/lifQCAIAbOz57+9O9/M/5+XI+c2vb5fl0C56/aKo/zJd0z/+ GHT7d5/zWKdz+e1l9PnnN3e9zvDPUzUGe6FOPRwxAKg5AQA2dv7uQ2d4+3XxvP8OjXXe/fO5O/z+ c5wAUv3/+Z+LPAYHVG2peWSt6hIUc/LSec2GCxng+AQA2Nzlt4deZ3BVHNenGuQU1f/F7YeHqjJ4 6v/esLHO+XQCeL7/kur/6trCgvRqp/dp9+sNsKFqMx7LU5mVl85InrqMDADUkwAA27j8Vhzvn/rd 4e1FPtn//PP7sNv/d6q1zvSJ/TWmEkD6jN7dzfL6//n+f7fD3sMb2hvBxNKStCpkC3mcbeRlt2Lp yQBADQkAsLXzm18pBHTGjfjLOJBdDTZtrl+GhdSiqKz/V5zgz/2Olf/sQ7GB5qEpqypXtrUmBgDU igAAO0nn7/Ngp9PNdwYa2bRcv/zU6wx+XH+9XVH/P14XeaL38GvFtQF4s2JzzUPsyeIiXZq7AE5I AIBNpa6+4y6+5U07U6v9siXPsp7BmygTwGB5A/9c/W+cJmBbqv8DsWCBmhMAYFPnN78eOqkHcHL1 u/9UnZkvJqeuv3l6ssXzAVIC6Ey6EEyUHX87VY/jzJMAAIA9OHOiAiCIIkfmodLh9v/l9as8XLaR W9qObXQHrS2ucu3wltM42qIG2IErAAAcQG98b9zO7cXu16+KLLHNRTUAXicAAHBAq59kne6nteW5 /B3eAsA8AQCA43i8Pvt4/1g9ODtdE5g6u1/1sU8TStUVgzQxNSWq+sKUc772llJ6ZZr+MwAzBAAA Dujxuqjhxze6Gt5e/blLLYOW9AoYXH15X95R96E3vP1fUbSn8/0PvVFromUn/hfeUsgPz0hT0/M6 VvVAAIhLAADgAEa3sJq7m+2ap1qPn3mR7o612fP0lrzl+e/vTnmL3kJ5l97NHswHEIgAAMABjDoB H7vN/vm7D53h95/lxYD0lO3u+4tyOgAjAgAAbTO8vUhXH9ItQ7X/AZgnAABQb7//btGJ9/HHoFv1 AEjcMQhgkQAAQH1d/tvvVufzN3wawOW3p8/fy/P/macIAMzxJGCAKIpqOA+VWrn/n39W8OP12VXn +I8OjrCogeZyBQCAdpnq95vuCQTALFcAAKKIcVq6vAYwzCPl3YhO0BHAFQCgzgQAgChUpUdjUQN1 pgkQAAAEIgAAAEAgAgAAAAQiAAAAQCACAAAABCIAAHAYj9dnBU/iBagZAQCAg3j8Mej1ep3BjyMk gJQ1JA2AzQgAABzA8/2XQe/Tt3/73aMkAAA2JgAAsH/PP78Pe58uO+f/fJ5OAM/3Hz/eP1dtgwrF cH6hfClPnTqZX8z58f6xeqWaeXG2NOVq0OkMrkbT0pTJ9YDpqwPjv1yY/uMAkQgAAOzdqP7vVAng y1StPby9+PL+6aXw1O/cXoyL+Is/d2li4aE3uJrU78Pbq+qVXzfnS2c7v/lVDHc6vYc09Vv6o8sV 77763S//dFJ8Xn4BIBYBAIB9m9T/VQIYfv85SQC9h1x6n9/cjboIpCJ+XLpfvO92fv8dv6H3MH5l 3WyvO3/3oTPzTQBiEgAA2LNU/+cWOYWL2+EGdXdqtpOlN6yy4WzLXX57efhwe1G+WwMgIC4BAID9 evx6O6za42RP/dlrACPPf393uu8vyrL+4vbD6C3F7HmGORvOtk6RAUopCMgAQFACAAB79fhj0Bm1 /6nMtgIaXOXKu7xQ8OHdfEv8lB/y4DoLs02aA6W2PqOex4/XqYPwgtR+CCAoAQCAfVqs/3MCuP1a leS9h7s/ZTOci9tO/6ls0n9+81+/O2oz9OV9v1fOuGD1bJf/9os/kD617D18+S31EC5n+/FpfKVg +hZA6UqCXsBAUGcvLy95EIBWK+rePFQ6xf4/NeL5c7fuVj3tUINFDbCSKwAAABCIAAAAAIFoAgQQ xVy7lIJDwCFYzkDNuQIAEMViGbpYqvJGqn+g/gQAgNCKglUM2AtLEmgKTYAAYnm1SHVc2JyFCTSR AAAQzm4nqsMeL3Y+r+8IC9STAAAQkcYqB+XYCtSZAAAQlxhwCA6sQM0JAABIAnvgeAo0hQAAwIQk sC2HUaBxBAAANhI2GzhQAi0jAAAAQCAeBAYAAIEIAAAAEIgAAAAAgQgAAAAQiAAAAACBCAAAABCI AAAAAIEIAAAAEIgAAAAAgQgAAAAQiAAAAACBCAAAABCIAAAAAIEIAAAAEIgAAAAAgQgAAAAQiAAA AACBCAAAABCIAAAAAIEIAAAAEIgAAAAAgQgAAAAQiAAAAACBCAAAABCIAAAAAIEIAAAAEIgAAAAA gQgAAAAQiAAAAACBCAAAABCIAAAAAIEIAAAAEIgAAAAAgQgAAAAQiAAAAACBCAAAABCIAAAAAIEI AAAAEIgAAAAAgQgAAAAQiAAAAACBCAAAABCIAAAAAIEIAAAAEIgAAAAAgQgAAAAQiAAAAACBCAAA ABCIAAAAAIEIAAAAEIgAAAAAgQgAAAAQiAAAAACBCAAAABCIAAAAAIEIAAAAEIgAAAAAgQgAAAAQ iAAAAACBCAAAABCIAAAAAIEIAAAAEIgAAAAAgQgAAAAQiAAAAACBCAAAABCIAAAAAIEIAAAAEIgA AAAAgQgAAAAQiAAAAACBCAAAABCIAAAAAIEIAAAAEIgAAAAAgQgAAAAQiAAAAACBCAAAABCIAAAA AIEIAAAAEIgAAAAAgQgAAAAQiAAAAACBCAAAABCIAAAAAIEIAAAAEIgAAAAAgQgAAAAQiAAAAACB CAAAABCIAAAAAIEIAAAAEIgAAAAAgQgAAAAQiAAAAACBCAAAABCIAAAAAIEIAAAAEIgAAAAAgQgA AAAQiAAAAACBCAAAABCIAAAAAIEIAAAAEIgAAAAAgQgAAAAQiAAAAACBCAAAABCIAAAAAIEIAAAA EIgAAAAAgQgAAAAQiAAAAACBCAAAABCIAAAAAIEIAAAAEIgAAAAAgQgAAAAQiAAAAACBCAAAABCI AAAAAIEIAAAAEIgAAAAAgQgAAAAQiAAAAACBCAAAABCIAAAAAIEIAAAAEIgAAAAAgQgAAAAQiAAA AACBCAAAABCIAAAAAIEIAAAAEIgAAAAAgQgAAAAQiAAAAACBCAAAABCIAAAAAIEIAAAAEIgAAAAA gQgAAAAQiAAAAACBCAAAABCIAAAAAIEIAAAAEIgAAAAAgQgAAAAQiAAAAACBCAAAABCIAAAAAIEI AAAAEIgAAAAAgQgAAAAQiAAAAACBCAAAABCIAAAAAIEIAAAAEIgAAAAAgQgAAAAQiAAAAACBCAAA ABCIAAAAAIEIAAAAEIgAAAAAgQgAAAAQiAAAAACBCAAAABCIAAAAAIEIAAAAEIgAAAAAgQgAAAAQ iAAAAACBCAAAABCIAAAAAIEIAAAAEIgAAAAAgQgAAAAQiAAAAACBCAAAABCIAAAAAIEIAAAAEIgA AAAAgQgAAAAQiAAAAACBCAAAABCIAAAAAIEIAAAAEIgAAAAAgQgAAAAQiAAAAACBCAAAABCIAAAA AIEIAAAAEIgAAAAAgQgAAAAQiAAAAACBCAAAABCIAAAAAIEIAAAAEIgAAAAAgQgAAAAQiAAAAACB CAAAABCIAAAAAIEIAAAAEIgAAAAAgQgAAAAQiAAAAACBCAAAABCIAAAAAIEIAAAAEIgAAAAAgQgA AAAQiAAAAACBCAAAABCIAAAAAIEIAAAAEIgAAAAAgQgAAAAQiAAAAACBCAAAABCIAAAAAIEIAAAA EIgAAAAAgQgAAAAQiAAAAACBCAAAABCIAAAAAIEIAAAAEIgAAAAAgQgAAAAQiAAAAACBCAAAABCI AAAAAIEIAAAAEIgAAAAAgQgAAAAQiAAAAACBCAAAABCIAAAAAIEIAAAAEIgAAAAAYXQ6/z9HsxgK aMO8WgAAAABJRU5ErkJggg== "
       id="image77" />
    <rect
       style="fill:#ff8080"
       id="rect181"
       width="101.0022"
       height="239.31085"
       x="870.07886"
       y="57.834404" />
    <rect
       style="fill:#0000ff"
       id="rect249"
       width="295.6813"
       height="88.176613"
       x="767.08636"
       y="-51.275131" />
    <rect
       style="fill:#0000ff"
       id="rect273"
       width="3.0468638"
       height="15.232661"
       x="876.73492"
       y="40.93602" />
    <rect
       style="fill:#0000ff"
       id="rect275"
       width="3.9040956"
       height="12.263907"
       x="889.3443"
       y="42.925972" />
    <rect
       style="fill:#0000ff"
       id="rect277"
       width="3.6360621"
       height="12.185129"
       x="900.38867"
       y="43.987484" />
    <rect
       style="fill:#0000ff"
       id="rect279"
       width="2.3056786"
       height="13.178663"
       x="910.93164"
       y="42.867779" />
    <rect
       style="fill:#0000ff"
       id="rect281"
       width="3.235889"
       height="11.014759"
       x="921.32684"
       y="44.17083" />
    <rect
       style="fill:#0000ff"
       id="rect283"
       width="3.3839822"
       height="11.936812"
       x="934.17249"
       y="43.936062" />
    <rect
       style="fill:#0000ff"
       id="rect285"
       width="3.1519287"
       height="11.886766"
       x="946.3313"
       y="44.660152" />
    <rect
       style="fill:#0000ff"
       id="rect287"
       width="2.7472229"
       height="10.735643"
       x="957.14496"
       y="45.097404" />
    <text
       xml:space="preserve"
       style="font-style:normal;font-weight:normal;font-size:16.5331px;line-height:1.25;font-family:sans-serif;fill:#000000;fill-opacity:1;stroke:none;stroke-width:0.413326"
       x="861.24896"
       y="74.809227"
       id="text2689"
       transform="scale(1.0200456,0.98034831)"><tspan
         sodipodi:role="line"
         id="tspan2687"
         x="861.24896"
         y="74.809227"
         style="stroke-width:0.413326">001 001 xx</tspan><tspan
         sodipodi:role="line"
         x="861.24896"
         y="95.475601"
         id="tspan2691"
         style="stroke-width:0.413326">001 010 xx</tspan><tspan
         sodipodi:role="line"
         x="861.24896"
         y="116.14198"
         id="tspan2693"
         style="stroke-width:0.413326">001 011 xx</tspan><tspan
         sodipodi:role="line"
         x="861.24896"
         y="136.80835"
         id="tspan2695"
         style="stroke-width:0.413326">011 001 0 x</tspan><tspan
         sodipodi:role="line"
         x="861.24896"
         y="157.47473"
         id="tspan2697"
         style="stroke-width:0.413326">011 010 1 x</tspan><tspan
         sodipodi:role="line"
         x="861.24896"
         y="178.1411"
         id="tspan2699"
         style="stroke-width:0.413326">110 0 0 1 xx</tspan><tspan
         sodipodi:role="line"
         x="861.24896"
         y="198.80748"
         id="tspan2701"
         style="stroke-width:0.413326">100 100 0 x</tspan><tspan
         sodipodi:role="line"
         x="861.24896"
         y="219.47385"
         id="tspan2703"
         style="stroke-width:0.413326">011 011 0 x</tspan><tspan
         sodipodi:role="line"
         x="861.24896"
         y="240.14023"
         id="tspan2705"
         style="stroke-width:0.413326">011 100 1 x</tspan><tspan
         sodipodi:role="line"
         x="861.24896"
         y="260.80661"
         id="tspan2707"
         style="stroke-width:0.413326">101 0 0 1 xx</tspan><tspan
         sodipodi:role="line"
         x="861.24896"
         y="281.47299"
         id="tspan2709"
         style="stroke-width:0.413326">100 101 0 x</tspan><tspan
         sodipodi:role="line"
         x="861.24896"
         y="302.13934"
         id="tspan2711"
         style="stroke-width:0.413326">010 101 xx</tspan><tspan
         sodipodi:role="line"
         x="861.24896"
         y="322.80573"
         id="tspan2713"
         style="stroke-width:0.413326" /></text>
    <path
       sodipodi:type="star"
       style="fill:#00ffff"
       id="path5229"
       inkscape:flatsided="false"
       sodipodi:sides="5"
       sodipodi:cx="412.72888"
       sodipodi:cy="-199.0596"
       sodipodi:r1="221.96651"
       sodipodi:r2="110.98325"
       sodipodi:arg1="1.5374653"
       sodipodi:arg2="2.1657839"
       inkscape:rounded="0"
       inkscape:randomized="0"
       d="m 420.12588,22.78362 -69.60294,-129.93183 -146.4937,-16.3231 102.06402,-106.34748 -29.74485,-144.3679 132.68198,64.20548 128.11037,-72.90118 -20.06205,146.02865 108.92141,99.3125 -145.08101,26.04519 z"
       inkscape:transform-center-x="-1.6506852"
       inkscape:transform-center-y="13.365626"
       transform="matrix(0.72214798,0,0,0.70307573,172.62686,-26.074557)" />
    <rect
       style="fill:#00ff00"
       id="rect5333"
       width="151.24121"
       height="23.358503"
       x="405.48654"
       y="12.215908" />
    <text
       xml:space="preserve"
       style="font-style:normal;font-weight:normal;font-size:19.2856px;line-height:1.25;font-family:sans-serif;fill:#000000;fill-opacity:1;stroke:none;stroke-width:0.482141"
       x="514.03375"
       y="5.1782117"
       id="text9297"
       transform="scale(0.92456031,1.0815952)"><tspan
         sodipodi:role="line"
         id="tspan9295"
         x="514.03375"
         y="5.1782117"
         style="stroke-width:0.482141">IR</tspan></text>
    <path
       style="fill:none;stroke:#000000;stroke-width:1px;stroke-linecap:butt;stroke-linejoin:miter;stroke-opacity:1"
       d="m 764.73871,0.9532718 c -2.85925,0.0628731 -5.52935,0.2262238 -8.17083,-0.65426995 -3.44816,-1.14938704 -12.81483,0.65426995 -16.258,0.65426995 -13.16927,0 -26.32042,-0.11297673 -39.42519,0.65427 -5.89706,0.3452559 -11.39409,1.7550577 -17.2487,2.1615986 -10.81093,0.7507038 -21.42704,1.483843 -32.15208,3.2713498 -4.47825,0.7463748 -9.34531,0.1949568 -13.79965,1.3085399 -3.44209,0.8605238 -7.01466,0.6178083 -10.46831,1.3085399 -0.30244,0.060487 -0.35184,0.593783 -0.65427,0.65427 -1.72416,0.34483 -3.48944,0.43618 -5.23416,0.65427 -2.54823,0.318529 -5.33711,0.151444 -7.85124,0.65427 -1.35254,0.270507 -2.55695,1.137456 -3.92562,1.30854 -1.08203,0.135253 -2.20687,-0.236552 -3.27135,0 -0.95211,0.211578 -1.67928,1.040596 -2.61708,1.30854 -0.6291,0.179741 -1.32125,-0.128313 -1.96281,0 -3.48548,0.697095 -6.8353,1.446133 -10.45203,1.962809 -1.36546,0.195066 -2.57308,1.038033 -3.92562,1.30854 -1.61321,0.322643 -3.68043,-0.517908 -5.23416,0 -2.4065,0.802168 0.74213,0.65427 -1.28174,0.65427"
       id="path9970" />
    <path
       style="fill:#800000;stroke:#000000;stroke-width:1px;stroke-linecap:butt;stroke-linejoin:miter;stroke-opacity:1"
       d="m 588.07959,2.4397952 c -6.06678,4.8488042 -13.02287,8.7798988 -16.53763,15.7966818 -0.48803,0.974299 -6.0573,6.65675 -5.68421,6.865082 0.47768,0.266734 2.53992,-0.103318 3.04854,0 5.64273,1.146226 8.82963,1.666573 14.48753,2.086245 1.30079,0.09649 6.62828,0.65673 7.9319,1.30854 1.80542,0.902707 6.12484,2.608913 8.18652,2.608913"
       id="path9972" />
    <rect
       style="fill:#800000"
       id="rect10031"
       width="20.93005"
       height="72.877922"
       x="834.52417"
       y="287.54724" />
    <rect
       style="fill:#800000"
       id="rect10033"
       width="18.358932"
       height="84.138603"
       x="978.91034"
       y="281.87628" />
    <rect
       style="fill:#800000"
       id="rect10035"
       width="125.55606"
       height="10.599541"
       x="855.49438"
       y="322.57376" />
    <path
       style="fill:none;stroke:#000000;stroke-width:1px;stroke-linecap:butt;stroke-linejoin:miter;stroke-opacity:1"
       d="m 760.44598,326.7143 c 9.54228,1.26077 19.14156,2.21499 28.64875,3.27135 2.85266,0.31696 5.65643,1.60669 8.50551,1.96283 2.96845,0.37105 5.57851,0.0689 8.50551,0.65427 2.62095,0.52419 5.94927,-0.83656 8.48071,0 2.53866,0.83894 0.0698,0.64588 2.61708,0.64588"
       id="path10150" />
    <path
       style="fill:none;stroke:#000000;stroke-width:1px;stroke-linecap:butt;stroke-linejoin:miter;stroke-opacity:1"
       d="m 817.60083,308.55248 c 3.66478,4.85188 9.20651,15.72152 10.24042,21.91183 0.27332,1.63641 0.12562,3.64499 0.65427,5.21747 0.35176,1.04629 0.65427,1.75762 0.65427,3.05059 0,0.25903 0.64998,0.31069 0.54953,0.54945 -0.93731,2.22778 -0.57032,0.43804 -1.5511,0.94866 -1.47133,0.76601 -2.75381,2.75381 -3.95062,3.95062 -4.31963,4.31963 -9.09561,9.57267 -13.61304,12.78146"
       id="path10152" />
    <text
       xml:space="preserve"
       style="font-style:normal;font-weight:normal;font-size:26.386px;line-height:1.25;font-family:sans-serif;fill:#000000;fill-opacity:1;stroke:none;stroke-width:0.65965"
       x="628.97144"
       y="357.88736"
       id="text12422"
       transform="scale(1.1817799,0.84618123)"><tspan
         sodipodi:role="line"
         id="tspan12420"
         x="628.97144"
         y="357.88736"
         style="stroke-width:0.65965">Gire</tspan></text>
    <path
       style="fill:none;stroke:#000000;stroke-width:1px;stroke-linecap:butt;stroke-linejoin:miter;stroke-opacity:1"
       d="m 371.9054,20.584046 c 3.27158,-0.08688 6.54755,-0.944199 9.8448,-0.473162 1.21148,0.173068 2.47733,0.860925 3.59035,1.304467 1.29682,0.516785 2.89047,0.754356 4.25276,0.981405 0.43618,0.109045 0.87236,0.21809 1.30854,0.327135 0.10904,0.109045 0.17752,0.289733 0.32713,0.327135 1.09045,0.272612 0.72697,-0.181742 1.63568,0 1.2807,0.25614 2.52719,0.44651 3.59023,0.981405 0.29222,0.147042 0.67079,-0.10267 0.9814,0 0.85752,0.283449 6.14009,1.337249 6.14009,0.09186"
       id="path15331" />
    <text
       xml:space="preserve"
       style="font-style:normal;font-weight:normal;font-size:16.8013px;line-height:1.25;font-family:sans-serif;fill:#000000;fill-opacity:1;stroke:none;stroke-width:0.420033"
       x="374.45526"
       y="17.262274"
       id="text16743"
       transform="scale(0.94154485,1.0620843)"><tspan
         sodipodi:role="line"
         id="tspan16741"
         x="374.45526"
         y="17.262274"
         style="stroke-width:0.420033">LoadIR</tspan></text>
    <text
       xml:space="preserve"
       style="font-style:normal;font-weight:normal;font-size:40px;line-height:1.25;font-family:sans-serif;fill:#000000;fill-opacity:1;stroke:none"
       x="439.04214"
       y="-147.78151"
       id="text19245"><tspan
         sodipodi:role="line"
         id="tspan19243"
         x="439.04214"
         y="-147.78151">M C</tspan></text>
    <text
       xml:space="preserve"
       style="font-style:normal;font-weight:normal;font-size:22.9297px;line-height:1.25;font-family:sans-serif;fill:#000000;fill-opacity:1;stroke:none;stroke-width:0.573243"
       x="363.642"
       y="35.557285"
       id="text51859"
       transform="scale(1.1407196,0.87663961)"><tspan
         sodipodi:role="line"
         id="tspan51857"
         x="363.642"
         y="35.557285"
         style="stroke-width:0.573243">001 001 xx</tspan></text>
    <path
       style="fill:none;stroke:#000000;stroke-width:1px;stroke-linecap:butt;stroke-linejoin:miter;stroke-opacity:1"
       d="m 433.67647,1.6546433 c 0.0523,-7.2772409 1.07183,-14.8230963 2.82965,-21.8323863 0.21087,-0.840863 -0.17043,-1.750721 0,-2.600707 0.42176,-2.103531 1.4287,-3.67667 1.95079,-5.758526 0.39862,-1.589541 0.1473,-3.69894 0.65427,-5.226133 0.32573,-0.981245 1.30051,-2.832028 1.30051,-3.232454"
       id="path53366" />
    <path
       style="fill:none;stroke:#000000;stroke-width:1px;stroke-linecap:butt;stroke-linejoin:miter;stroke-opacity:1"
       d="m 424.98863,-34.95672 c 1.29035,-1.811193 3.82381,-2.097543 5.34437,-3.619849 2.33727,-2.339955 4.49969,-4.849535 6.67792,-7.338215 3.78161,0.316982 0.75113,-1.809321 1.32723,-2.589725 1.5816,-2.142522 9.39239,-6.16015 9.39239,-8.449103 0,-0.602703 -0.0689,1.209353 0,1.808107 -0.16849,3.102545 1.17628,5.946357 1.56379,8.949989 0.33658,2.608831 0.3156,4.948266 0.65427,7.584125 0.77418,6.025363 3.6746,11.29338 3.6746,17.693761"
       id="path53368" />
    <path
       style="fill:none;stroke:#000000;stroke-width:1px;stroke-linecap:butt;stroke-linejoin:miter;stroke-opacity:1"
       d="m 393.67149,-187.65457 c -6.26697,-3.13564 -12.37565,-4.02372 -18.34095,-6.01215 -4.44568,-1.48189 -19.79996,1.24011 -24.83782,1.95468 -1.5115,0.21439 -3.08291,-0.29939 -4.57989,0 -0.95639,0.19128 -1.67087,1.07199 -2.61708,1.30854 -1.73057,0.43265 -3.49462,0.72869 -5.23416,1.30854 -8.11662,2.70554 -16.91737,4.2065 -24.86226,7.19697 -7.85831,2.95789 -15.67013,7.13931 -22.91091,11.48642 -6.99908,4.20202 0.96549,0.10455 -4.61115,3.2901 -5.37188,3.06859 -10.72137,6.25576 -15.7645,9.858 -3.83859,2.74185 -20.93664,13.94115 -20.93664,18.31956"
       id="path53370" />
    <path
       style="fill:none;stroke:#000000;stroke-width:1px;stroke-linecap:butt;stroke-linejoin:miter;stroke-opacity:1"
       d="m 237.9544,-158.23733 c -0.78932,5.75267 -2.32695,11.44489 -3.81293,17.06369 -0.58986,2.23039 -6.38614,19.64305 -5.27385,21.0475 0.75398,0.95202 6.89151,0.6102 8.04351,0.42355 11.04936,-1.79019 23.3487,-7.1066 33.54977,-11.79373 1.02635,-0.47158 6.57193,-2.93085 6.57193,-3.94315"
       id="path53372" />
    <text
       xml:space="preserve"
       style="font-style:normal;font-weight:normal;font-size:17.2443px;line-height:1.25;font-family:sans-serif;fill:#000000;fill-opacity:1;stroke:none;stroke-width:0.431108"
       x="282.00278"
       y="-180.89235"
       id="text60790"
       transform="scale(0.86705401,1.1533307)"><tspan
         sodipodi:role="line"
         id="tspan60788"
         x="282.00278"
         y="-180.89235"
         style="stroke-width:0.431108">Barramento </tspan><tspan
         sodipodi:role="line"
         x="282.00278"
         y="-159.33698"
         id="tspan60792"
         style="stroke-width:0.431108">de Controle</tspan></text>
    <text
       xml:space="preserve"
       style="font-style:normal;font-weight:normal;font-size:26.2746px;line-height:1.25;font-family:sans-serif;fill:#000000;fill-opacity:1;stroke:none;stroke-width:0.656864"
       x="658.84021"
       y="185.70222"
       id="text64450"
       transform="scale(1.1967636,0.83558691)"><tspan
         sodipodi:role="line"
         x="658.84021"
         y="185.70222"
         id="tspan64452"
         style="stroke-width:0.656864">Loop:</tspan></text>
    <path
       style="fill:none;stroke:#000000;stroke-width:1px;stroke-linecap:butt;stroke-linejoin:miter;stroke-opacity:1"
       d="m 352.64313,-109.30174 c -3.13518,-0.20209 -5.82358,1.56551 -8.71521,2.28841 -5.53248,1.38312 -11.62975,1.508 -17.23497,2.78662 -0.80966,0.18469 -1.51072,0.7115 -2.31319,0.92528 -4.8132,1.28221 -9.64312,2.23422 -14.38831,3.842576 -6.5443,2.21816 -5.81594,2.304881 -12.52166,4.942687 -3.09536,1.217612 -6.34475,2.055553 -9.35851,3.463084 -2.22149,1.03752 -5.05879,3.113761 -7.11043,4.29395 -1.83416,1.055092 -3.81764,1.851167 -5.59301,3.002436 -1.1788,0.764407 -2.05903,1.92956 -3.2239,2.715024 -1.42475,0.960694 -3.05645,1.580802 -4.50887,2.499121 -5.41034,3.420793 -10.54893,7.257909 -15.9422,10.705552 -2.66883,1.706045 -5.49245,3.171382 -8.09518,4.97667 -1.87699,1.301908 -3.50202,2.936258 -5.31555,4.325209 -3.56505,2.730416 -7.44863,5.028371 -11.00419,7.771139 -2.71021,2.090668 -0.77106,1.871168 -2.80243,1.871168"
       id="path65361" />
    <path
       style="fill:none;stroke:#000000;stroke-width:1px;stroke-linecap:butt;stroke-linejoin:miter;stroke-opacity:1"
       d="m 215.65893,-64.767246 c -2.12411,4.719931 -4.42831,9.521195 -7.21369,13.888395 -1.66132,2.604806 -3.71113,5.058133 -4.67102,7.858787 -0.55407,1.616598 -1.94613,3.158688 -1.38792,5.036745 0.52762,1.775107 6.09193,1.005979 8.56205,1.005979 2.23181,0 4.47106,0.18218 6.69541,0 3.41111,-0.279378 6.76865,-1.471732 10.17805,-1.850555 3.72211,-0.413567 7.58964,0.368929 11.10333,-1.387916"
       id="path65363" />
    <text
       xml:space="preserve"
       style="font-style:normal;font-weight:normal;font-size:20.1115px;line-height:1.25;font-family:sans-serif;fill:#000000;fill-opacity:1;stroke:none;stroke-width:0.502788"
       x="234.6494"
       y="-83.717239"
       id="text67303"
       transform="scale(0.97732901,1.0231969)"><tspan
         sodipodi:role="line"
         id="tspan67301"
         x="234.6494"
         y="-83.717239"
         style="stroke-width:0.502788">Barramento </tspan><tspan
         sodipodi:role="line"
         x="234.6494"
         y="-58.577866"
         id="tspan67305"
         style="stroke-width:0.502788">de Endereco</tspan></text>
    <path
       style="fill:none;stroke:#000000;stroke-width:1px;stroke-linecap:butt;stroke-linejoin:miter;stroke-opacity:1"
       d="m 181.80899,-148.66027 c 1.35619,-0.0472 2.34828,-1.05956 3.55273,-1.45977 0.22855,-0.076 0.58133,0.0473 0.81784,0 0.88117,-0.17624 1.85909,-0.48073 2.78064,-0.32714 1.02103,0.17017 1.85211,0.86013 2.61708,1.47211 0.285,0.228 0.72614,0.399 0.98141,0.65427 1.52686,1.52686 2.04155,6.82299 1.80833,8.90492 -0.12787,1.14157 -0.68252,2.33396 -0.98444,3.441 -0.82382,3.02069 0.45265,-1.42189 -0.16356,1.66775 -0.17615,0.8832 -0.57221,1.71544 -0.665,2.64334 -0.27978,2.79783 0.87726,6.06682 3.10778,7.85124 1.04569,0.83655 4.40423,1.22519 5.62422,0.98464 1.61352,-0.31815 2.81506,-1.47211 4.54745,-1.47211 0.0304,0 -0.0608,0 -0.0912,0 -0.39145,0 -0.32941,-0.0308 -0.78295,0.16357 -0.93069,0.39886 -1.92189,0.93538 -2.78065,1.47211 -1.67117,1.04447 -5.81186,3.76676 -6.71434,5.56614 -0.13944,0.278 -0.22006,0.82375 -0.32511,1.13889 -0.13984,0.41952 -0.29117,1.02552 -0.16357,1.47211 0.054,0.18902 0.23922,0.31487 0.32714,0.4907 1.25087,2.50174 2.54238,2.97295 5.25032,3.60261 0.41031,0.0954 0.79904,0.28142 1.21513,0.34718 0.32312,0.0511 0.65627,-0.0361 0.9814,0 0.80081,0.089 1.97575,0.50041 2.61708,0.98141 1.62739,1.22054 2.3172,2.08362 3.44454,3.77464 0.95291,1.42936 2.06427,2.77068 3.01941,4.20674 1.71457,2.577861 2.92015,6.754862 2.47322,9.883415 -0.0927,0.648862 -0.48974,1.57954 -0.81784,2.126377 -0.0793,0.132237 -0.25817,0.189203 -0.32713,0.327135 -0.10054,0.201069 -0.0721,0.448895 -0.16357,0.65427 -0.26419,0.593524 -0.66948,1.113588 -1.00409,1.670457 -0.88879,1.479148 -1.80175,3.120703 -2.98714,4.306086 -0.17676,0.176759 -0.56529,0.413997 -0.79446,0.643168"
       id="path68584" />
    <image
       width="87.27607"
       height="73.693138"
       preserveAspectRatio="none"
       xlink:href="data:image/png;base64,iVBORw0KGgoAAAANSUhEUgAABAAAAAO2CAIAAAD5S3IyAAAAAXNSR0IArs4c6QAAAARnQU1BAACx jwv8YQUAAAAJcEhZcwAAFiUAABYlAUlSJPAAAEWPSURBVHhe7d07cttYFy5s6szi5JIDl0dAj0Dq xJHTL6NCKelMJ3PmhArNrFNHTiyNwByBy4Gl/B+Gfmxg834RSfECYD1PVVcDIEjRAAisF9gbOHt5 eekAAAAx/J/8fwAAIAABAAAAAhEAAAAgEAEAAAACEQAAACAQAQAAAAIRAAAAIBABAAAAAhEAAAAg EAEAAAACEQAAACAQAQAAAAIRAAAAIBABAAAAAhEAAAAgEAEAAAACEQAAACAQAQAAAAIRAAAAIBAB AAAAAhEAAAAgEAEAAAACEQAAACAQAQAAAAIRAAAAIBABAAAAAhEAAAAgEAEAAAACEQAAACAQAQAA AAIRAAAAIBABAAAAAhEAAAAgEAEAAAACEQAAACAQAQAAAAIRAAAAIBABAAAAAhEAAAAgEAEAAAAC EQAAACAQAQAAAAIRAAAAIBABAAAAAhEAAAAgEAEAAAACEQAAACAQAQAAAAIRAAAAIBABAAAAAhEA AAAgEAEAAAACEQAAACAQAQAAAAIRAAAAIBABAAAAAhEAAAAgEAEAAAACEQAAACAQAQAAAAIRAAAA IBABAAAAAhEAAAAgEAEAAAACEQAAACAQAQAAAAIRAAAAIBABAAAAAhEAAAAgEAEAAAACEQAAACAQ AQAAAAIRAAAAIBABAAAAAhEAAAAgEAEAAAACEQAAACAQAQAAAAIRAAAAIBABAAAAAhEAAAAgEAEA AAACEQAAACAQAQAAAAIRAAAAIBABAAAAAhEAAAAgEAEAAAACEQAAACAQAQAAAAIRAAAAIBABAAAA AhEAAAAgEAEAAAACEQAAACAQAQAAAAIRAAAAIBABAAAAAhEAAAAgEAEAAAACEQAAACAQAQAAAAIR AAAAIBABAAAAAhEAAAAgEAEAAAACEQAAACAQAQAAAAIRAAAAIBABAAAAAhEAAAAgEAEAAAACEQAA ACAQAQAAAAIRAAAAIBABAAAAAhEAAAAgEAEAAAACEQAAACAQAQAAAAIRAAAAIBABAAAAAhEAAAAg EAEAAAACEQAAACAQAQAAAAIRAAAAIBABAAAAAhEAAAAgEAEAAAACEQAAACAQAQAAAAIRAAAAIBAB AAAAAhEAAAAgEAEAAAACEQAAACAQAQAAAAIRAAAAIBABAAAAAhEAAAAgEAEAAAACEQAAACAQAQAA AAIRAAAAIBABAAAAAjl7eXnJgwC01NnZWR5qCwcvgJ0JAADt1L6ifxUHMoCtCAAAbROn9J/mcAaw IQEAoD1ilv7THNQAXqUTMEBLqP4LFgLAq1wBAGiJ9bVvm/b2r1b5Dm0AawgAAG2wtCaOsIcP+w8H 2JkmQAAtVFTAQYrgOP9SgH0RAAAAIBABAAAAAhEAAAAgEAEAAAACEQAAACAQAQCA7PH67Oz6MY8A 0FICAAAHJFQA1I0AAAAAgQgAACx6vv94dv2YTt+XPt4/j6cXw0unT53oz6f908SrQaczuErzug4A UA8CAADLDa6+vH9Kz9l96A1v/zcq9TvD24s8/anfub1YU9ef3/wq3tvp9B7S3N8u82QATkoAAGC5 3sOvm/M0cPmp1xn+eSonFsbTz2/uep3BD2f2ARpFAAAAgEAEAAB29fz3d6f7/iKPAdAIAgAA2xlc 5b6/zz+/Dzsf3qXmQOfvPowbAz1ep56/U37/HfUfAOD0BAAAttN7uPtzke7rc3Hb6T/lvr2X3x56 1d1+zn58eup3y4mFy3/73eFtmt1dgADq4ezl5SUPAtBYRYGdh0oH27c/33+8+HNXuzv6HOufD9AG rgAAAEAgAgAAAASiCRBAGwRvA6MJEMDmXAEAAIBABAAAAAhEAABoobkmMe0W6h8L8HYCAEA7FWVx 6yvjCP9GgL3TCRigJTYphZu+z4/wbwQ4NAEAoCWcC684rgGsJwAAtErwGOCgBvAqAQCgbWJmAIcz gA0JAACtFSEJOIoBbEsAAIiluanAAQtgLwQAAAAIxHMAAAAgEAEAAAACEQAAACAQfQAAeJO5XsUO KwA15woAAAAEIgAAAEAgAgAAAAQiAAAAQCACAAAABCIAAABAIAIAAAAEIgAAAEAgAgAAAAQiAAAA QCACAAAABCIAAABAIAIAAAAEIgAAAEAgAgAAAAQiAAAAQCACAAAABCIAAABAIAIAAAAEIgAAAEAg AgAAAAQiAAAAQCACAAAABCIAAABAIAIAAAAEIgAAAEAgAgAAAAQiANAwZ1PyJAAANiYA0BiLRf/i FAAA1hMAaIY1hb4MAACwOQGABni1xJcBAAA2JABQdxsW9zIAAMAmBAAAAAhEAKDWtjqv7yIAAMCr BAAAAAjk7OXlJQ+G5JwxMC34LnE3cztSyxCg5kJfAVD9A3PsFgBoPU2AAAAgEAEAAAACEQAAACCQ 0J2AdVxrhM3bZFuD7Mau4I0sQIBmcQUAgEZ6vD47u37MIwBsTACg7jY8m+ikI7TB8/3Hs2yr2j6F gWXvyZ/38f45T0jKmTf8+KkvJG0AbSEA0ACvFveqf2iFx+uL207/qfhFv7w8vf+yfcE9+DH7lsev t8Nut5vHklT8Xw3yyKumv9BDb3A1GyQAGkoAoBmKo28eWrDmJaBJnv/+7nQ//3Nejpzf/Pp2WQ5t qtfvdwdfpkv0xx+Dbv/ucx4rPF5fFVOeHnp5fL3n+y/F3P/dVF/o8t9+d/j9pwQANJ8AQGOU5+Dm a33VP7TH+bsPneHt18Xz/hu2w3n3z+eZEj3V/5//uchjyeW3l5dfuaB/3dOfYefDu/Hc5df785TH AJpLAACgJi6/PfQ6g6uizJ9qa1NU/xe3Hx6qUwBP/d9r2uGcTyeA8vz96HrCLtIFiRkX77ud339d AgAaTwAAoDbSKfqiyu8Oby/yyf7nn9+H3f6/uTXQ+c1db007nKkEkN7Xu9v4bD9AIAIAAPVyfvMr hYDOuEF/GQeyq8G6djhlQEitiMr6/9N2nQjmpCY/M+aaBAE0lQAAQP2kc/l5sNPp5hvxjKzrHXz5 qdcZ/Lj+evvW+n+hyU/ZR/n9dJcCgGYSAACohdTVd9zFt7yBZ2rBX7bqWdYzeJUyAQwGnTfX/3N/ On2jUZuidDNRtwQFGksAAKAWzm9+PXRSD+Cypc/v/lN1v55icur6m6cnrzwfICWAzqTbwLT8vLD0 IICyr/ErVXz6Rr1qxuobbXljUoB6OnsJfBfFYoeeh0qRF0WDWGvsnY3qjeItwCJHfHmf8wlA8wgA E476jWCtsXerNqrp6ba0NaL9Kp/vP/6v85/yH2guTYAAZhTlbCWPl+ZGNzDToJ0ay82CFqxce+c3 v1T/QKMJAABvNF1Bvlrzlw+1lQxqpHz0wBLa+wOtJQAAcVU1ex7ZUVHQXw16+Tm1qcfoNjeHSdFB GADguAQAIJyq7i/k8Q0UxX0empceDjW+4WS6/8yap1Ql6SFXTi4DcEICAE2yVcUGS21b91fy+BLp YVGjJ9Y+33+Zu/38uHXQ5LrA6Kx/ags0uR1ldR1gujGR28wDcBgCAA22tiyD3VVFfyGPr1Pepb5z e5Fq9ovvn5+mz+4Prr68Lx9hW84x19YnXQp46HU6VfOh4l2pMdHvySNv9TMF4DAEAIAZRe2dhzb0 /PP7sKjj+/1uZzhb5vcechV/fnPX6wx+rG/tf/7uQ2f4/afz/pvSgwJgNwIAEMtcfb91uT/n+f7j xe2Hh5eXbzepcf+2vYBnXH57efhQXUsI2wCovElSZavaPjeeWnhP/rzZxVnOvMXHbzs/QM0JAEA4 qYHNSJ60s5k+wKt7AT///Z2H1hvdkjIFgYAZ4PH64raTW0E9vf+yfc09f5Xl8evtsNvt5rEkFfOp 68Wmtp0foAEEAIA3KPsAj6vOshdw9/1FHh1fDShbCc30Dp74/XdJnZ8+Np4Uk7qf/6n6Ppzf/Nry ZkmpFdaoP3bl8ceg27/7nMcKj9dXxZSn1PdiI9vOD9AIAgDAGxRlamr2k5qZFMrz1+Peu93+w+fv Ve/gNH1JOXv5b787LBv9XD+W55pHUrOieL2Ay14Qt18Xz/tPNQxa1xTn3T+fu9O9KFL9//mfURxL 0hWWbZbrtvMDNIIAAPA2M0+SHVeLRTL4dXOZ+gXMTi9nH2eBdCugUjFl5nNiPirg8ttDr7ov6lT7 p3E3i+Sp/3tNJ4vz6QSQLseMrycAMCEAAFAbZQp6ytdFypP9qflUt/9vzkPpfkprbpU0lQDS+3p3 zt4DLBIAqIXq0n4hj+9P/lxPEIPmSNdFihAwfsBaur1q/iGXPXLXPGy5DAipFVFZ/y/vdQEQnQDA 6RWH9Dy072f9Hu6TgcNK5/LzYOpNMX4+Wmld+6h0I6bBj+uvt+p/gBUEgHpLnQLD3Xx6X5W6ih+a JXX1He/wyht4phb8ZaueZT2DVykTwGCw6q5LsLu0jR7m/rzHP9yHLDAYEwD26XB7hjnTd8QozP7N 6Reb+tuuvn0e2ckb3x5LgMNAtUUV8vj28vttV4eU7qjUGd1Q6er36H5KxeTU9TdPT17ZXFMC6Ey6 DUzLd1pKN/avbt30yi572/k5vryOFjaKfCzc6xorYmmn/9+KjiXlHzzWrjT/qydavg9n7wSAxhpf En/qd6aeGDT9HJ03PZP0iIqvmodmFbu0PLSNal+YR6as+iuNU4+cmZRHoAYcdYpvmYfesFHloV0/ gQ1N3Qlp+u6b45slVXILoOn7Kc3cWymNTN6e3jwam/r8yvRfWWLb+TmZ158B92bpvlJ16lfey7fG KpT3Im7C8Z7aEACaL/V5G/WJK297Nz49Ud5ifPXtMuqk2H/loVnbFlur5l/1+bxiRc6siv+GPh51 XxsVUBcbPANuD1KUXNP9pIyp67qnHFCRVB96w9v/iQBsSgA4glVtclZMn0z+eP83T9vU059h58O7 8emJ8qk6q2+XUS+ravRiQeSh16yac9Uns4XpnJnK/2Y/HvXtGxVQJ68/A27FMTedy7h+HDeoKaaP Z5s+ob7qvR/vH6tX0szVZ+UXVx3ip6083G/w3gWzp/xWfMK2f3G8YAouMLSLAHBoxY9q8gib8iJd 9dNK0//cVZPL6fkX93z/v9thvq539+d2g1Os6ax/7u2WnqM/4+J9t/P7b2N+s+W/ekmxXu188sgK q2ZY+oFttGL3vWr6ZPL2ObNqF9GcphA7bwPF0slDU8JsUdAkrz0DbuZYPPc4ucHVj09pcvUUunxo njqhPvPeqeN4YXh7Vc0+t0NMb1l2iJ+26nC/7quuMznlt+qvb/QXJ//AYnLqilNN1vytbQSAA0ut EHsPk1aqaf9SNlScuZQ4qdNnHnlTzr7K+L7Y5c/8RFcdD6LYz+ShWUurscrSl6pdVh5puRW7760P A6tN5cwmKv6deWhkzea0xuLnALWw/hlwax8nNzpIl73Hp0eqcnrlcTyZvDBjxSF+2qrD/dqvupkt C4xV/8AyUWz7t2kKAeB0itos1e/Jxe0wT5xrw7NGbpz91O9OevqmX+uMzT+uXrYqs4oFmIemxCrU 5MwNLG4SS7ecscVXY21U0DCvPgNu88fJ7cPSQ/y0dcfnnb5qagPQfV81e3pjgZGlngUf8lfRAKht BIATmTljm6r4PH3rNjvnN/+lh+bne2TPvX16d9A0xWLJQ6uVe6Xw1f96B8iZbVIsljw0a3G6jQrq 7pVnwI3vaZAd8IzGqkP8tHWH+12+annbo7Ld094KjMLoPlgpCMgArSIAHFi5Pxo3/qu6To6u7I2l n20enL7iVvyGN7nNStk7M1+PnH1iTnleuEa3LNtWtdvJIxvb4S2tdaCc2VjFQshDUxZrfdU/NFN5 xF36DLitHyc3ZaPj+BpTh/hpqw73O33Vx+uz9LWWPKJggwJjk39gOmrQKgLAvk1fuEs/p/LeXIP8 CJvpJ9sUBdVo8pf3/XEbjMtv5f0W0+SLP3fLzxvMK3+81Q3Qzm9+zf65RjfaKG1VewUt1I6cM5tM KQ8tlvaFnaXleXFw3O5xclNWHMfXWHmIn7bqcL/xVx39gULZWXf0tbYuMFb8A6dvAZTOJekF3Cpn kQ+HxSadh0oqgzqbW1lLBVmD5Wn9qfNJvYfy8nB5Aqia0p0cn6Zm7vb7H26/v88vTV7oPTy9/5Ka +M+HxTTL98+TQ136C/nIMPXHKlN/sgk22ZzG7BledZx96fivWCMAbyQATDio1Nyaos26Y1sbZgCb 1iaOsC+1uwbYI02AaIzikL/0qK8UYAebbDY2LQBayRWAiVYuig1Pc3IgKsiaW/MDse425woAQLO4 AgAwT30JQIu5AjDRykXhCsBpxfl92dJOpQ7bmCsAHI59SxP5hdafKwAAABCIAAAAAIFoAjTRykXh uvmRhV3gLtOfSh22sSNs9nZlYdm3NJFfaP25AtBIxQ5xUX4NAABWcwVgoimL4i21vlB+aA3dqN4u 7D/8+Gq4qI/wlWxgYVn1jWA1NY4rAMASxd58qfwybClvQLtuQuoJgD0SAIB5a6q0qoZblF+GZaa3 kMWtpdyCkjy+ga1mBmCOANA8zoQBrTFdyivrAY5DAGikIgMslV+uvef7j+l038jH++f8QjL94vVj ngi0R/HbzkMLql9+HgHgMASAVsk5YEp+oYa6/afqKz71O7cX4wzweH1x28kvPfQGV7PhgOMoFn4e gn3YdouSAQAOSgDg1M5v7nqd4Z+nNPx8/2XQ7f93c16+cvlvvzv8/lMCOIUygi2X54A3eLXElwEA DkcAoE6e/gw7H95V5X/h/N2HUTSgPnIOmJVfgxUWN5JNMoAYAHAIAgCnls76d3qfLtPg39/VtJGL 993O778uAfAma/ucJI/XxWQdTmqqWDd5CIA9EQA4keHtRVmNnV38uXt5+ZbqfziYFX1OquL/apBH OKgdLgJUNpwNgA0JAJxILsie+t1JT9/U5GfGXJMgeLPpPiep/L8aFJviQ68a5eQWQ0JFBgDYIwGA 0zq/+a/fHd5+rZpfzDX5SU2Cuu8v8hjs3eW3l5dfudM5R7Cqvp+WzgzoVQJwSAIAp1aekR38KBPA +T+fJ2mg8/j1dti7U52xT1N9TjiJDYt7GQDgcAQATu/yU5EAvpTNgM5vfqW7/6e+AWdnV7/7TzoH sBf6nBxRtaTH8tTtyQAAB3IWeQ87d2Rq5aKI8G+slbALvM7/8Of7jxffPz+lpj5pMD1pbq7Zz+P1 2VXnoSG5oIaLeu4rvcXSf86qz7dDiyDsTrVZrKbGcQUAiGO2zwkNsaqY2GPwAAhFAAAime5zQnOs yQBiAMC2BAAglqk+J9UjwKoHAVRdTxafEsbrjnO5v/gra2JAHgJgA/oATLRyUUT4N9ZK2AVuSzua Ji7que+8xuSfU/bXGFbDvZkOGqs+zVbXSvYtjWA1NY4AMNHKRbH5cZdDiPP7svc/mnYs6lW7ptE/ 5/H67Menqupf1nN7zZ7Nttcy9i2NYDU1jgAw0cpFseYwyRHE+X3Z+x9NOxb1ql3T0n/Oqrs0bfUh NJR9SyNYTY2jDwAAh1KUBZU8Xpob3dmqImNfnw/QVq4ATLRyUTgQnlac35ct7VTqvI0t3ceu31SW /HPKJkAfVj+mYekHxvnptd7SrYi6sZoaxxUAAI5hfem/wvP9/26HvYc1D2krSg3Vxq6KdHV27aa4 EI8A0HLVoZFTyasBKG2bAR6vy/6/a8p/NpXveVt6teZPwUAygBYTAAA4iFcz8PoZUt/fQe9h+u4/ 7Kgo6NOyLM9LvDz0BlfbPPEiRQdhANpFAADgUNaX+Gvk6n9ly3+28vRn2Ol9yssyPQtv+OepGlnu /ObXi2UPLSYAAHtQnVlsrvzPGMlTmyB/4wZa9+Wf778Miv9Vj2eueEjzW1y8746ff10u3HEaSMat gyYLeXTWP7UFmjwpu7oOMJ69YLVAMwkA1Fo+xuzSdxCohaWF/ivRpTwBPUtLoLcoFuhTv3N7kfam F98/P02f3R9cfXn/lBZxOcdcW5+0Jh565cOYC8W7UmOi3/1y/uRtq6Xcuyd5HDgWAYD6mj4qOEJA cxWFYh4a8Ys+tuef34dFHd/vdzvD2TJ/3M3i/Oau1xn8WN/a//zdh87w+889nPe3h4cTEgAAODgZ 4JSe87MUXr7dpGsr2/YCnnH57eXhQ3UtQQMgaCwBgMZQLkDL+FEfyUwf4NW9gJ///s5D6xUZoJSC wN4ygI0BjkkAoL4WTxkCzbXDL7rsbuoOlG9W9gEet+0pewF331/k0fHVgLKV0Ezv4Inff5fU+elj d2cPDyckANAkThFBExW/3Eoe30gq/tP9Z3i785tfqdlPXgvlw9XGvXe7/YfP36vewSseunb5b787 LBv9FFls+hZAqVnRPjtnFx+Zh4ADO4scwef2Nc5G1NPiIcGaYu/sDdY7WmU2XvJFnZluNnP35+Kq s8nTAKzBhnp1D2/NNoLV1DiuAADRHa26Pa3in7mz/BFHlJqZu/MnwGEIANTd4omEk5QjtFWzNqey Gt9R/gioE3t4OAkBgAZwMZEDOX6pUZbiu8ufAvuTt63TbV328HB8AgCNdMJjFa2xZitav4GlWmlX +SPCKGq7VfIcnNT0Nlmf7TPgLwWOTACgGZQLHFmq1lfIc4RR1eu7yR+xIOBirKH6rIU1mwpwCAIA TaWA4C2ibT9VOb6b/BH748dbBzVfCzYSOCgBgMY4RCECTVHV4jvLn1IDGxZ2+Xbz6UEA1f3r9/bE WQrFAs1DU067ndRqK4XWEwBosKXHMKitshTfUf6IhtvkN1uV/unu/zN+/fPzY3phNgiUM3tU8HaK RZaHphSLOA/VxtLvCeyFAECTLB6iHCE4srIY3VH+iKi2+7UOfsyW9Y9fb4fdbjePJan4X/Wo4OJv tV7+p+5DTTbOxa+x338mMCYAACSLxUeq2Rfk19jS0kpu5fLs9fvdwZfpc/2PPwbd/t3nPFZ4vL4q pjw99KrRgKumTAG7yO+fkl+ogfyFgAMTAGiYxcO8YwZ7YUM6nKXLdm3J/u6fz93h95/jBJDq/8// XOSxxKOCAXYmANA8zsLyRpvU+jazfdm++k/OpxPA8/2XVP+r9gH2QwCgDZy7hXrarfpPphLA88/v w96ds/0A+yIA0EjOzrIzp/+PZvfqPzm/uesNb78+VvX/p8s8eWPFH2q3/O8E2J4AQEu4CMAmFreT uUJKabUvb6v+S5efep3Bj+uvt7vU/+1XbauvynPPyq/VVf6WwMEIADTV4kFCBmA3Vc1RyZM4gO0X b5kABoOO+n+var6d25PDEQgAQBSvnv7ncHZb1CkBdLr9f5fU/4uPCs4vsJZtHiicRd4XFEeMPFSy W2yiuZVYsB5ZxU/+yMYLfM2i3uNKsX5X2WRF1MTcSlxktdaTX1/juAJAs9nLsKFXCwv2qFja1QIv fqF+pCdXrYVCHq+rxR9p/b8zNJQAQNssHkJAYXFM00vb75EN2VTgmAQAGk8lB3VWFHZqO9ZbuoXY t8PhCAC0kGqDaYvbg8Li+PwqWUX1D8cnANAGi4cK1QarKCwObdUSLn6VfpjMWbpJ+JHCoQkAtJZq g4Jt4CTWFHDWCOup/uEIBABaTrUR2eLaV1scTbGoVy3tYr34YVLwC4VTEQAAOJQ19ZwMEJzqH05I AKAN1lcS6oyYlBc1USz2VUvebzMsqx5Oy5OAJyIviqZzLIF2eMt+uK279Mfrs6tBHi71Hl6+Xebh fUp/qHOgz56xdI+9YUp0pK4nq6lxXAEAgHorav6Rh97g6uzj/XN+ZZWimj+7fswjtVf8u/IQcBQC AACNF+cy4OW3IgMMb//3agRoDNU/HJ8AAEA9Pd9/LAr7yrqz2cXLeSiGy3/73eH3nzkBLC6lNCW1 GhpcTaZtvDBLaebrx3QVofT6BYetTFf8qn84CQEAgDp6vL647fSfigqxaveyogot6tM8NKXlZeX5 uw+d4Z+nYqio1C/+3JXLqFpKqbY/v/lVDI8aDqU2/Utne8Xg6sv7cukf4oJD+UWSPA4clwBAG2xy FKkONrReXt9T8gvUQF4lm3i+/zLo9v+7OS/HZs95T0Ss/mekWn/ca/fifbfz+++ySn3D2Wb0Hn5V S//yUy/HDaAtBACiWFoo0DKLazlSLVh32/0Gn/4MOx/eVeV/YXLOeyJu9f/893en+/6iGp407bm4 HZaTltlwNiAGAYCWUOexyFZRH0XdmYemrFlBqcSdMX/aetsPbJPHr7fD7ud/inSUmvbcfhjdIuip 381zzNlwNiAMAYD2qI5teWSZpRUDrWH91tbei/XQ1X96LMCkcdSUlAvyYGV5O5+F2YB4BADapkwB E3kqbbdYEVr7NbFbsZ6a/MyYNAmKWP1X9/MpXf3uP73k1vmd85v/+t3Ri1/e93vl1KTsNXF7UUy+ flwzGxCTJwFPKBdaaW4tF9av6PH8todm2XZFcxyL66UwvWpW7odTq5Xvn59Gle5otChpy/EZ1nWL rdxCqBOrqXEEgAnba1ttvqJtEg01t+IK1l0dLK6XwtyqWf2jG7VbL29ek9q9dNKwdR2N3XIjWE2N IwBM2F7bavOKwSZRK+PV8eqK2HwVczSLK6WwuF7W/ujK5u7VYLf/9OvmwoqOx265EaymxhEAJmyv LbbhurZJ1Mfm62JuzoIVd3KLK6WwdL1Y0ay3+RbCCVlNjaMTMBEtrU6WTqRxHHhObulP6Y3rZfEz rWiAnQkAhLBYK7xa7isvGkFsa4S9V/8AvIUAADSVs8KNcIjq34oGeAsBgCgWKwanFeEQpn9rqn+A GhIACGRN3SAMNI7T/3VWrItKHt+JXyXAgQgAtEdRLlTy+AZWzfzGwoW3m1sFr65Wq6xlptd4ShJT 8lQAdiUA0BLT5UIxXMnjU1QP7bB05dIa1i/AQQkAtFmZApI8TissrlC5rk3m1q+VC7B3AgAhlCkg VxXT9UQ1PFdwAKfixwhwBAIALbHJacIyBSTFzJX8wqxV06mDYvXloZFX11e10gt5HABiEwBoj7Kk 36h2z/WgirD51q/xubVsjTfOU7+bhwDYn3QqNA/GM1cNRF4UrbRztWdLqImlv9BNfrZrVr2VWzdW Futt8pPn5KymxnEFgNYqdkCVPE4rTK/QxZVbHITmjkM0lF8uwOEIALRfCgGlPL7WhrNxQtXaLOTx 0ial/9xbqC1rCuCgBAACKYtGhUVjbLiyNiz9rfqmsKYADk0AIJyqFizkcRpiscpX+rfA9NqxsgCO QwAgrqraKOTx2VqE2qrq/kIeX2Fu5VJb1Zoq5HEADkwAAPVHY2xe9xfyOAAwy21AJ1QMm3i1/Jpj qfIWW21vNjZoH0fqRrCaGkcAmLC9vmrb6v9wrKwgNtzkbA/QVo7UjWA1NY4mQDRSsa85hPzpNEdx mHGkgTd4vv94dv2YR4AgBACYyDlgr/JHs5NVxX1V9xfyOPC6x+u8Wyq8WvOnYCAZQFsJAGxBvbWD fLTdt/zpAcwV+nOjwGaKgv5q0HuofkEPvcHVx/vn/NLrUnQQBqBFBAC2s7T2qo4oS+U52LecAzaW 39ZYeXuyRcGOnv4MO71Pl9XI5adeZ/jnqRpZ7vzm18vLtzw/0DICAHuwpr7MVdu+5U9nYy3IAMAb XLzvdgZfqrP+z/dfBpM0kIxbB02uC4zO+qe2QFeDTmdwlV6vrgNMNyba5koCUBMCAFurQ/1dxYD9 yh/dXsWROg+tVR3TOaG8JmCfzm9+PfU7txdpE7v4/vlp+uz+4OrL+6e0GyznmGvrky4FPPQ6nar5 UPGu1Jjod7+cP/l1c57nBBpDAGAXxT4/D420oGqpjmV7lz+9Hl5dTarPOrAWOIjnn9+HRR3f73c7 w9kyv/eQq/jzm7teZ/BjfWv/83cfOsPvP533hwYTANjRYmmralmqigF7lz99e2tWkzUIrfV8//Hi 9sPDy8u3m9S4f9tewDMuv708fKiuJWgABM0kALBPKsijyTlgA/kNU5auJusO2mymD/DqXsDPf3/n ofWKDFBKQUAGgOYRANjd0uKSutlkNan+a8Uvi/0r+wCP2/aUvYC77y/y6PhqQNlKaKZ38MTvv0vq /PSxQPMIALzJYqWilKyh9atp6Sor3sKh5WU9a9V0eJPzm1+p2U/xc08ubjv9p3Hv3W7/4fP3qndw mr7k3p+X//a7w7LRz/XjzC2AUrMivYChec4iH2yKfVceKjnu7mxuSRYszBpaupoWJxasviOw5GET jtSNYDU1jisAHMTS4oa6UYOeiiUPwAkJAOyBwqURNllNVuURqP4BOC0BgP1YLF9cBKih9VWmGvQI VP/USrFBVvI4EIMAwN7IAI2wqtZUgx7B0l+EJc+pTG+QdtcQigDAYTmo1NBixakGPQLVP7Vi5wyR CQDsk2qmKabXlLV2BKp/akX1D8EJAOzZYk3jSFNPxZqq5HEORvVPrdggAQGA/Vs8kMgAhKXYov5s kBCNB4FN2APu12LdYwkTjep/Z84asIpfUA0pqBrHFQCOxxGdUFT/O7OvYA2bB7ydAMChKHSITPUP QG0JABzQYrnjzA0RqP4BqDMBgMOSAYhG9f92Fhdr2Dzg7XQCnrBPORD1EHHY2vfF/nlfmr5N2hIa wWpqHFcAODg7AoJQ/dMItklAAOAYFo83S0slaC7VP41gmwQKAgBHIgPQYqp/amt6O7RNAhUBgFOS AWgB1T81V2yNlTwOhCcAcDwOP7SP6h+AxhEAOKrFwshFAJpL9Q9AEwkAHJsMQDuo/gFoKAGAWpAB aBbVPwDNJQBwAuokGk31D0CjCQCchoZANJQNFYCmEwBa6/G6KFTGPt4/5+n1IQPQOKs2Uaf/AWgQ AaCVUvF/1XkoipLKU79ze3F2/ZhfrjMZgNpS/QPQDmeRD11zh/PWLIqi/L/63X/6dXOeJyRLJ9bB YlGlnKKGVP9H1tb9M9uyJTSC1dQ4rgC0z+OPQad3N1/oX37qdYbff6aGQM/3Hz/eP4+bCJ24ddDi bqL4TnkI6mHVNukgB0ATCQCt8/z3dx6adfG+m4cKw9uLL++fiuqlah104sZBMgBNpPoHoKEEgKB6 D7kx0PnNXa8z+FG/7gEyADWxdFNU/QPQXAJA65y/+5CHZj39GXY+vKtbD4AR5RT1pPoHoH0EgPZJ rf0XT+mnngHd9xd5bEpqMrT0hWPTEIi6Uf0D0EoCQAtd/tvvDq6m7/qZbgE06Pb/m/QMHlzlvr/P P7/X58pAnAyQumDP9ryYnvJ8/3Fl3+yq83YjbunacKp/ANpKAGij85tfLw+9IgOMpBuAvszcAbT3 cPfnIr10cdvpP327zJPrqPiSeYjySk6vV89eG62ydKtT/XMc43u0jRw28c/+uTo+NRLYOwGgrS6/ FdXK2JLb/49nqNejAYovlIdY9Hz/ZdD79C1d4pEADqcogvLQFFsmR9WbPMmxPJ3zel2+eF1xA+lN Ozw1cqe/BdSIAEDtFAehPDSytCALKLXX6n267Jz/81kCOBTVP3Vz+a3IAMPb/+3/1PzjdWocOn0N +Pzm10OvM/jiMgC0nADASulq8InkbzBl6cRgRvV/cZBOCcAhev+Wbmaqf04u9ezKT3IspF5CI9V5 +DTlapB6d02mLZltziZPjZx6Zz7tv/RvAQ0jAASUugi82uq/2LHnodqo4Vc6qkn9XyWASTnAXizd wFT/1EK6v/Pwz1MxVNTfF3/uig0zSa2DUgledfwaNRxK+/els83a6KmRixb/FtA8AgA0Q3m/pnHP 7ovb4egkHftQLNM8NKUob/IQ1MXMGZxUq//+u2w/sOFsQFACAE2ytEprqpnj8auPY3j8ejuc6haY Ouu5BrAvqn/qbnoPMdW0J50JWOXV2Zr51EhgLwQAlqtt9VMczPJQk5Uteied+p7v/3c77H7+Z/Uh t2ysm9v/VLQC2pOlW5Tqn1pJJwCqPURq2nP7YXQu4Km/orXORrNt+dRIoEUEAFbKh45Ty99mShsy wPnNr+p+e6XySD17P9bh6LXC9eNi/Z8TwO1XXfDeoli6eWjK0q0OTuVx4UmOIykX5MHK8nY+C7ON vPbUyHSNYJQQ0h2DyoERbYpooqW3sI15X9uqxoopL4KRPJX6yWtoSn4B3iBvTLPya5xaXh8jeWoM qYvttG7/Kb+STJ3O7/b7vcmr4xfKxoIrZ5s3+9fmZxu/2ntInzhqhzj7tw6q+jtjeSo1k1fPSJ76 BlMbcLJy+93WpAP7RDWt/IszL6Xps3942bsLi29tgLPiv7x045k7+Rd5UdTf4pla64u3cO6/5uyf qdgSGmHvqym1Yvv++am6NF42aev089ibpItcnYeZ21cVk768Lz67M/0nq+lXg5QAZqbMvbk0anJX vrBqprrRBIhmWNybLC3gYBOqf4DGOL+56+X74O5desJ+1cFmrmdd2fO+uzBlWf+YdNOt+lf8cwQA GkMGYC9U/wBN9rziIXcrpk8mf7z/m6eNpDtsj27BUT5uY1Tvl4/eufuvyASj4DE16+N18VGP1cd+ vH9O4+UfTH9p+0fynYYAQLMVv6c8BBtYusGo/gHqK52lH98Io6inJ7e4eur/vkoVeJ6+7OF35W32 cgP9uz+3s33ZqzJ/1MSnfAx2Ve+X1f77i+mO8E9/pu/WN7y9qv7adLukxcfkrfq2pycA0CTF7ycP wfZU/wCNMb4bXlnY5yY2ZWXe/ze3t0mNg/JJ+xUPv5uZ//JbKs8nyifsTN1hb3Jr3FG1P5ny+CM3 Fcp6Dxs0+ln5bU9PAKBhFsu1pVUdzFm6naj+AWoq34HnKd2tdubE+fR9sq8G494BU21tJg+/W/dg u8U7bI/q/Um1n6akKJHm3e0BeSu+7akJADSPDMC2lm4hqn+A2ju/+S89OnPqqTfzNwVdaGszdRfR ybWABcuesFPN/vj397jaL6YMv/9MU+bn3dCyb1sDAgAtIQOwiuofoMHKuwDlpvgbPQNz6uF30z17 i5Aw9Ty7dJZ/3DpnpPr4q6mWQYtTXjdOHDV+YqcAQCOp3tiQ6h+g6cqmOV/KZkDlg/R/l7fZycre vuV1guruO2dnX973x239L7+Nn7t/8edufGlgcvvPWalkL/43dbvPPGXT+j89YLtq9ZO+14pvWwMe BDahJmicuTVYsBKZtriFFGwkjWD/TMWW0AiNW02pxdD0U7/iEQAm7FaaaLHCsx6pLG4bBZtHU9g/ U7ElNELTVlOq///c1aU5/kkIABN2K02kyGMpG0bT2T9TsSU0gtXUOALAhO21oRZLPasyuMVNomCr aBb7Zyq2hEZYutc9AtvDznQCpvEWf/+n2hNRB6p/gCAc7ncmANAGMgAV1T8AvEoAoLVkgGhU/wCw CQGAllDnBaf6B4jGTn5nOgFP2IxawFn/QsAtWfXfPvbPVGwJjWA1NY4AMGF7bYeltSDR+Dk3nf0z FVtCI1hNjaMJENA2jj0AsIYAQNso/oKzAQDAegIALaQEDMuqB4BX6QMwoXSgufR8KPgJt4n9MxVb QiNYTY0jAEzYXmkuGzMtY5OmYktoBKupcTQBAgCAQAQAAAAIRAAAAIBABAAAAAhEAAAAgEAEAAAA CEQAAACAQAQAAAAIRAAAAIBABAAAAAhEAAAAgEAEAAAACEQAAACAQAQAAAAIRAAAAIBABAAAAAhE AAAAgEAEAAAACEQAAACAQAQAAAAIRAAAAIBABAAAAAhEAAAAgEAEAAAACEQAAACAQAQAAAAIRAAA AIBABAAAAAhEAAAAgEAEAAAACEQAAACAQAQAAAAIRAAAAIBABAAAAAhEAAAAgEAEAAAACEQAAACA QAQAAAAIRAAAAIBABAAAAAhEAAAAgEAEAAAACEQAAACAQAQAAAAIRAAAAIBABAAAAAhEAAAAgEAE AAAACEQAAACAQAQAAAAIRAAAAIBABAAAAAhEAAAAgEAEAAAACEQAgH06G8njAAA1IwDA3kzX/TIA AFBPAgDsx2LFLwMAADV09vLykgfjmavPIi8K3mhVrX+0jcrGTMvYpKk4k9JEfrD15woAvJXjEwDQ IAIAvInqHwBoFgEAdqf6BwAaRwCAHan+AYAm0gl4Qp8VNre0+i82oVNtVDZmWsYmTYstPYJUbOoc hysAsLVV1X8eAoAV1lT/hfWvwr4IALAd1T8Au9mkvpcBOAIBALag+gdgN5tX9jIAhyYAwJuo/gFY ryjot63pZQAOSgCATS3ujlX/AKynlKeGBADYiOofgG2tqv4XjyCLUyQHDkcAgNfZCwOwrc2r/4oM wNEIAPCKpftfp/8BWGPb6n8VGYBDEABgHdU/ANtadex49fCxdAYZgL0TAGAl1T8A23rjscNRhiMQ AGA51T8Ae7HtsWNxfhcB2C8BAJZQ/QOwF7sdO2QADkoAgHnHrP6Lv1XJ4wA03PTxwpkj6kkAgBlL a/HDVf95yKkdgBYpjhqVPL6TN74d1hAAYOJo1X/xh1T8AKw3fQCSB9gjAQCyY1b/eQgA1ioOQ5U8 DvsgAMDK8/GH2OGuqv7t3AGA4xAAiO5oFXmZMlT/AJzE8/3Hs+vHPEJwAgAscYjqPw/NKv6Q6h+A vXq8rs45Ja/W/CkYSAbRCAAw75jVfx4CgP0oCvqrQe+hPL/08tAbXH28f84vvS5FB2EgAAEAZuy3 KK9Ov+SRWfv9QwA0XXXIKOTxHT39GXZ6ny6rkctPvc7wz1M1stz5za+Xl295foIQAODYypMyqn8A Jqbr/rdlgIv33c7gS3XW//n+y2CSBpJx66DJdYHRWf/UFuhq0OkMrtLr1XWA6cZE21xJoOYEADgq pT8Ah3R+8+up37m9SDX7xffPT9Nn9wdXX94/pZNQ5RxzbX3SpYCHXqdTNR8q3pUaE/3ul/Mnv27O 85w0ngAAGyq7SWUrG0gWe8g8tEL+gH3Lnw5AExx2v/388/uwqOP7/W5nOFvm9x5yFX9+c9frDH6s OphVzt996Ay//3Tev4UEANjI4/XFbSefB9m2TxUAVDY5a/PquaR1nu8/Xtx+eHh5+XaTGve/6Yh1 +e3l4UN1LUEDoHYRAGADqRVlt/9fvvp5+W+/65wIAFvapPR/U/VfmOkDvLoX8PPf33lovSIDlFIQ kAHaQwCADaT96Yd348aP5VXR9XdVOKG3HjwAOLqqzM4jb1H2AR637Sl7AXff/3/XZ2f/70/qA5CL +LKV0Ezv4Inff5fU+eljaQ8BAF63cKIk7QiX7iFPTvUPENr5za/U7KdstnN2VrZe/XXzf6vXuv2H z9+r3sFp+pJ7f5aXuMtGP9ePM7cASs2K9AJuj7PI5UKxPeehksoppk02g1GLyvG+Mk34/rnYpy7Z F8594DTbGGzI/pm2WnWMsJFzTK4AwOtSk58Zc02CNrUmGwAQQVHoV/I4nIIAABuYa/KTmgR131/k sa3IAAAcjn66bEIToAlxPKbNNoOZRkCP12dXnakGQbM2LPFtb7CG/TOtZyPnhASACb+9mDbeDFLZ P6gGu6lL1aoGQIsfODdlzCYHq9g/03o2ck5IAJjw24tp75vB0g+cmzhmq4Ol7J9pPRs5J6QPABxD sWdfunNfFQwAAA5EAIDjkQEAgJMTAOCoZAAA4LQEADi2pRkAAOA4BAA4ARkAADgVAQBOYzoDyAMA wNEIAHAyRd1fyeMAAIcnAAAAQCACAAAABCIAAABAIAIAAMCxTXcA0xmMIxMAAABOoLwNRJLH4VgE AAAACEQAgCUer8+S68c8PvJ8/zFN/3j/PDNeWpgZAKCGBABYbfBjtqh//Ho77Ha7eayICRd/7qrL t0/97uBqnAsAAGpLAIAVev2iqP8yXdM//hh0+3ef81inc/nt5dtlNXh+c9frDP88VWMAALUlAMAq 7/753B1+/zlOAKn+//zPRR4DAGgkAQBWOp9OAM/3X1L9f16OLEivdnqf8vUAAIDaEgAmcldOgsmr f6mpBPD88/uwd3ezvP5/vv/f7bD3MGoPBABQXwIArJGa9g9vvz5W9f+KE/yP1xe3nf6T8h8AaAIB ANa6/NTrDH5cf71dUf8/Xp9dDXoPv1ZcGwCAN0q3pnarafZJAID1ygQwWN7AP1f/43sBAcAy04+N KSnoOSUBAF6REkCn2/93ocgvO/52OoOrvDcveBIAACt0+0/Vo2MSZ444pbNiG8yDIRUlWzUQfDlE Nt4GKm/fEvb+gRCQ3xEt83z/8eL756fd2oumy80dV5vZo+hXAIqDSiWPAwAcSWoZdP2Y2viXpi4j T9oMfbz/m6fBvmgCBABweMPbi1zTz/QAGFx9eV+2DXroDW//V0WAfHfp8hTl3Z/b1N4U9kgAAAA4 vKk+ANOtecY3kktdzoZ/noqhdOvpcd+zy28PvXIA9kYAAACok6c/w86Hd24vzcEIAAAAdXLxvtv5 /ddt5TgYAQAAoE7O333oDL//zN0BPl7pA8CeCQBQF7lr2OzdDwFoialOwK89COzy21O/U81+8efu qd/N02E/oj8HAIq9ax4qvf0XsdsH7v1rQKP5RQAcjisAcGJFoTNX6wAAHI4AAKek9AcAjkwAgNNY c+JfawcA4HAEADiBNSf+Vf8AwEEJAHBU60/8q/4BgEMTAOB4nPgHAE5OAIAjceIfAKgDAQAOrmz1 o78vAFALAgAclhP/AECtCABwAkp/AOBUBAA4Kif+AYDTOlOLENxcE51NfhGP12dXg97Dy7fLPGHG qjY/wM4cqgD2yBUA2EpR/BfVfx4BAGgcAQC28Hh9Nej2nx56eRw4ChfWAPZIAIAtXH57efl1c57H ltNWAQCoMwEAAAAC0QmY6HboBFz2Au6s6gRcWN9cwY8ONrHLbxOADbgCAAAAgQgAcGy6MwIAJyQA wMFpugAA1IcAADPOSnlkQXoKQCE9CGBwlYY+3j/nl7ZSvDMPAQAcl07ARLeqFn/LT2PuM6uPWjoR WMVPBuBAXAEgulVVxaFP0h/68wEAlhIA4EgZwPlLAKAOBABIiup8aYFeZIDDnao/3CcDAKwiAMDE qpP0+6rUFz9fBgAAjkwAgBmHzgAAAKclAMC8g2YAFwEAgNMSAGCJokxfGgOKYv3t9frSTwYAOA4B AFZaVanv/Zz93j8QAGAVAQDWOVAGcBEAADgVAQBecbTrAAAARyAAwOuKDLA0BhQZYOcYMP2BSz8c AOAQBADY1Koy/S0ZoJLHAQAOTwCAPdg5AwAAHJkAAPshAwAAjSAAwN6kDgFiAABQbwIA7JkMAADU mQAAu9N/FwBoHAEA3kQGAACaRQCAtyrv5CkGAADNIADAfsgAAEAjCACwN6sygG7BAEB9CACwT64D AAA1JwDAnqUOAWIAAFBXAgAcxHQGkAcAgPoQAOBQyisBSR4HAKgBAQAAAAIRAGBHTu0DAE0kAMCm 3M0TAGgBAQAAAAIRAAAAIBABAAAAAhEAAAAgEAEAgGY7G8njAKwlAABwGrlsf1vhPv32N34UQBAC AAAnsJfCXcUPsAMBAIDT26GUV/0D7EYAAKAWtirol87s+dwAmxAAADiBpcX6hhlA9Q/wFgIAAKex WwZQ/QO8kQAAwMlsW7ir/gHeTgCATU0XGQoO2JfFX9OqiwCqf4C9OLPrBODkXm35s5RDGMAOXAEA 4PR2KOVV/wC7EQAAaB7VP8DOBAAAamHzml71D/AWAgAAdbFJZa/6B3gjAQCAGllf36v+Ad7OXYAA WG63O/O0nuMm0HSuAMChPF6fnV0/5hGovaLcn5NfYFZeOlPyCwANIQDANp7vP+Yj/u61fQoGy96f P/vj/fPMeEmQ4JCqrSyPsL1qARbyOEC9CQCwucfri9tO/+kleXr/5W1V+eDH7Nsfv94Ou91uHkt/ 689d+ZdenvrdwdU4F8C+5KJV2bo/lifQCAIAbOz57+9O9/M/5+XI+c2vb5fl0C56/aKo/zJd0z/+ GHT7d5/zWKdz+e1l9PnnN3e9zvDPUzUGe6FOPRwxAKg5AQA2dv7uQ2d4+3XxvP8OjXXe/fO5O/z+ c5wAUv3/+Z+LPAYHVG2peWSt6hIUc/LSec2GCxng+AQA2Nzlt4deZ3BVHNenGuQU1f/F7YeHqjJ4 6v/esLHO+XQCeL7/kur/6trCgvRqp/dp9+sNsKFqMx7LU5mVl85InrqMDADUkwAA27j8Vhzvn/rd 4e1FPtn//PP7sNv/d6q1zvSJ/TWmEkD6jN7dzfL6//n+f7fD3sMb2hvBxNKStCpkC3mcbeRlt2Lp yQBADQkAsLXzm18pBHTGjfjLOJBdDTZtrl+GhdSiqKz/V5zgz/2Olf/sQ7GB5qEpqypXtrUmBgDU igAAO0nn7/Ngp9PNdwYa2bRcv/zU6wx+XH+9XVH/P14XeaL38GvFtQF4s2JzzUPsyeIiXZq7AE5I AIBNpa6+4y6+5U07U6v9siXPsp7BmygTwGB5A/9c/W+cJmBbqv8DsWCBmhMAYFPnN78eOqkHcHL1 u/9UnZkvJqeuv3l6ssXzAVIC6Ey6EEyUHX87VY/jzJMAAIA9OHOiAiCIIkfmodLh9v/l9as8XLaR W9qObXQHrS2ucu3wltM42qIG2IErAAAcQG98b9zO7cXu16+KLLHNRTUAXicAAHBAq59kne6nteW5 /B3eAsA8AQCA43i8Pvt4/1g9ODtdE5g6u1/1sU8TStUVgzQxNSWq+sKUc772llJ6ZZr+MwAzBAAA Dujxuqjhxze6Gt5e/blLLYOW9AoYXH15X95R96E3vP1fUbSn8/0PvVFromUn/hfeUsgPz0hT0/M6 VvVAAIhLAADgAEa3sJq7m+2ap1qPn3mR7o612fP0lrzl+e/vTnmL3kJ5l97NHswHEIgAAMABjDoB H7vN/vm7D53h95/lxYD0lO3u+4tyOgAjAgAAbTO8vUhXH9ItQ7X/AZgnAABQb7//btGJ9/HHoFv1 AEjcMQhgkQAAQH1d/tvvVufzN3wawOW3p8/fy/P/macIAMzxJGCAKIpqOA+VWrn/n39W8OP12VXn +I8OjrCogeZyBQCAdpnq95vuCQTALFcAAKKIcVq6vAYwzCPl3YhO0BHAFQCgzgQAgChUpUdjUQN1 pgkQAAAEIgAAAEAgAgAAAAQiAAAAQCACAAAABCIAAHAYj9dnBU/iBagZAQCAg3j8Mej1ep3BjyMk gJQ1JA2AzQgAABzA8/2XQe/Tt3/73aMkAAA2JgAAsH/PP78Pe58uO+f/fJ5OAM/3Hz/eP1dtgwrF cH6hfClPnTqZX8z58f6xeqWaeXG2NOVq0OkMrkbT0pTJ9YDpqwPjv1yY/uMAkQgAAOzdqP7vVAng y1StPby9+PL+6aXw1O/cXoyL+Is/d2li4aE3uJrU78Pbq+qVXzfnS2c7v/lVDHc6vYc09Vv6o8sV 77763S//dFJ8Xn4BIBYBAIB9m9T/VQIYfv85SQC9h1x6n9/cjboIpCJ+XLpfvO92fv8dv6H3MH5l 3WyvO3/3oTPzTQBiEgAA2LNU/+cWOYWL2+EGdXdqtpOlN6yy4WzLXX57efhwe1G+WwMgIC4BAID9 evx6O6za42RP/dlrACPPf393uu8vyrL+4vbD6C3F7HmGORvOtk6RAUopCMgAQFACAAB79fhj0Bm1 /6nMtgIaXOXKu7xQ8OHdfEv8lB/y4DoLs02aA6W2PqOex4/XqYPwgtR+CCAoAQCAfVqs/3MCuP1a leS9h7s/ZTOci9tO/6ls0n9+81+/O2oz9OV9v1fOuGD1bJf/9os/kD617D18+S31EC5n+/FpfKVg +hZA6UqCXsBAUGcvLy95EIBWK+rePFQ6xf4/NeL5c7fuVj3tUINFDbCSKwAAABCIAAAAAIFoAgQQ xVy7lIJDwCFYzkDNuQIAEMViGbpYqvJGqn+g/gQAgNCKglUM2AtLEmgKTYAAYnm1SHVc2JyFCTSR AAAQzm4nqsMeL3Y+r+8IC9STAAAQkcYqB+XYCtSZAAAQlxhwCA6sQM0JAABIAnvgeAo0hQAAwIQk sC2HUaBxBAAANhI2GzhQAi0jAAAAQCAeBAYAAIEIAAAAEIgAAAAAgQgAAAAQiAAAAACBCAAAABCI AAAAAIEIAAAAEIgAAAAAgQgAAAAQiAAAAACBCAAAABCIAAAAAIEIAAAAEIgAAAAAgQgAAAAQiAAA AACBCAAAABCIAAAAAIEIAAAAEIgAAAAAgQgAAAAQiAAAAACBCAAAABCIAAAAAIEIAAAAEIgAAAAA gQgAAAAQiAAAAACBCAAAABCIAAAAAIEIAAAAEIgAAAAAgQgAAAAQiAAAAACBCAAAABCIAAAAAIEI AAAAEIgAAAAAgQgAAAAQiAAAAACBCAAAABCIAAAAAIEIAAAAEIgAAAAAgQgAAAAQiAAAAACBCAAA ABCIAAAAAIEIAAAAEIgAAAAAgQgAAAAQiAAAAACBCAAAABCIAAAAAIEIAAAAEIgAAAAAgQgAAAAQ iAAAAACBCAAAABCIAAAAAIEIAAAAEIgAAAAAgQgAAAAQiAAAAACBCAAAABCIAAAAAIEIAAAAEIgA AAAAgQgAAAAQiAAAAACBCAAAABCIAAAAAIEIAAAAEIgAAAAAgQgAAAAQiAAAAACBCAAAABCIAAAA AIEIAAAAEIgAAAAAgQgAAAAQiAAAAACBCAAAABCIAAAAAIEIAAAAEIgAAAAAgQgAAAAQiAAAAACB CAAAABCIAAAAAIEIAAAAEIgAAAAAgQgAAAAQiAAAAACBCAAAABCIAAAAAIEIAAAAEIgAAAAAgQgA AAAQiAAAAACBCAAAABCIAAAAAIEIAAAAEIgAAAAAgQgAAAAQiAAAAACBCAAAABCIAAAAAIEIAAAA EIgAAAAAgQgAAAAQiAAAAACBCAAAABCIAAAAAIEIAAAAEIgAAAAAgQgAAAAQiAAAAACBCAAAABCI AAAAAIEIAAAAEIgAAAAAgQgAAAAQiAAAAACBCAAAABCIAAAAAIEIAAAAEIgAAAAAgQgAAAAQiAAA AACBCAAAABCIAAAAAIEIAAAAEIgAAAAAgQgAAAAQiAAAAACBCAAAABCIAAAAAIEIAAAAEIgAAAAA gQgAAAAQiAAAAACBCAAAABCIAAAAAIEIAAAAEIgAAAAAgQgAAAAQiAAAAACBCAAAABCIAAAAAIEI AAAAEIgAAAAAgQgAAAAQiAAAAACBCAAAABCIAAAAAIEIAAAAEIgAAAAAgQgAAAAQiAAAAACBCAAA ABCIAAAAAIEIAAAAEIgAAAAAgQgAAAAQiAAAAACBCAAAABCIAAAAAIEIAAAAEIgAAAAAgQgAAAAQ iAAAAACBCAAAABCIAAAAAIEIAAAAEIgAAAAAgQgAAAAQiAAAAACBCAAAABCIAAAAAIEIAAAAEIgA AAAAgQgAAAAQiAAAAACBCAAAABCIAAAAAIEIAAAAEIgAAAAAgQgAAAAQiAAAAACBCAAAABCIAAAA AIEIAAAAEIgAAAAAgQgAAAAQiAAAAACBCAAAABCIAAAAAIEIAAAAEIgAAAAAgQgAAAAQiAAAAACB CAAAABCIAAAAAIEIAAAAEIgAAAAAgQgAAAAQiAAAAACBCAAAABCIAAAAAIEIAAAAEIgAAAAAgQgA AAAQiAAAAACBCAAAABCIAAAAAIEIAAAAEIgAAAAAgQgAAAAQiAAAAACBCAAAABCIAAAAAIEIAAAA EIgAAAAAgQgAAAAQiAAAAACBCAAAABCIAAAAAIEIAAAAEIgAAAAAgQgAAAAQiAAAAACBCAAAABCI AAAAAIEIAAAAEIgAAAAAgQgAAAAQiAAAAACBCAAAABCIAAAAAIEIAAAAEIgAAAAAYXQ6/z9HsxgK aMO8WgAAAABJRU5ErkJggg== "
       id="image77-3"
       x="410.16385"
       y="-196.89444" />
    <rect
       style="fill:#ff8080;stroke-width:0.121967"
       id="rect181-6"
       width="12.912706"
       height="27.845634"
       x="521.39978"
       y="-190.16498" />
    <rect
       style="fill:#0000ff;stroke-width:0.121967"
       id="rect249-7"
       width="37.801613"
       height="10.260018"
       x="508.23257"
       y="-202.86069" />
    <rect
       style="fill:#0000ff;stroke-width:0.121967"
       id="rect273-5"
       width="0.38952875"
       height="1.7724358"
       x="522.25073"
       y="-192.13123" />
    <rect
       style="fill:#0000ff;stroke-width:0.121967"
       id="rect275-3"
       width="0.49912223"
       height="1.4269987"
       x="523.86279"
       y="-191.89969" />
    <rect
       style="fill:#0000ff;stroke-width:0.121967"
       id="rect277-5"
       width="0.46485528"
       height="1.4178323"
       x="525.27478"
       y="-191.77615" />
    <rect
       style="fill:#0000ff;stroke-width:0.121967"
       id="rect279-6"
       width="0.29477131"
       height="1.5334375"
       x="526.62256"
       y="-191.90646" />
    <rect
       style="fill:#0000ff;stroke-width:0.121967"
       id="rect281-2"
       width="0.41369483"
       height="1.2816508"
       x="527.95154"
       y="-191.75482" />
    <rect
       style="fill:#0000ff;stroke-width:0.121967"
       id="rect283-9"
       width="0.43262792"
       height="1.3889388"
       x="529.59387"
       y="-191.78214" />
    <rect
       style="fill:#0000ff;stroke-width:0.121967"
       id="rect285-1"
       width="0.40296084"
       height="1.3831155"
       x="531.14832"
       y="-191.69791" />
    <rect
       style="fill:#0000ff;stroke-width:0.121967"
       id="rect287-2"
       width="0.35122091"
       height="1.2491736"
       x="532.53076"
       y="-191.647" />
    <text
       xml:space="preserve"
       style="font-style:normal;font-weight:normal;font-size:2.01648px;line-height:1.25;font-family:sans-serif;fill:#000000;fill-opacity:1;stroke:none;stroke-width:0.0504119"
       x="488.65527"
       y="-201.39847"
       id="text2689-7"
       transform="scale(1.069216,0.9352647)"><tspan
         sodipodi:role="line"
         id="tspan2687-0"
         x="488.65527"
         y="-201.39847"
         style="stroke-width:0.0504119">001 001 xx</tspan><tspan
         sodipodi:role="line"
         x="488.65527"
         y="-198.87787"
         id="tspan2691-9"
         style="stroke-width:0.0504119">001 010 xx</tspan><tspan
         sodipodi:role="line"
         x="488.65527"
         y="-196.35727"
         id="tspan2693-3"
         style="stroke-width:0.0504119">001 011 xx</tspan><tspan
         sodipodi:role="line"
         x="488.65527"
         y="-193.83667"
         id="tspan2695-6"
         style="stroke-width:0.0504119">011 001 0 x</tspan><tspan
         sodipodi:role="line"
         x="488.65527"
         y="-191.31607"
         id="tspan2697-0"
         style="stroke-width:0.0504119">011 010 1 x</tspan><tspan
         sodipodi:role="line"
         x="488.65527"
         y="-188.79547"
         id="tspan2699-6"
         style="stroke-width:0.0504119">110 0 0 1 xx</tspan><tspan
         sodipodi:role="line"
         x="488.65527"
         y="-186.27487"
         id="tspan2701-2"
         style="stroke-width:0.0504119">100 100 0 x</tspan><tspan
         sodipodi:role="line"
         x="488.65527"
         y="-183.75427"
         id="tspan2703-6"
         style="stroke-width:0.0504119">011 011 0 x</tspan><tspan
         sodipodi:role="line"
         x="488.65527"
         y="-181.23367"
         id="tspan2705-1"
         style="stroke-width:0.0504119">011 100 1 x</tspan><tspan
         sodipodi:role="line"
         x="488.65527"
         y="-178.71307"
         id="tspan2707-8"
         style="stroke-width:0.0504119">101 0 0 1 xx</tspan><tspan
         sodipodi:role="line"
         x="488.65527"
         y="-176.19247"
         id="tspan2709-7"
         style="stroke-width:0.0504119">100 101 0 x</tspan><tspan
         sodipodi:role="line"
         x="488.65527"
         y="-173.67188"
         id="tspan2711-9"
         style="stroke-width:0.0504119">010 101 xx</tspan><tspan
         sodipodi:role="line"
         x="488.65527"
         y="-171.15128"
         id="tspan2713-2"
         style="stroke-width:0.0504119" /></text>
    <path
       sodipodi:type="star"
       style="fill:#0000ff"
       id="path5229-0"
       inkscape:flatsided="false"
       sodipodi:sides="5"
       sodipodi:cx="412.72888"
       sodipodi:cy="-199.0596"
       sodipodi:r1="221.96651"
       sodipodi:r2="110.98325"
       sodipodi:arg1="1.5374653"
       sodipodi:arg2="2.1657839"
       inkscape:rounded="0"
       inkscape:randomized="0"
       inkscape:transform-center-x="-0.21105796"
       inkscape:transform-center-y="1.5551916"
       transform="matrix(0.09232359,0,0,0.0818082,432.2335,-199.92841)"
       d="m 420.12588,22.78362 -69.60294,-129.93183 -146.4937,-16.3231 102.06402,-106.34748 -29.74485,-144.3679 132.68198,64.20548 128.11037,-72.90118 -20.06205,146.02865 108.92141,99.3125 -145.08101,26.04519 z" />
    <rect
       style="fill:#00ff00;stroke-width:0.121967"
       id="rect5333-2"
       width="19.335554"
       height="2.7179391"
       x="462.00357"
       y="-195.47302" />
    <text
       xml:space="preserve"
       style="font-style:normal;font-weight:normal;font-size:2.3522px;line-height:1.25;font-family:sans-serif;fill:#000000;fill-opacity:1;stroke:none;stroke-width:0.0588051"
       x="485.92468"
       y="-190.18434"
       id="text9297-3"
       transform="scale(0.96912795,1.0318555)"><tspan
         sodipodi:role="line"
         id="tspan9295-7"
         x="485.92468"
         y="-190.18434"
         style="stroke-width:0.0588051">IR</tspan></text>
    <path
       style="fill:none;stroke:#000000;stroke-width:0.121967px;stroke-linecap:butt;stroke-linejoin:miter;stroke-opacity:1"
       d="m 507.9325,-196.78352 c -0.3656,0.007 -0.7069,0.0263 -1.0446,-0.0761 -0.4409,-0.13374 -1.6383,0.0761 -2.0785,0.0761 -1.6837,0 -3.365,-0.0131 -5.0404,0.0761 -0.7539,0.0402 -1.4567,0.20422 -2.2052,0.25152 -1.3821,0.0874 -2.7393,0.17266 -4.1105,0.38065 -0.5725,0.0868 -1.1947,0.0227 -1.7642,0.15226 -0.44,0.10012 -0.8968,0.0719 -1.3383,0.15225 -0.039,0.007 -0.045,0.0691 -0.084,0.0761 -0.2204,0.0401 -0.4461,0.0508 -0.6691,0.0761 -0.3258,0.0371 -0.6824,0.0176 -1.0038,0.0761 -0.1729,0.0315 -0.3269,0.13235 -0.5019,0.15226 -0.1383,0.0157 -0.2821,-0.0275 -0.4182,0 -0.1217,0.0246 -0.2147,0.12108 -0.3346,0.15226 -0.08,0.0209 -0.1689,-0.0149 -0.2509,0 -0.4456,0.0811 -0.8739,0.16827 -1.3363,0.22839 -0.1745,0.0227 -0.3289,0.12078 -0.5018,0.15226 -0.2063,0.0375 -0.4706,-0.0603 -0.6692,0 -0.3077,0.0933 0.095,0.0761 -0.1639,0.0761"
       id="path9970-5" />
    <path
       style="fill:#800000;stroke:#000000;stroke-width:0.121967px;stroke-linecap:butt;stroke-linejoin:miter;stroke-opacity:1"
       d="m 485.3474,-196.61055 c -0.7757,0.5642 -1.665,1.02161 -2.1143,1.83807 -0.062,0.11336 -0.7744,0.77456 -0.7267,0.7988 0.061,0.031 0.3247,-0.012 0.3897,0 0.7214,0.13337 1.1289,0.19392 1.8522,0.24275 0.1663,0.0112 0.8474,0.0764 1.0141,0.15226 0.2308,0.10504 0.783,0.30357 1.0466,0.30357"
       id="path9972-9" />
    <rect
       style="fill:#800000;stroke-width:0.121967"
       id="rect10031-2"
       width="2.6758189"
       height="8.4798994"
       x="516.85425"
       y="-163.43613" />
    <rect
       style="fill:#800000;stroke-width:0.121967"
       id="rect10033-2"
       width="2.3471124"
       height="9.7901649"
       x="535.31335"
       y="-164.09601" />
    <rect
       style="fill:#800000;stroke-width:0.121967"
       id="rect10035-8"
       width="16.051815"
       height="1.233337"
       x="519.53516"
       y="-159.36053" />
    <path
       style="fill:none;stroke:#000000;stroke-width:0.121967px;stroke-linecap:butt;stroke-linejoin:miter;stroke-opacity:1"
       d="m 507.3837,-158.87875 c 1.2199,0.1467 2.4471,0.25773 3.6626,0.38065 0.3647,0.0369 0.7232,0.18695 1.0874,0.22839 0.3795,0.0432 0.7132,0.008 1.0874,0.0761 0.3351,0.061 0.7606,-0.0973 1.0842,0 0.3246,0.0976 0.01,0.0752 0.3346,0.0752"
       id="path10150-9" />
    <path
       style="fill:none;stroke:#000000;stroke-width:0.121967px;stroke-linecap:butt;stroke-linejoin:miter;stroke-opacity:1"
       d="m 514.6907,-160.99201 c 0.4685,0.56455 1.177,1.82931 1.3092,2.5496 0.035,0.19041 0.016,0.42413 0.084,0.6071 0.045,0.12174 0.084,0.20451 0.084,0.35496 0,0.0301 0.083,0.0361 0.07,0.0639 -0.1198,0.25922 -0.073,0.051 -0.1983,0.11038 -0.1881,0.0891 -0.352,0.32043 -0.505,0.45969 -0.5523,0.50262 -1.1629,1.11385 -1.7404,1.48722"
       id="path10152-7" />
    <text
       xml:space="preserve"
       style="font-style:normal;font-weight:normal;font-size:3.21821px;line-height:1.25;font-family:sans-serif;fill:#000000;fill-opacity:1;stroke:none;stroke-width:0.0804552"
       x="407.82544"
       y="-200.25204"
       id="text12422-3"
       transform="scale(1.2387466,0.80726761)"><tspan
         sodipodi:role="line"
         id="tspan12420-6"
         x="407.82544"
         y="-200.25204"
         style="stroke-width:0.0804552">Gire</tspan></text>
    <path
       style="fill:none;stroke:#000000;stroke-width:0.121967px;stroke-linecap:butt;stroke-linejoin:miter;stroke-opacity:1"
       d="m 457.7104,-194.49933 c 0.4183,-0.0101 0.8371,-0.10986 1.2586,-0.055 0.1549,0.0201 0.3167,0.10017 0.459,0.15178 0.1658,0.0601 0.3696,0.0878 0.5437,0.1142 0.056,0.0127 0.1116,0.0254 0.1673,0.0381 0.014,0.0127 0.023,0.0337 0.042,0.0381 0.1394,0.0317 0.093,-0.0212 0.2092,0 0.1637,0.0298 0.323,0.0519 0.4589,0.11419 0.037,0.0171 0.086,-0.012 0.1255,0 0.1096,0.033 0.785,0.1556 0.785,0.0107"
       id="path15331-1" />
    <text
       xml:space="preserve"
       style="font-style:normal;font-weight:normal;font-size:2.0492px;line-height:1.25;font-family:sans-serif;fill:#000000;fill-opacity:1;stroke:none;stroke-width:0.05123"
       x="461.2662"
       y="-192.21587"
       id="text16743-2"
       transform="scale(0.98693123,1.0132418)"><tspan
         sodipodi:role="line"
         id="tspan16741-9"
         x="461.2662"
         y="-192.21587"
         style="stroke-width:0.05123">LoadIR</tspan></text>
    <text
       xml:space="preserve"
       style="font-style:normal;font-weight:normal;font-size:4.87866px;line-height:1.25;font-family:sans-serif;fill:#000000;fill-opacity:1;stroke:none;stroke-width:0.121967"
       x="444.84982"
       y="-224.40997"
       id="text19245-3"
       transform="scale(1.0482041,0.95401266)"><tspan
         sodipodi:role="line"
         id="tspan19243-1"
         x="444.84982"
         y="-224.40997"
         style="stroke-width:0.121967">M C</tspan></text>
    <text
       xml:space="preserve"
       style="font-style:normal;font-weight:normal;font-size:2.79666px;line-height:1.25;font-family:sans-serif;fill:#000000;fill-opacity:1;stroke:none;stroke-width:0.0699164"
       x="387.38257"
       y="-231.09128"
       id="text51859-9"
       transform="scale(1.195707,0.83632528)"><tspan
         sodipodi:role="line"
         id="tspan51857-4"
         x="387.38257"
         y="-231.09128"
         style="stroke-width:0.0699164">001 001 xx</tspan></text>
    <path
       style="fill:none;stroke:#000000;stroke-width:0.121967px;stroke-linecap:butt;stroke-linejoin:miter;stroke-opacity:1"
       d="m 465.6076,-196.70191 c 0.01,-0.84676 0.137,-1.72478 0.3617,-2.54036 0.027,-0.0978 -0.022,-0.20371 0,-0.30261 0.054,-0.24476 0.1827,-0.42781 0.2494,-0.67005 0.051,-0.18496 0.019,-0.4304 0.084,-0.6081 0.042,-0.11418 0.1662,-0.32953 0.1662,-0.37612"
       id="path53366-7" />
    <path
       style="fill:none;stroke:#000000;stroke-width:0.121967px;stroke-linecap:butt;stroke-linejoin:miter;stroke-opacity:1"
       d="m 464.4969,-200.96192 c 0.1649,-0.21074 0.4888,-0.24406 0.6832,-0.42119 0.2988,-0.27227 0.5753,-0.56428 0.8538,-0.85386 0.4834,0.0369 0.096,-0.21053 0.1697,-0.30133 0.2022,-0.2493 1.2007,-0.71678 1.2007,-0.98312 0,-0.0701 -0.01,0.14072 0,0.21039 -0.022,0.361 0.1504,0.6919 0.1999,1.04139 0.043,0.30356 0.04,0.57577 0.084,0.88247 0.099,0.7011 0.4698,1.31408 0.4698,2.05881"
       id="path53368-8" />
    <path
       style="fill:none;stroke:#000000;stroke-width:0.121967px;stroke-linecap:butt;stroke-linejoin:miter;stroke-opacity:1"
       d="m 460.4931,-218.72947 c -0.8012,-0.36486 -1.5822,-0.46819 -2.3448,-0.69956 -0.5684,-0.17243 -2.5314,0.1443 -3.1754,0.22744 -0.1933,0.0249 -0.3942,-0.0348 -0.5855,0 -0.1223,0.0223 -0.2137,0.12474 -0.3346,0.15226 -0.2213,0.0503 -0.4468,0.0848 -0.6692,0.15226 -1.0377,0.31481 -2.1628,0.48946 -3.1785,0.83742 -1.0047,0.34417 -2.0034,0.83071 -2.9291,1.33653 -0.8948,0.48894 0.1234,0.0122 -0.5895,0.38283 -0.6868,0.35706 -1.3707,0.72791 -2.0154,1.14705 -0.4908,0.31904 -2.6767,1.62216 -2.6767,2.13162"
       id="path53370-4" />
    <path
       style="fill:none;stroke:#000000;stroke-width:0.121967px;stroke-linecap:butt;stroke-linejoin:miter;stroke-opacity:1"
       d="m 440.5853,-215.30655 c -0.1009,0.66937 -0.2975,1.3317 -0.4874,1.98549 -0.076,0.25952 -0.8165,2.28562 -0.6743,2.44903 0.096,0.11078 0.8811,0.071 1.0283,0.0493 1.4127,-0.2083 2.9851,-0.82691 4.2892,-1.37229 0.1313,-0.0549 0.8402,-0.34103 0.8402,-0.45882"
       id="path53372-5" />
    <text
       xml:space="preserve"
       style="font-style:normal;font-weight:normal;font-size:2.10323px;line-height:1.25;font-family:sans-serif;fill:#000000;fill-opacity:1;stroke:none;stroke-width:0.0525807"
       x="485.69495"
       y="-201.01022"
       id="text60790-0"
       transform="scale(0.90884958,1.1002921)"><tspan
         sodipodi:role="line"
         id="tspan60788-3"
         x="485.69495"
         y="-201.01022"
         style="stroke-width:0.0525807">Barramento </tspan><tspan
         sodipodi:role="line"
         x="485.69495"
         y="-198.38118"
         id="tspan60792-6"
         style="stroke-width:0.0525807">de Controle</tspan></text>
    <text
       xml:space="preserve"
       style="font-style:normal;font-weight:normal;font-size:3.20462px;line-height:1.25;font-family:sans-serif;fill:#000000;fill-opacity:1;stroke:none;stroke-width:0.0801154"
       x="407.32294"
       y="-224.34526"
       id="text64450-1"
       transform="scale(1.2544526,0.79716046)"><tspan
         sodipodi:role="line"
         x="407.32294"
         y="-224.34526"
         id="tspan64452-0"
         style="stroke-width:0.0801154">Loop:</tspan></text>
    <path
       style="fill:none;stroke:#000000;stroke-width:0.121967px;stroke-linecap:butt;stroke-linejoin:miter;stroke-opacity:1"
       d="m 455.2478,-209.61252 c -0.4008,-0.0235 -0.7445,0.18215 -1.1142,0.26627 -0.7073,0.16094 -1.4868,0.17547 -2.2034,0.32424 -0.1035,0.0215 -0.1932,0.0828 -0.2958,0.10767 -0.6153,0.14919 -1.2328,0.25997 -1.8394,0.44711 -0.8367,0.2581 -0.7436,0.26819 -1.6009,0.57512 -0.3957,0.14168 -0.8111,0.23918 -1.1964,0.40296 -0.284,0.12072 -0.6468,0.36231 -0.9091,0.49963 -0.2345,0.12277 -0.488,0.2154 -0.715,0.34936 -0.1507,0.0889 -0.2633,0.22451 -0.4122,0.31591 -0.1821,0.11178 -0.3907,0.18394 -0.5764,0.29079 -0.6917,0.39804 -1.3487,0.84451 -2.0382,1.24567 -0.3412,0.19852 -0.7021,0.36902 -1.0349,0.57908 -0.24,0.15148 -0.4477,0.34165 -0.6796,0.50327 -0.4557,0.3177 -0.9522,0.58509 -1.4068,0.90423 -0.3465,0.24326 -0.099,0.21772 -0.3583,0.21772"
       id="path65361-6" />
    <path
       style="fill:none;stroke:#000000;stroke-width:0.121967px;stroke-linecap:butt;stroke-linejoin:miter;stroke-opacity:1"
       d="m 437.7349,-204.4306 c -0.2715,0.5492 -0.5661,1.10787 -0.9222,1.61602 -0.2124,0.30309 -0.4745,0.58855 -0.5972,0.91443 -0.071,0.18811 -0.2488,0.36754 -0.1774,0.58607 0.067,0.20654 0.7788,0.11705 1.0946,0.11705 0.2853,0 0.5716,0.0212 0.856,0 0.4361,-0.0325 0.8653,-0.17125 1.3012,-0.21533 0.4759,-0.0481 0.9703,0.0429 1.4195,-0.16149"
       id="path65363-3" />
    <text
       xml:space="preserve"
       style="font-style:normal;font-weight:normal;font-size:2.45293px;line-height:1.25;font-family:sans-serif;fill:#000000;fill-opacity:1;stroke:none;stroke-width:0.0613233"
       x="428.99789"
       y="-211.91728"
       id="text67303-2"
       transform="scale(1.0244403,0.97614277)"><tspan
         sodipodi:role="line"
         id="tspan67301-0"
         x="428.99789"
         y="-211.91728"
         style="stroke-width:0.0613233">Barramento </tspan><tspan
         sodipodi:role="line"
         x="428.99789"
         y="-208.85112"
         id="tspan67305-6"
         style="stroke-width:0.0613233">de Endereco</tspan></text>
    <path
       style="fill:none;stroke:#000000;stroke-width:0.121967px;stroke-linecap:butt;stroke-linejoin:miter;stroke-opacity:1"
       d="m 433.4074,-214.19219 c 0.1734,-0.005 0.3002,-0.12329 0.4542,-0.16985 0.029,-0.009 0.074,0.005 0.1045,0 0.1127,-0.0205 0.2377,-0.0559 0.3555,-0.0381 0.1306,0.0198 0.2368,0.10008 0.3346,0.17129 0.036,0.0265 0.093,0.0464 0.1255,0.0761 0.1952,0.17766 0.261,0.79391 0.2312,1.03616 -0.016,0.13283 -0.087,0.27157 -0.1259,0.40038 -0.1053,0.35148 0.058,-0.16544 -0.021,0.19406 -0.023,0.10277 -0.073,0.1996 -0.085,0.30757 -0.036,0.32555 0.1121,0.70592 0.3973,0.91355 0.1337,0.0973 0.5631,0.14256 0.719,0.11457 0.2063,-0.037 0.3599,-0.17129 0.5814,-0.17129 0,0 -0.01,0 -0.012,0 -0.05,0 -0.042,-0.004 -0.1001,0.019 -0.119,0.0464 -0.2457,0.10884 -0.3555,0.1713 -0.2137,0.12153 -0.7431,0.43829 -0.8584,0.64766 -0.018,0.0324 -0.028,0.0958 -0.042,0.13252 -0.018,0.0488 -0.037,0.11932 -0.021,0.17129 0.01,0.022 0.031,0.0366 0.042,0.0571 0.1599,0.29109 0.3251,0.34592 0.6712,0.41919 0.053,0.0111 0.1022,0.0327 0.1554,0.0404 0.041,0.006 0.084,-0.004 0.1255,0 0.1024,0.0104 0.2526,0.0582 0.3345,0.1142 0.2081,0.14202 0.2963,0.24244 0.4404,0.43921 0.1218,0.16631 0.2639,0.32239 0.386,0.48948 0.2192,0.29996 0.3734,0.78598 0.3162,1.15001 -0.012,0.0755 -0.063,0.18379 -0.1045,0.24742 -0.01,0.0154 -0.033,0.022 -0.042,0.0381 -0.013,0.0234 -0.01,0.0522 -0.021,0.0761 -0.034,0.0691 -0.085,0.12957 -0.1283,0.19437 -0.1137,0.17211 -0.2304,0.36311 -0.3819,0.50104 -0.023,0.0206 -0.072,0.0482 -0.1016,0.0748"
       id="path68584-1" />
    <text
       xml:space="preserve"
       style="font-size:16px;line-height:1.25;font-family:sans-serif"
       x="125.93787"
       y="-136.50348"
       id="text184699"><tspan
         sodipodi:role="line"
         id="tspan184697"
         x="125.93787"
         y="-136.50348">LoadR0</tspan><tspan
         sodipodi:role="line"
         x="125.93787"
         y="-116.50348"
         id="tspan184701">LoadR1</tspan><tspan
         sodipodi:role="line"
         x="125.93787"
         y="-96.503479"
         id="tspan184703">SelM1_0</tspan><tspan
         sodipodi:role="line"
         x="125.93787"
         y="-76.503479"
         id="tspan184705">SelM1_1</tspan><tspan
         sodipodi:role="line"
         x="125.93787"
         y="-56.503479"
         id="tspan184707">SelM2</tspan><tspan
         sodipodi:role="line"
         x="125.93787"
         y="-36.503479"
         id="tspan185849">R/W</tspan><tspan
         sodipodi:role="line"
         x="125.93787"
         y="-16.503479"
         id="tspan189271">OP</tspan></text>
  </g>
</svg>
