<?xml version="1.0" encoding="UTF-8" standalone="no"?>
<!-- Created with Inkscape (http://www.inkscape.org/) -->

<svg
   width="331.00497mm"
   height="246.94231mm"
   viewBox="0 0 331.00497 246.9423"
   version="1.1"
   id="svg5"
   inkscape:version="1.1 (c4e8f9ed74, 2021-05-24)"
   sodipodi:docname="Evol_A03.svg"
   xmlns:inkscape="http://www.inkscape.org/namespaces/inkscape"
   xmlns:sodipodi="http://sodipodi.sourceforge.net/DTD/sodipodi-0.dtd"
   xmlns="http://www.w3.org/2000/svg"
   xmlns:svg="http://www.w3.org/2000/svg">
  <sodipodi:namedview
     id="namedview7"
     pagecolor="#ffffff"
     bordercolor="#666666"
     borderopacity="1.0"
     inkscape:pageshadow="2"
     inkscape:pageopacity="1"
     inkscape:pagecheckerboard="0"
     inkscape:document-units="mm"
     showgrid="false"
     inkscape:snap-global="false"
     inkscape:zoom="0.4641344"
     inkscape:cx="-173.44114"
     inkscape:cy="329.6459"
     inkscape:window-width="1366"
     inkscape:window-height="699"
     inkscape:window-x="0"
     inkscape:window-y="32"
     inkscape:window-maximized="1"
     inkscape:current-layer="layer1" />
  <defs
     id="defs2">
    <rect
       x="653.33167"
       y="524.47491"
       width="2.5585918"
       height="46.549221"
       id="rect22071" />
    <rect
       x="124.98784"
       y="622.19208"
       width="1.9980102"
       height="158.7374"
       id="rect12648" />
  </defs>
  <g
     inkscape:label="Layer 1"
     inkscape:groupmode="layer"
     id="layer1"
     transform="translate(-1.7011012,37.659542)">
    <path
       style="fill:none;stroke:#000000;stroke-width:0.264583px;stroke-linecap:butt;stroke-linejoin:miter;stroke-opacity:1"
       d="m 11.313798,33.475144 c 0.06471,-0.171842 0.11669,-0.349028 0.194126,-0.51552 0.191755,-0.412281 0.126037,-0.01225 0.289813,-0.503589 0.01502,-0.04507 -0.02124,-0.100026 0,-0.142515 0.01062,-0.02125 0.05365,0.01595 0.07126,0 0.03531,-0.03198 0.155387,-0.873207 0.206215,-1.025692 0.153494,-0.460481 -0.113388,-1.373883 0.07037,-1.929781 0.04653,-0.140753 0.0015,-0.357428 0.07039,-0.49081 0.124816,-0.241694 0.34148,-0.598691 0.426645,-0.854186 0.01502,-0.04507 -0.02103,-0.09992 0,-0.142515 0.01038,-0.02103 0.05378,0.01659 0.07036,0 0.01984,-0.01984 0.16461,-0.553339 0.195552,-0.615228 0.07754,-0.155096 0.224972,-0.307319 0.276614,-0.471276 0.117053,-0.371626 0.233542,-0.684143 0.417774,-1.052608 0.06345,-0.126902 -0.06045,-0.01605 0,-0.139148 0.106866,-0.217605 0.25061,-0.434453 0.349649,-0.633786 0.06215,-0.125093 0.220003,-0.228016 0.284138,-0.356286 0.08832,-0.176639 0.178047,-0.396134 0.279699,-0.497883 8.8e-5,-8.9e-5 -8.9e-5,-0.131681 0,-0.131854 0.04248,-0.08279 0.165116,-0.378897 0.212871,-0.426652 0.01659,-0.01658 0.05378,0.01658 0.07037,0 0.0044,-0.0044 -0.0037,-0.117905 0,-0.128849 0.09576,-0.283474 0.292529,-0.591643 0.424183,-0.85329 0.04804,-0.09548 -0.04743,-0.04675 0,-0.141612 0.06697,-0.133944 0.131518,-0.271105 0.198873,-0.400322 0.166762,-0.319921 0.396132,-0.452599 0.556969,-0.768952 0.03675,-0.07229 0.0938,-0.303056 0.142514,-0.351768 0.03737,-0.03737 0.104333,-0.03381 0.141623,-0.07126 0.20428,-0.205135 0.314649,-0.593324 0.498801,-0.783829 0.01596,-0.01651 0.05273,0.01632 0.06888,0 0.101256,-0.102322 0.133592,-0.306372 0.213772,-0.426641 0.159686,-0.239529 0.337766,-0.471021 0.4988,-0.712572 0.114826,-0.172239 0.415371,-0.479055 0.495612,-0.639538 0.329522,-0.659042 0.783554,-1.61458 1.248358,-1.975515 0.126211,-0.09801 -0.142602,0.0075 0,-0.099 0.01879,-0.01403 0.05388,0.01669 0.07035,0 0.0128,-0.01297 0.294047,-0.635641 0.334709,-0.716967 0.04638,-0.09277 -0.04419,-0.04857 0,-0.13915 0.06729,-0.137909 0.198515,-0.20722 0.276324,-0.285029 0.0688,-0.0688 0.0899,-0.224118 0.140192,-0.274362 0.04037,-0.04032 0.174894,-0.03904 0.207624,-0.137226 0.01502,-0.04507 -0.02125,-0.100025 0,-0.142514 0.0066,-0.01315 0.368535,-0.296165 0.398897,-0.327156 0.04397,-0.04488 0.103491,-0.246023 0.187198,-0.302677 0.0363,-0.02457 0.100516,0.031 0.131513,0 0.01977,-0.01977 0.04806,-0.174619 0.06995,-0.193385 0.259611,-0.222526 0.493927,-0.551613 0.736766,-0.794228 0.04915,-0.0491 0.520014,-0.257503 0.532388,-0.275948 5.29e-4,-7.94e-4 -5.3e-4,-0.130907 0,-0.131443 0.106206,-0.106207 0.300677,-0.294384 0.412603,-0.413911 0.06159,-0.06577 0.148944,-0.287207 0.212882,-0.351145 0.03423,-0.03423 0.226237,-0.09419 0.259773,-0.133334 0.04047,-0.04723 0.0482,-0.163241 0.141614,-0.209948 0.05703,-0.02851 0.470463,-0.268306 0.481337,-0.278825 0.02669,-0.02581 0.03008,-0.103825 0.05848,-0.127434 0.009,-0.0075 0.331679,-0.104803 0.406854,-0.190655 0.27235,-0.31103 0.666164,-0.766412 1.191773,-1.1168209 0.0475,-0.023752 0.09501,-0.047505 0.142512,-0.071257 0.02345,0 0.04936,0.010438 0.07037,0 0.249717,-0.1240727 0.461487,-0.3718592 0.71077,-0.4961081 0.09318,-0.046441 0.273759,-0.088194 0.355407,-0.1425146 0.163073,-0.1084882 0.323144,-0.3389371 0.497914,-0.4257752 0.305321,-0.1517033 0.610182,-0.3323015 0.903483,-0.4838456 0.03596,-0.018576 0.08608,0.01973 0.12141,0 0.05847,-0.032649 0.0829,-0.1110922 0.142515,-0.1416164 0.06378,-0.032662 0.338066,-0.079928 0.376314,-0.1249129 0.01519,-0.017867 -0.02103,-0.059978 0,-0.070361 0.0426,-0.021029 0.09745,0.015023 0.142513,0 0.124113,-0.041371 0.233129,-0.1537962 0.351303,-0.2128888 0.04063,-0.020317 0.09591,0.020841 0.136276,0 0.273955,-0.1414579 0.524915,-0.225943 0.782056,-0.3545136 0.06319,-0.031594 0.143401,0.017134 0.211936,0 0.288338,-0.072089 0.687824,-0.097024 0.918094,-0.2128647 0.07252,-0.036484 0.2013,0.037222 0.27338,0 0.191096,-0.098679 0.397196,-0.071595 0.60115,-0.1407443 0.08072,-0.027366 0.132024,-0.1146733 0.212881,-0.1416248 0.06364,-0.045275 0.145534,0.022355 0.212878,0 0.210468,-0.06986 0.424656,-0.1589371 0.640422,-0.212878 0.30422,-0.076055 0.746175,0 1.063868,0 0.816898,0 1.633794,0 2.450692,0"
       id="path42" />
    <path
       style="fill:none;stroke:#000000;stroke-width:0.264583px;stroke-linecap:butt;stroke-linejoin:miter;stroke-opacity:1"
       d="m 117.45098,10.12306 c 0.19343,0.24559 -0.6094,0.532174 -0.48969,0.760189 0.002,0.0044 0.16294,0.319719 0.21377,0.347897 0.42794,0.237247 0.63797,-0.563633 0.52806,-0.831403 -0.0474,-0.115434 -0.16907,-0.183576 -0.25214,-0.276683 z"
       id="path44" />
    <path
       style="fill:none;stroke:#000000;stroke-width:0.264583px;stroke-linecap:butt;stroke-linejoin:miter;stroke-opacity:1"
       d="m 132.19702,26.830444 c -0.0329,-0.836595 -0.17383,-1.667126 -0.17383,-2.502679 0,-0.18008 -0.0318,-0.362986 0,-0.540241 0.0142,-0.07918 0.55021,-1.941301 0.43286,-2.113687 -0.27557,-0.404808 -1.8228,-0.09439 -2.21559,-0.06671 -0.19411,0.01368 -0.38983,-0.01576 -0.58378,0 -0.0862,0.007 -0.91545,0.211199 -0.92483,0.160281 -0.0338,-0.183283 0.59695,-1.276051 0.7234,-1.596981 0.69466,-1.763049 1.42983,-3.554946 1.92324,-5.387551 0.12589,-0.467554 0.22432,-0.942129 0.32751,-1.41521 0.0183,-0.0841 0.18071,-0.783133 0.0804,-0.894932 -0.25973,-0.289603 -0.77825,-0.01328 -1.16703,0 -0.69605,0.02377 -1.3908,0.07694 -2.08652,0.108915 -0.90534,0.04161 -1.81592,-0.03773 -2.72145,0 -0.51007,0.02125 -1.01935,0.06113 -1.52774,0.107607 -0.1726,0.01578 -0.38439,0.186682 -0.51486,0.07259 -0.0799,-0.06988 0.33858,-0.655846 0.5634,-1.159621 0.17571,-0.393697 0.53779,-1.350456 0.66186,-1.7918899 0.3291,-1.1708277 -0.28313,-1.0032677 -1.28466,-1.0032677 -0.5756,0 -1.1512,0 -1.7268,0 -0.63601,0 -1.27201,0 -1.90802,0"
       id="path46" />
    <path
       style="fill:none;stroke:#000000;stroke-width:0.264583px;stroke-linecap:butt;stroke-linejoin:miter;stroke-opacity:1"
       d="m 132.19702,26.830444 c 0.57937,-2.279733 0.35711,-2.137133 1.74764,-4.259486 3.45088,-5.267049 0.58542,-0.02922 3.83498,-5.682417 0.24021,-0.417873 0.41745,-0.868956 0.6188,-1.306873 0.0568,-0.123507 0.13204,-0.243115 0.15545,-0.377022 0.0224,-0.127812 -0.10172,-0.24943 -0.20036,-0.333721 -0.93376,-0.797909 -1.91673,-1.537395 -2.84356,-2.34335 -0.35285,-0.306838 -0.66129,-0.661298 -0.99194,-0.991947 -1.20441,-1.204409 -1.70824,-1.476513 -2.42403,-2.8794834 -0.1343,-0.2632358 -0.19998,-0.5574713 -0.26822,-0.8449985 -0.0219,-0.092441 -0.0471,-0.202538 0,-0.2850298 0.25663,-0.4491148 1.85305,-0.992415 2.53468,-1.2890002 0.75039,-0.3265009 1.34876,-0.6984717 2.07174,-1.0599626"
       id="path48" />
    <path
       style="fill:none;stroke:#000000;stroke-width:0.264583px;stroke-linecap:butt;stroke-linejoin:miter;stroke-opacity:1"
       d="m 132.19702,26.830444 c -1.67809,-0.346914 -1.19475,-0.41238 -2.90907,-0.09606 -0.81392,0.15018 -2.50731,0.52101 -3.2342,1.009642 -0.35559,0.239043 -0.30404,0.765667 -0.34938,0.641316 -0.22278,-0.611016 -0.32717,-1.267825 -0.61122,-1.852877 -0.15712,-0.323623 -0.4584,-0.554593 -0.69091,-0.829097 -0.70464,-0.831866 -1.38092,-1.689046 -2.12054,-2.489979 -0.17387,-0.188295 -1.50005,-1.510433 -1.90985,-1.646204 -0.28695,-0.09507 -0.6194,0.279224 -0.75775,0.390001 -0.43864,0.351245 -0.8782,0.702606 -1.29341,1.081274 -0.52647,0.480144 -1.16288,1.289073 -1.80262,1.722392 -0.3947,0.267339 -1.21029,-0.849816 -1.92553,-1.144373 -0.63254,-0.260493 -1.30705,-0.429474 -1.98495,-0.52112 -0.61764,-0.0835 -1.24652,0 -1.86977,0 -1.70331,0 -3.45,-0.07824 -5.13655,0.211192"
       id="path50" />
    <path
       style="fill:none;stroke:#000000;stroke-width:0.264583px;stroke-linecap:butt;stroke-linejoin:miter;stroke-opacity:1"
       d="m 132.22427,26.555939 c -0.10188,-0.04295 -0.21047,-0.07257 -0.30563,-0.12886 -0.32107,-0.189915 -0.57574,-0.445357 -0.91481,-0.614375 -0.67371,-0.335835 -0.46352,-0.140955 -1.29667,-0.453664 -0.75579,-0.283674 -1.49867,-0.672875 -2.27397,-0.904174 -0.20168,-0.06017 -0.43594,0.01624 -0.62735,-0.07126 -0.045,-0.02055 0.22817,-1.448421 0.3016,-1.684793 0.16133,-0.519331 0.57526,-1.299149 0.42775,-1.883717 -0.0635,-0.251491 -1.7154,-0.925328 -1.9272,-0.999553 -0.39963,-0.140049 -0.76943,-0.371379 -1.18266,-0.4639 -0.54772,-0.122634 -1.11742,-0.108577 -1.6746,-0.176284 -0.22088,-0.02684 -0.4411,-0.05901 -0.66215,-0.08447 -0.0236,-0.0027 -0.0682,0.02356 -0.0713,0 -0.0947,-0.730144 0.1646,-1.323522 0.4561,-1.98104 0.14745,-0.33257 0.33028,-0.521655 0.33506,-0.883891 0.005,-0.394759 -1.48682,-1.001866 -1.65658,-1.110369 -0.21226,-0.135667 -0.39638,-0.311436 -0.60289,-0.4557 -0.3824,-0.267141 -0.84184,-0.435908 -1.21332,-0.714518 -0.0537,-0.04031 -0.0801,-0.117564 -0.14251,-0.142515 -0.048,-0.0192 -0.25736,0.05944 -0.28503,-0.07126 -0.0289,-0.136338 -0.0376,-2.812465 0.14251,-2.992635"
       id="path54" />
    <ellipse
       style="fill:#00ffff;stroke-width:0.264583"
       id="path80"
       cx="117.98444"
       cy="10.428384"
       rx="2.5845032"
       ry="2.5675304" />
    <path
       style="fill:none;stroke:#000000;stroke-width:0.264583px;stroke-linecap:butt;stroke-linejoin:miter;stroke-opacity:1"
       d="m 117.72096,10.052228 c -0.0346,0.07338 -0.0765,0.143722 -0.10367,0.22014 -0.0646,0.181505 -0.0354,0.22104 0.15077,0.22104 0.0308,0 0.15518,0.01845 0.18672,0 0.0917,-0.05362 0.0739,-0.136415 0.13244,-0.194988 0.0113,-0.0113 0.0933,0.02395 0.0691,-0.02142 -0.0491,-0.09209 -0.141,-0.109919 -0.20261,-0.201955 -0.0649,-0.09691 -0.0915,-0.1019839 -0.23278,-0.02282 z"
       id="path195" />
    <path
       style="fill:none;stroke:#000000;stroke-width:0.264583px;stroke-linecap:butt;stroke-linejoin:miter;stroke-opacity:1"
       d="m 118.92018,13.123668 c -0.0715,-0.452461 0.0719,-0.890651 0.0719,-1.33278"
       id="path197" />
    <path
       style="fill:none;stroke:#000000;stroke-width:0.264583px;stroke-linecap:butt;stroke-linejoin:miter;stroke-opacity:1"
       d="m 111.93915,31.967417 c -0.0178,-0.131837 -0.0165,-0.267692 -0.0534,-0.395507 -0.14512,-0.502719 -0.13489,-0.09688 -0.21752,-0.510014 -0.0426,-0.21277 -0.0357,-0.427929 -0.0713,-0.641315 -0.10425,-0.625507 -0.0262,0.108923 -0.14251,-0.356286 -0.10271,-0.410837 -0.0117,-0.863639 -0.0713,-1.280845 -0.0747,-0.522756 -0.16016,-1.174964 -0.0713,-1.708391 0.0847,-0.508074 0.18423,-0.992404 0.28503,-1.4964 0.0208,-0.104161 0.12168,-0.180868 0.14251,-0.285029 0.0826,-0.412981 0.16784,-0.80119 0.28503,-1.211372 0.0261,-0.09135 -0.0261,-0.193675 0,-0.285029 0.12629,-0.442023 0.35142,-0.897156 0.42754,-1.353887 0.0117,-0.07029 -0.0173,-0.144642 0,-0.213772 0.061,-0.244185 0.2058,-0.474881 0.28503,-0.712571 0.20183,-0.605477 -0.0112,-0.0042 0.0713,-0.498801 0.0648,-0.388565 0.27916,-0.754489 0.35629,-1.140115 0.046,-0.229736 0.0468,-0.489227 0.14251,-0.712572 0.0337,-0.07872 0.11245,-0.133584 0.14252,-0.213772 0.0507,-0.135281 0.0176,-0.293396 0.0713,-0.427543 0.131,-0.327506 0.23235,-0.776071 0.42754,-1.068858 0.21769,-0.326532 0.53106,-0.631266 0.78651,-0.92902 0.38851,-0.452856 0.74012,-0.978154 1.21367,-1.356992 0.44575,-0.356599 0.95287,-0.739096 1.35389,-1.140115 0.13644,-0.136439 1.01507,-1.316474 1.01507,-1.354076"
       id="path199" />
    <path
       style="fill:none;stroke:#000000;stroke-width:0.264583px;stroke-linecap:butt;stroke-linejoin:miter;stroke-opacity:1"
       d="m 115.87283,13.673299 c 0.79814,-0.405295 1.60824,-0.749681 2.43541,-1.087738 0.14812,-0.06053 0.29591,-0.126518 0.42905,-0.215274 0.028,-0.01863 0.0443,-0.09128 0.0713,-0.07126 0.10854,0.08059 -0.7996,2.273614 -0.7996,2.663714"
       id="path201" />
    <path
       style="fill:none;stroke:#000000;stroke-width:0.264583px;stroke-linecap:butt;stroke-linejoin:miter;stroke-opacity:1"
       d="m 9.6761066,4.8216809 c 0.3015938,2.4127507 0.018169,-0.2441033 0.1449197,2.9640813 0.015198,0.3846689 0.098715,0.7644473 0.1166963,1.1489962 0.098685,2.1104856 -0.035856,4.2255046 0.0849,6.3351736 0.02202,0.384794 -0.028289,0.771887 0,1.156272 0.170713,2.319577 0.473447,4.693211 0.314949,7.031981 -0.03458,0.510336 -0.189661,1.008398 -0.229858,1.518504 -0.105446,1.338124 -0.2471123,2.721474 -0.4670107,4.048989 -0.09585,0.578641 -0.2606992,1.149104 -0.3153317,1.735997 -0.031633,0.33982 0.048471,0.704152 0,1.042233 -0.06552,0.456999 -0.071257,0.885733 -0.071257,1.352095"
       id="path203" />
    <path
       style="fill:none;stroke:#000000;stroke-width:0.264583px;stroke-linecap:butt;stroke-linejoin:miter;stroke-opacity:1"
       d="m 5.7090947,33.619694 c 1.1625691,-0.312479 2.3385306,-0.218993 3.5140717,-0.293611 0.443621,-0.02816 0.8855396,-0.09981 1.3264146,-0.150209 0.416037,-0.04756 0.862975,0 1.28263,0 1.105354,0 2.201042,0.05362 3.295195,0.153119 0.961072,0.0874 1.95736,0 2.923494,0 1.330348,0 2.699127,0.06593 4.029961,0 1.29342,-0.06408 2.578815,-0.274383 3.874795,-0.313634 1.372077,-0.04156 2.753342,0.05169 4.125783,0 1.831488,-0.06898 3.650417,-0.08931 5.484614,-0.08931 0.439214,0 0.879433,-0.02971 1.317641,0 1.866151,0.126513 3.634055,0.711824 5.476814,0.961416 0.620699,0.08407 1.385388,0.01693 1.385388,0.227097"
       id="path205" />
    <path
       style="fill:none;stroke:#000000;stroke-width:0.264583px;stroke-linecap:butt;stroke-linejoin:miter;stroke-opacity:1"
       d="m 43.842418,32.572589 c 0.674122,0.239869 0.937887,0.327972 1.56477,0.569323 0.193183,0.07438 0.395869,0.126679 0.581022,0.219255 0.722818,0.36141 0.514514,0.498863 -0.13267,1.031748 -0.118665,0.09771 -0.245949,0.184459 -0.368924,0.27669 -0.256315,0.22959 -0.50623,0.466532 -0.768951,0.688766 -0.231529,0.195847 -0.21377,0.04653 -0.21377,0.206537"
       id="path207" />
    <path
       style="fill:none;stroke:#000000;stroke-width:0.264583px;stroke-linecap:butt;stroke-linejoin:miter;stroke-opacity:1"
       d="M 8.911053,5.8838192 C 9.3486456,5.028798 8.844088,5.9775292 9.6061825,4.7434476 9.6789535,4.6256072 9.7580155,4.5110389 9.8199542,4.3871615 c 0.010623,-0.021243 -0.020571,-0.083133 0,-0.071257 0.032331,0.018664 0.03339,0.066781 0.050085,0.1001716 0.1525108,0.3050217 0.3050228,0.6100434 0.4575328,0.9150651 0.23841,0.4768191 0.693541,1.6423415 1.106896,2.0556966"
       id="path209" />
    <path
       style="fill:none;stroke:#000000;stroke-width:0.264583px;stroke-linecap:butt;stroke-linejoin:miter;stroke-opacity:1"
       d="m 2.7187562,5.1755389 c 0.2401742,1.1773048 0.2765949,2.3641822 0.5214662,3.5379106 0.00957,0.045859 0.1576821,1.1296555 0.3367386,1.3087115"
       id="path211" />
    <path
       style="fill:none;stroke:#000000;stroke-width:0.264583px;stroke-linecap:butt;stroke-linejoin:miter;stroke-opacity:1"
       d="M 1.7252003,5.5554313 C 1.9198075,5.5728726 2.1204592,5.6589437 2.309022,5.6077553 2.6344664,5.5194078 2.9024961,5.2854246 3.2121083,5.1517846 6.2252036,3.8512236 3.1288593,5.3546398 5.7122043,4.0629683 6.2170095,3.8105659 6.0157137,3.8210595 6.2664157,3.8210595"
       id="path213" />
    <path
       style="fill:none;stroke:#000000;stroke-width:0.264583px;stroke-linecap:butt;stroke-linejoin:miter;stroke-opacity:1"
       d="M 1.7533787,6.952076 C 2.0815399,6.810907 2.2278428,7.3868218 2.4520333,7.4508764 3.340133,7.7046192 4.8249892,6.711698 5.7905117,6.711698"
       id="path215" />
    <path
       style="fill:none;stroke:#000000;stroke-width:0.264583px;stroke-linecap:butt;stroke-linejoin:miter;stroke-opacity:1"
       d="m 2.6051684,12.58958 c 0,0.312632 -0.014906,0.62562 0,0.937897 0.1197658,2.509062 0.094239,-0.279066 0.094239,1.882044 0,0.204825 0,0.409649 0,0.614474 0,0.04794 -0.016904,0.1887 0,0.143834 C 3.1356011,15.01005 2.9831487,15.227121 3.2279206,13.935957 3.3356742,13.367561 3.572379,12.806712 3.572379,12.228018"
       id="path217" />
    <path
       style="fill:none;stroke:#000000;stroke-width:0.264583px;stroke-linecap:butt;stroke-linejoin:miter;stroke-opacity:1"
       d="m 3.7161993,11.94038 c 0.1897695,0.674903 0.1267728,1.387475 0.2555957,2.071019 0.088417,0.469146 0.2507584,0.811595 0.3033313,0.781261 0.2427129,-0.140045 1.4076225,-1.994018 1.5026791,-2.165723 0.1882883,-0.340113 0.3897492,-0.744298 0.5147402,-1.117734 0.035192,-0.105143 -0.070385,-0.07124 0,-0.211145 0.030193,-0.06001 0.087203,-0.104382 0.1425144,-0.142514 0.017621,-0.01215 0.055116,-0.01938 0.064207,0 0.095051,0.202585 0.1626698,0.417223 0.2314574,0.630163 0.079636,0.246521 0.1610794,0.493587 0.2135119,0.74729 0.048482,0.234586 0.057945,0.475573 0.088321,0.713183 0.3032495,2.372063 -0.1437664,-1.370209 0.075144,1.187367 0.02118,0.24744 0.2223418,0.436371 0.2223418,0.667025"
       id="path219" />
    <path
       style="fill:none;stroke:#000000;stroke-width:0.264583px;stroke-linecap:butt;stroke-linejoin:miter;stroke-opacity:1"
       d="m 50.901089,33.364569 c -0.459648,-0.156541 -0.907352,-0.120798 -1.379921,-0.120798 -0.500611,0 -1.357522,0.0027 -1.779625,0.284123 -0.386559,0.257707 0.139819,-0.0823 -0.07126,0.142515 -0.01527,0.01624 -0.05999,-0.02119 -0.0669,0 -0.08955,0.274471 0.0036,0.817584 0.142515,1.060151 0.226229,0.394996 0.908992,1.19494 1.214133,1.500079 0.108562,0.108561 0.261221,0.142473 0.356286,0.213773 0.155014,0.11626 0.288229,0.385429 0.4988,0.427543 0.12986,0.02598 0.821317,0.08626 0.926343,0.07126 0.284755,-0.04068 0.920904,-0.537239 1.068859,-0.783828 0.147627,-0.246047 0.02019,-0.172175 0.07126,-0.427546 0.02508,-0.12546 0.156888,-0.238648 0.0034,-0.342638 -0.699329,-0.473646 -1.098423,-0.356285 -1.922164,-0.356285"
       id="path221" />
    <path
       style="fill:none;stroke:#000000;stroke-width:0.264583px;stroke-linecap:butt;stroke-linejoin:miter;stroke-opacity:1"
       d="m 36.850502,6.3668039 c 0.03654,-0.1310426 -0.06131,-0.6851685 0,-0.7581485 0.05989,-0.071291 0.180806,-0.044577 0.271137,-0.06716 0.120317,-0.030079 0.187193,-0.054067 0.281908,-0.1064443 0.09645,-0.053337 0.520669,0.028783 0.635802,0 0.08947,-0.022368 0.176279,-0.041879 0.264046,-0.071257 0.06508,-0.021783 0.119396,0.033947 0.181063,0.033947 0.168941,0 0.337886,0 0.50683,0 0.01381,0 0.105016,-0.00942 0.111784,0 0.0065,0.00905 -0.0081,0.025768 0,0.033452 0.01762,0.016754 0.997212,0 1.064178,0 0.193783,0 0.3654,-0.035629 0.5602,-0.035629 0.0057,0 0.05795,0.00332 0.05968,0 0.10573,-0.2030462 0.0592,-0.8353877 0.08636,-0.846651 0.16587,-0.068773 0.51001,0.058933 0.686808,0 0.747284,-0.2490967 1.959168,-0.1420685 2.790843,-0.1420685 0.160986,0 0.95059,0.041675 1.032127,0 0.222329,-0.1136381 -0.0016,-0.7613923 0.0911,-0.8936943 0.003,-0.00427 0.07347,0 0.07394,0 0.142113,0 0.317108,0.02331 0.456962,0 0.303906,-0.050651 -0.122878,-0.035629 0.249399,-0.035629 0.328215,0 0.642704,-0.018047 0.961972,-0.071257 0.323085,-0.053848 0.702569,0 1.030115,0 0.305692,0 0.90908,0.053155 1.174856,0 0.08656,-0.017312 0.100449,-0.035629 0.175842,-0.035629"
       id="path223" />
    <path
       style="fill:none;stroke:#000000;stroke-width:0.264583px;stroke-linecap:butt;stroke-linejoin:miter;stroke-opacity:1"
       d="m 32.774339,5.0617606 c -0.32145,0.1649553 -0.634293,0.3377338 -0.977572,0.4521597 -0.439258,0.1464199 -0.908378,0.2296173 -1.340339,0.394462 -0.300511,0.1146813 -0.594058,0.2395834 -0.889611,0.3626784 -0.155165,0.064625 -0.368049,0.110091 -0.511995,0.1820637 -0.163735,0.081867 -0.284314,0.2131209 -0.427543,0.3206573 -0.145947,0.1095759 -0.282721,0.1627812 -0.429369,0.2507702 -0.08916,0.053498 -0.164454,0.1528414 -0.249401,0.2137717 -0.161444,0.1158002 -0.34062,0.2105369 -0.503362,0.3244292 -0.06486,0.04539 -0.116983,0.1088117 -0.185841,0.1478727 -0.153146,0.086877 -0.336804,0.1179632 -0.480081,0.2203029 -0.298545,0.2132468 -0.565262,0.4860825 -0.858502,0.7100615 -0.05257,0.040151 -0.751755,0.5437061 -0.847825,0.6260849 -0.09235,0.079192 -0.167328,0.17687 -0.256348,0.2597915 -0.266595,0.2483291 -0.579925,0.4926057 -0.873552,0.7073707 -0.454941,0.332753 -0.977152,0.569309 -1.437857,0.895287 -0.151388,0.107116 -0.283865,0.239227 -0.433947,0.348165 -0.268365,0.194793 -0.550499,0.36988 -0.826762,0.553301 -0.520315,0.345457 -1.088088,0.620087 -1.595339,0.984891 -0.529972,0.381145 -1.044194,0.797514 -1.550163,1.209782 -0.249564,0.143382 -0.402809,0.392124 -0.618274,0.5722 -0.0807,0.06745 -0.198819,0.0835 -0.273189,0.15787 -0.04578,0.04578 -0.06105,0.111886 -0.137918,0.173108 -0.211989,0.16885 0.02703,-0.06265 -0.106886,0.07126 0.07502,-0.03704 0.14316,-0.094 0.225055,-0.111113 0.261232,-0.05458 0.742363,0 1.012789,0 0.822269,0 1.644539,0 2.466808,0 0.741403,0 1.483085,-0.02035 2.224209,0 0.801292,0.022 2.276641,0.125887 3.068255,0.142514 0.967501,0.02032 1.943073,0 2.912175,0"
       id="path227" />
    <path
       style="fill:none;stroke:#000000;stroke-width:0.264583px;stroke-linecap:butt;stroke-linejoin:miter;stroke-opacity:1"
       d="m 24.778157,12.198721 c 0.07111,0.132802 0.150417,0.261531 0.213335,0.398406 0.02735,0.0595 0.37801,0.926041 0.459905,1.091195 0.124694,0.251464 0.492422,0.732217 0.492422,1.078421"
       id="path229" />
    <path
       style="fill:none;stroke:#000000;stroke-width:0.264583px;stroke-linecap:butt;stroke-linejoin:miter;stroke-opacity:1"
       d="m 27.749828,12.951299 c -0.548204,-0.05151 -1.849043,0.78805 -1.413537,1.397758 0.13026,0.182364 0.120546,0.207945 0.414843,0.218358 0.319839,0.01132 0.834512,-0.0471 1.053952,-0.335754 0.09925,-0.130552 0.166748,-0.827431 0.106886,-0.9976 -0.03606,-0.102494 -0.119673,-0.182756 -0.162144,-0.282762 -0.104524,-0.246129 -0.03467,-0.209234 -0.198255,-0.372819"
       id="path231" />
    <path
       style="fill:none;stroke:#000000;stroke-width:0.264583px;stroke-linecap:butt;stroke-linejoin:miter;stroke-opacity:1"
       d="m 26.826337,13.979804 c 0.02442,-0.05832 1.405138,0.258466 1.405138,0.01774"
       id="path233" />
    <path
       style="fill:none;stroke:#000000;stroke-width:0.264583px;stroke-linecap:butt;stroke-linejoin:miter;stroke-opacity:1"
       d="m 34.668997,6.0162468 c 0.136927,0.3564456 0.155061,0.5615655 0.155061,0.9338046"
       id="path235" />
    <path
       style="fill:none;stroke:#000000;stroke-width:0.264583px;stroke-linecap:butt;stroke-linejoin:miter;stroke-opacity:1"
       d="m 33.740412,5.8569521 c 0.256003,0.3307998 0.283933,0.4753154 0.283933,0.8524443"
       id="path237" />
    <path
       style="fill:none;stroke:#000000;stroke-width:0.264583px;stroke-linecap:butt;stroke-linejoin:miter;stroke-opacity:1"
       d="m 35.384639,6.0466824 c 0,0.2750555 0,0.5501108 0,0.8251661"
       id="path239" />
    <path
       style="fill:none;stroke:#000000;stroke-width:0.264583px;stroke-linecap:butt;stroke-linejoin:miter;stroke-opacity:1"
       d="m 35.971906,6.1069526 c 0.0734,0.1613281 -0.02336,0.6662767 0.08866,0.7602609"
       id="path241" />
    <path
       style="fill:none;stroke:#000000;stroke-width:0.264583px;stroke-linecap:butt;stroke-linejoin:miter;stroke-opacity:1"
       d="m 36.066997,6.4066496 c 0.0411,-0.024662 0.08219,-0.049324 0.123296,-0.073987 0.0054,0 0.01304,0.00441 0.01611,0 0.02341,-0.033596 0.05127,-0.1033237 0.08354,-0.1329695 0.0061,-0.00561 0.01905,0.0059 0.02487,0 0.02196,-0.022233 0.02908,-0.079426 0.04482,-0.09664 0.0037,-0.00407 0.127495,-0.1201618 0.12917,-0.1234943 0.0386,-0.076723 0.0786,-0.1213064 0.119965,-0.1598355 0.0055,-0.00511 0.05692,-0.012298 0.06249,-0.019873 0.05546,-0.075513 0.198355,-0.1493486 0.246332,-0.2453018 0.0038,-0.00751 -0.0059,-0.019217 0,-0.025194 0.0058,-0.0059 0.02119,0.00743 0.02487,0 0.0074,-0.014946 -0.0075,-0.03516 0,-0.050069 0.0038,-0.0075 0.01926,0.00594 0.02519,0 0.0011,-0.00108 -0.0011,-0.046686 0,-0.048759 0.03409,-0.06911 0.07122,-0.1730994 0.111612,-0.2045436 0.09973,-0.077645 0.266179,-0.056539 0.379227,-0.1699572 0.0092,-0.0092 0.03185,0.010866 0.03895,0 0.09974,-0.1525955 0.09315,-0.3559725 0.188378,-0.4524094 0.04952,-0.050151 0.152191,-0.06349 0.233884,-0.1043364 0.02003,-0.010014 0.03004,-0.040058 0.05007,-0.050073 0.122052,-0.061025 0.275479,-0.1715122 0.344114,-0.2461519 0.02257,-0.024532 0.100764,-0.2731826 0.137126,-0.3421346 0.006,-0.011324 -0.009,-0.054336 0,-0.062928 0.0059,-0.00561 0.01873,0.00584 0.02437,0 0.02074,-0.021429 -0.0013,-0.090001 0.01484,-0.1150739 0.01101,-0.017029 0.760373,-0.136117 0.875567,-0.1525733 0.01995,-0.00285 0.107479,0.015251 0.120616,0 0.0584,-0.067797 0.156662,-0.132252 0.225787,-0.2249799 0.07216,-0.096801 0.148249,-0.3323429 0.248812,-0.3997963 0.131765,-0.088381 0.209605,-0.1551408 0.344376,-0.2449872 0.05886,-0.039239 0.103511,-0.1140568 0.16681,-0.1457054 0.04617,-0.023084 0.142263,-0.043316 0.181083,-0.082135 0.0059,-0.00594 -0.0059,-0.019255 0,-0.025193 0.01074,-0.010753 0.03566,0.01149 0.04562,0 0.02207,-0.02544 0.05292,-0.078221 0.07091,-0.095077 0.01164,-0.010918 0.03662,0.011292 0.04791,0 0.03822,-0.038219 0.03352,-0.1126557 0.100774,-0.1489981 0.015,-0.00811 0.043,0.00779 0.05817,0 0.09319,-0.047851 0.158364,-0.1519051 0.250989,-0.1993393 0.02651,-0.013576 0.07317,0.012498 0.100251,0 0.04804,-0.022174 0.06623,-0.042744 0.118517,-0.068887 0.0386,-0.019303 0.125092,-0.1373484 0.142597,-0.1461016 0.0919,-0.045948 0.21794,-0.2038798 0.290666,-0.2841434 0.01672,-0.018459 0.09517,0.012478 0.117901,0 0.05125,-0.028133 0.04825,-0.047971 0.10046,-0.074077 0.0108,-0.0054 0.06003,0.00911 0.0676,0 0.0053,-0.00638 -0.0057,-0.018861 0,-0.024867 0.03216,-0.033811 0.173649,0.020376 0.217389,0 0.100309,-0.046729 0.246232,-0.1043803 0.309761,-0.1603269 0.0114,-0.010046 0.05223,0.00547 0.06729,0 0.07511,-0.02728 0.149965,-0.049884 0.226107,-0.075265 0.157618,-0.052539 0.317008,-0.1097033 0.478671,-0.15115929 0.193612,-0.0496482 0.545886,0.0313913 0.765625,0 0.221117,-0.0315881 0.410601,-0.0946476 0.62983,-0.12596612 0.07614,-0.0108765 0.209293,-0.0164692 0.277127,-0.0503864 0.0075,-0.003756 -0.0059,-0.0192551 0,-0.0251931 0.01767,-0.0176675 0.05046,0.004923 0.07496,0 0.06994,-0.0140573 0.07708,-0.023509 0.125335,-0.050072 0.0656,-0.0361076 0.239932,0 0.317656,0 0.110393,0 0.0045,0.0118761 0.07558,-0.0251934 0.08191,-0.0427045 0.606433,0.0197747 0.743244,0 0.130067,-0.0188 0.262197,-0.0343577 0.390427,-0.0503864 0.0561,-0.007013 0.117158,0.021077 0.169622,0 0.172098,-0.069137 0.61259,-0.0627855 0.825913,-0.0627855 0.129841,0 0.725241,0.0352252 0.831802,0 0.20814,-0.0688038 0.406363,-0.0364444 0.625763,-0.0364444"
       id="path243" />
    <path
       style="fill:none;stroke:#000000;stroke-width:0.264583px;stroke-linecap:butt;stroke-linejoin:miter;stroke-opacity:1"
       d="m 118.21532,5.7649931 c -0.76896,-0.030782 -1.46912,0.3184167 -2.13911,0.6556258 -0.64463,0.3244464 -0.93703,0.4949156 -1.47902,0.9570749 -0.54975,0.468779 -1.29402,1.0419874 -1.58247,1.7661535 -0.1168,0.2932348 -0.1287,0.6190508 -0.16246,0.9328807 -0.0519,0.482147 -0.11168,0.967133 -0.094,1.45174 0.026,0.713473 0.28645,1.716171 0.71696,2.293504 0.43237,0.579825 1.10907,1.121221 1.8347,1.300088 0.23792,0.05865 0.4892,0.02978 0.734,0.04082 1.56067,0.07035 1.2711,0.07371 3.28359,-0.157483 2.0003,-0.229798 2.61948,-0.231005 4.36436,-0.904641 0.44914,-0.173395 0.91428,-0.340986 1.30037,-0.628607 0.75062,-0.559184 0.76458,-1.183775 0.74591,-2.063729 -0.0134,-0.633355 -0.3281,-1.5321469 -0.65552,-2.0364221 -0.38602,-0.5945284 -0.81513,-1.1692412 -1.3178,-1.6690333 -0.2956,-0.2939079 -1.29586,-0.7734083 -1.72948,-0.939887 -0.381,-0.1462765 -2.22282,-0.7255743 -2.4659,-0.784951 -0.17542,-0.042851 -0.36005,-0.028392 -0.54004,-0.042923 -0.34774,-0.028073 -0.67749,-0.040563 -1.02417,-0.087299"
       id="path245" />
    <path
       style="fill:none;stroke:#000000;stroke-width:0.264583px;stroke-linecap:butt;stroke-linejoin:miter;stroke-opacity:1"
       d="m 45.85572,0.22723876 c 0.0094,0.007595 0.0172,0.77298284 0.02567,0.78117294 0.03359,0.032492 0.02519,-0.0408898 0.02519,0.025193"
       id="path247" />
    <path
       style="fill:none;stroke:#000000;stroke-width:0.264583px;stroke-linecap:butt;stroke-linejoin:miter;stroke-opacity:1"
       d="m 46.697497,0.37507211 c 0.07928,0.20374515 -0.105706,0.59515409 0.05914,0.76348279"
       id="path249" />
    <path
       style="fill:none;stroke:#000000;stroke-width:0.264583px;stroke-linecap:butt;stroke-linejoin:miter;stroke-opacity:1"
       d="m 47.665391,0.31806676 c 0.0097,0.18859875 2.09e-4,0.39454245 0.053,0.57929269 0.02895,0.10132081 0.02519,0.0121891 0.02519,0.0755797"
       id="path251" />
    <path
       style="fill:none;stroke:#000000;stroke-width:0.264583px;stroke-linecap:butt;stroke-linejoin:miter;stroke-opacity:1"
       d="m 49.440671,0.46325763 c 0.0418,-0.0674167 0.123997,-0.047927 0.179848,-0.0851601 0.01561,-0.0104161 0.0084,-0.0419887 0.02519,-0.0503865 0.01503,-0.007511 0.03445,0.005311 0.05039,0 0.04422,-0.0147423 0.224184,-0.17213924 0.250304,-0.19318777 0.01418,-0.0114374 0.08266,-0.0144412 0.09184,-0.0242345 0.0057,-0.006051 -0.0055,-0.01870686 0,-0.02487647 0.025,-0.0278395 0.120497,-0.0225783 0.145815,-0.04789388 0.0059,-0.0059381 -0.0055,-0.01883036 0,-0.02519322 0.0159,-0.01846018 0.04682,-0.01429739 0.06861,-0.02519323 0.01191,-0.0059569 0.0613,0.00992734 0.06948,0 0.005,-0.0060657 -0.0057,-0.01820003 0,-0.02356636 0.01101,-0.01029332 0.05951,0.01146793 0.06895,0 0.09848,-0.11971988 0.337894,-0.12849558 0.4763,-0.23619877 0.0043,-0.003351 0.1968,-0.027724 0.212059,-0.0440097 0.0057,-0.006052 -0.0059,-0.0190521 0,-0.0248796 0.01169,-0.0115602 0.03772,0.0116335 0.04935,0 0.02492,-0.0249158 0.02926,-0.0387084 0.07613,-0.0602821 0.04476,-0.0206055 0.125545,0.0242813 0.16809,0 0.108619,-0.061992 0.763466,-0.0240022 0.899861,-0.0240022 0.121351,0 0.397349,0.043281 0.480192,-0.0185735 0.03446,-0.0257318 0.1343,0.0140531 0.175742,0 0.05776,-0.019586 0.11629,-0.0382514 0.1754,-0.0500735 0.250132,-0.0500261 0.684535,0.0251931 0.938086,0.0251931 0.250076,-0.16387646 0.497797,-0.13876212 0.78632,-0.13876212"
       id="path255" />
    <path
       style="fill:none;stroke:#000000;stroke-width:0.264583px;stroke-linecap:butt;stroke-linejoin:miter;stroke-opacity:1"
       d="m 52.574084,-1.1299228 c 0.05484,0.31890973 0.0079,0.64560077 0.149518,0.92892914 0.02949,0.0589808 -0.02193,0.0836131 0.03446,0.14118137"
       id="path257" />
    <path
       style="fill:none;stroke:#000000;stroke-width:0.264583px;stroke-linecap:butt;stroke-linejoin:miter;stroke-opacity:1"
       d="m 53.41127,-0.90310583 c -0.04668,0.25796518 -0.07126,0.50363694 -0.07126,0.76393379"
       id="path259" />
    <path
       style="fill:none;stroke:#000000;stroke-width:0.264583px;stroke-linecap:butt;stroke-linejoin:miter;stroke-opacity:1"
       d="m 54.121015,-0.90460847 c 0.05245,0.21001651 -0.0066,0.44511274 0.03563,0.65639887 0.01384,0.0691756 0.05952,0.0918699 0.05952,0.13810323"
       id="path261" />
    <path
       style="fill:none;stroke:#000000;stroke-width:0.264583px;stroke-linecap:butt;stroke-linejoin:miter;stroke-opacity:1"
       d="m 139.44278,-2.9785434 c -1.14008,-0.127852 -0.71792,2.45778486 0.1675,2.16264536 0.10077,-0.033591 0.22329,-0.056076 0.28503,-0.1425144 0.20208,-0.28291066 0.15489,-1.19464576 -0.28503,-1.28262926 -0.13975,-0.027949 -0.28503,0 -0.42754,0 -0.11876,0 -0.25747,-0.065878 -0.35629,0 -0.0442,0.029461 -0.0394,0.1000247 -0.0713,0.1425144 -0.28226,0.3763507 -0.37179,1.14768966 0.14448,1.43356826 0.13324,0.07378 0.28776,0.1001915 0.43367,0.1438647 0.0938,0.028083 0.19307,0.1049332 0.28503,0.071257 0.60287,-0.2207689 0.57374,-0.4922663 0.57374,-1.00599906 0,-0.2850287 0.0783,-0.5810242 0,-0.8550862 -0.066,-0.2311453 -0.46565,-0.7330847 -0.74933,-0.667621 -0.72344,0.1669473 -1.00075,1.4030195 -0.67866,1.9259253 0.0906,0.14709586 0.52514,0.34217906 0.66777,0.36636326 0.16811,0.028505 0.36936,0.094135 0.51152,0 0.67013,-0.44371656 0.90666,-1.57700846 0.26373,-2.12809136 -0.0781,-0.066946 -0.65942,-0.2792031 -0.76436,-0.1641972 -0.46134,0.5055841 -1.06366,1.8998911 -0.19204,2.39796076 1.16591,0.6662333 2.11203,-1.54558866 1.17694,-2.24690666 -0.038,-0.028503 -0.095,0 -0.14251,0 -0.11876,0 -0.2504,-0.053788 -0.35629,0 -0.48566,0.2467152 -1.08487,1.2878003 -0.77394,1.83192836 0.0905,0.1583624 0.24964,0.2627913 0.42754,0.2850287 0.58811,0.073514 0.59574,-0.1656545 0.64132,-0.71257176 0.025,-0.2996034 -0.10133,-0.9469353 -0.57006,-0.7125722 -0.46983,0.2349135 0.10421,1.53198276 0.20886,0.5762901 0.0181,-0.1652789 0,-0.3325337 0,-0.4988005"
       id="path263" />
    <path
       style="fill:none;stroke:#000000;stroke-width:0.264583px;stroke-linecap:butt;stroke-linejoin:miter;stroke-opacity:1"
       d="m 104.71485,-19.457173 c 0.4256,-0.393396 0.8324,-0.808154 1.27679,-1.180188 0.0943,-0.07896 0.2294,-0.09436 0.33007,-0.165035 0.52174,-0.366242 0.9418,-0.89797 1.43854,-1.295368 0.50151,-0.401208 0.99065,-0.852728 1.44739,-1.309471 0.13813,-0.138132 0.81806,-0.711293 0.83858,-0.701265 0.5007,0.24469 1.68504,2.024022 2.04099,2.615763 0.20127,0.334603 0.51025,0.748693 0.63953,1.136542 0.0426,0.127676 0.13748,0.222434 0.20228,0.34011 0.0174,0.03162 0.0207,0.121757 0.0473,0.0974 0.37576,-0.343555 0.71233,-1.034183 1.0572,-1.375875 0.60908,-0.603479 1.38556,-1.100532 1.9952,-1.710172 0.0606,-0.06056 0.082,-0.153215 0.14251,-0.213772 0.084,-0.08398 0.1949,-0.136441 0.28503,-0.213772 0.77958,-0.668823 1.41766,-1.488919 2.14047,-2.211731 0.14252,-0.142514 0.25985,-0.315746 0.42755,-0.427543 0.0625,-0.04167 0.15127,-0.02959 0.21377,-0.07126 0.25208,-0.168051 0.43541,-0.435406 0.64131,-0.641314 0.24929,-0.249289 0.6305,-0.444081 0.92635,-0.641315 0.42027,-0.280183 -0.16366,0.09819 0.0713,-0.142514 0.0115,-0.01182 0.15092,-0.03126 0.1663,-0.05086 0.0744,-0.09484 0.23998,-0.261919 0.3411,-0.363037 2.6e-4,-2.91e-4 -2.7e-4,-0.135691 0,-0.136254 0.0752,-0.153178 0.19933,-0.327959 0.27011,-0.474651 0.048,-0.09937 0.13289,-0.07967 0.13289,-0.204146 0,-0.02049 -0.007,0.04239 0,0.06149 0.081,0.207786 0.19886,0.40149 0.26353,0.614907 0.0905,0.298622 0.1141,0.614494 0.19989,0.914497 0.15105,0.528201 0.58305,1.401129 0.86985,1.892789 0.28364,0.486232 0.4848,1.017954 0.78383,1.496402 0.13862,0.22179 0.36557,0.408166 0.4988,0.641315 0.0373,0.06522 0.0296,0.151275 0.0713,0.213771 0.18147,0.272205 0.45523,0.504695 0.64132,0.78383 0.22294,0.334421 0.43057,0.717215 0.7176,1.004679 0.0605,0.0606 0.15322,0.08196 0.21377,0.142514 0.12112,0.121114 0.17538,0.295961 0.28503,0.427543 0.4111,0.49332 0.81964,0.980379 1.24708,1.46164 0.78352,1.062361 -0.13173,-0.0867 0.35628,0.361105 0.0159,0.01462 -0.0432,0 -0.0649,0"
       id="path267" />
    <path
       style="fill:none;stroke:#000000;stroke-width:0.264583px;stroke-linecap:butt;stroke-linejoin:miter;stroke-opacity:1"
       d="m 118.47573,-25.85396 c -0.41481,0.239811 -1.11788,0.249774 -1.41441,0.66502 -0.002,0.0025 0.11158,0.108392 0.2732,0.267286 0.0958,0.0942 0.16028,0.235128 0.28503,0.285029 0.24126,0.0965 0.51502,-0.08144 0.7634,-0.157771 0.56751,-0.174396 1.09128,-0.555659 0.9976,-1.211373 -0.0924,-0.647033 -1.02528,-0.837853 -1.44224,-0.426098 -0.0678,0.06694 -0.0585,0.18248 -0.0704,0.277016 -0.16562,1.325063 1.55258,1.144148 1.65549,0.423758 0.1521,-1.064647 -1.36831,-1.156296 -1.7789,-0.34692 -0.0459,0.09054 0.34668,0.421532 0.35337,0.421714 0.14209,0.0039 0.25189,-0.131774 0.37783,-0.197661 z"
       id="path269" />
    <path
       style="fill:none;stroke:#000000;stroke-width:0.264583px;stroke-linecap:butt;stroke-linejoin:miter;stroke-opacity:1"
       d="m 109.46934,-23.591688 c 0.5227,-0.250736 1.09545,-0.233252 1.64185,-0.325039 0.29892,-0.05021 0.12201,-0.06442 0.35629,-0.142514 0.0225,-0.0075 0.095,0 0.0713,0 -0.32046,0 -0.62977,0.150244 -0.93145,0.210579 -0.0699,0.01398 -0.14464,-0.01728 -0.21377,0 -0.35221,0.08805 0.14912,0.07126 -0.14251,0.07126"
       id="path271" />
    <path
       style="fill:none;stroke:#000000;stroke-width:0.264583px;stroke-linecap:butt;stroke-linejoin:miter;stroke-opacity:1"
       d="m 109.78531,-25.133618 c 0.0389,0.128739 0.0723,0.259246 0.11665,0.386217 0.11302,0.323793 0.28841,0.658225 0.35629,0.997601 0.0535,0.267515 0.063,0.668573 0.19108,0.854187"
       id="path273" />
    <path
       style="fill:none;stroke:#000000;stroke-width:0.264583px;stroke-linecap:butt;stroke-linejoin:miter;stroke-opacity:1"
       d="m 111.08437,-24.816277 c -0.48686,0.489465 -1.12102,0.912288 -1.48091,1.512105 -0.27751,0.46251 0.14733,-0.0048 -0.21377,0.356286"
       id="path275" />
    <path
       style="fill:none;stroke:#000000;stroke-width:0.264583px;stroke-linecap:butt;stroke-linejoin:miter;stroke-opacity:1"
       d="m 111.91127,-22.808649 c -0.0322,0.487915 0.0713,0.907251 0.0713,1.386221"
       id="path277" />
    <path
       style="fill:none;stroke:#000000;stroke-width:0.264583px;stroke-linecap:butt;stroke-linejoin:miter;stroke-opacity:1"
       d="m 108.51539,-22.841005 c 0,0.403791 0,0.807582 0,1.211373"
       id="path279" />
    <path
       style="fill:none;stroke:#000000;stroke-width:0.264583px;stroke-linecap:butt;stroke-linejoin:miter;stroke-opacity:1"
       d="m 107.19276,-21.666863 c 0.47409,0.08955 0.31636,1.192801 0.54071,1.41715"
       id="path281" />
    <path
       style="fill:none;stroke:#000000;stroke-width:0.264583px;stroke-linecap:butt;stroke-linejoin:miter;stroke-opacity:1"
       d="m 112.68889,-21.523034 c -0.14582,0.591401 -0.275,1.350601 -0.55211,1.904828"
       id="path283" />
    <path
       style="fill:none;stroke:#000000;stroke-width:0.264583px;stroke-linecap:butt;stroke-linejoin:miter;stroke-opacity:1"
       d="m 54.913453,-0.64138436 c 0,-1.47322714 0,-2.94645424 0,-4.41968144 0,-0.2232668 0,-0.4465333 0,-0.6697999 0,-0.070956 0.04596,-0.1588045 0,-0.212867 -0.01961,-0.023064 -0.08615,-0.05343 -0.0598,-0.068345 0.07171,-0.040601 0.169344,0.026966 0.247211,0 0.100377,-0.03476 0.184255,-0.1089234 0.28503,-0.1425143 0.43766,-0.145887 1.004959,-0.071257 1.471634,-0.071257"
       id="path293" />
    <path
       style="fill:none;stroke:#000000;stroke-width:0.264583px;stroke-linecap:butt;stroke-linejoin:miter;stroke-opacity:1"
       d="m 129.18763,-24.9978 c 0.30322,1.339319 0.2976,2.754665 0.36665,4.124843 0.0252,0.499894 -0.0692,0.25796 0.0713,0.538911"
       id="path295" />
    <path
       style="fill:none;stroke:#000000;stroke-width:0.264583px;stroke-linecap:butt;stroke-linejoin:miter;stroke-opacity:1"
       d="m 117.2822,-26.398451 c -0.0679,1.122505 0.15662,2.235642 0.15662,3.352754"
       id="path301" />
    <path
       style="fill:none;stroke:#000000;stroke-width:0.264583px;stroke-linecap:butt;stroke-linejoin:miter;stroke-opacity:1"
       d="m 119.42079,-27.890387 c 0.31468,1.052507 0.45257,2.177862 0.58669,3.269194 0.0551,0.448337 -0.0733,0.138448 0.0713,0.427543"
       id="path303" />
    <path
       style="fill:none;stroke:#000000;stroke-width:0.264583px;stroke-linecap:butt;stroke-linejoin:miter;stroke-opacity:1"
       d="m 118.2915,-26.988079 c 0.57396,0.955092 0.44588,2.073789 0.72217,3.095311 0.15904,0.588007 0.14849,0.13126 0.14849,0.370899"
       id="path305" />
    <path
       style="fill:none;stroke:#000000;stroke-width:0.264583px;stroke-linecap:butt;stroke-linejoin:miter;stroke-opacity:1"
       d="m 114.56897,-22.623275 c -0.0602,0.583506 0.11621,1.215223 -0.0713,1.777607"
       id="path307" />
    <path
       style="fill:none;stroke:#000000;stroke-width:0.264583px;stroke-linecap:butt;stroke-linejoin:miter;stroke-opacity:1"
       d="m 115.01497,-22.31356 c 0,0.381687 0,0.763375 0,1.145062"
       id="path309" />
    <path
       style="fill:none;stroke:#000000;stroke-width:0.264583px;stroke-linecap:butt;stroke-linejoin:miter;stroke-opacity:1"
       d="m 116.35738,-23.8895 c 0.22698,0.23717 0.11829,0.603936 0.2059,0.869048 0.0871,0.263683 0.0703,-0.08926 0.0703,0.141605"
       id="path311" />
    <path
       style="fill:none;stroke:#000000;stroke-width:0.264583px;stroke-linecap:butt;stroke-linejoin:miter;stroke-opacity:1"
       d="m 117.43702,-24.978881 c 0.0963,0.213705 0.22365,0.415974 0.28885,0.641116 0.033,0.114075 -0.0147,0.238441 0,0.356287 0.0384,0.307467 0.28503,0.543366 0.28503,0.845652"
       id="path313" />
    <path
       style="fill:none;stroke:#ff0000;stroke-width:0.264583px;stroke-linecap:butt;stroke-linejoin:miter;stroke-opacity:1"
       d="m 118.11268,-25.490908 c 0.0886,0.341735 0.23783,0.656111 0.23783,1.003261"
       id="path315" />
    <path
       style="fill:none;stroke:#ff0000;stroke-width:0.264583px;stroke-linecap:butt;stroke-linejoin:miter;stroke-opacity:1"
       d="m 119.05208,-26.232596 c 0.0409,0.08187 0.01,0.177224 0.0308,0.260371 0.01,0.03822 0.0205,0.04576 0.0252,0.08818 0.004,0.03292 -0.0111,0.09253 0,0.125966 0.01,0.0286 0.0252,0.09471 0.0252,0.125966"
       id="path350" />
    <path
       style="fill:none;stroke:#000000;stroke-width:0.264583px;stroke-linecap:butt;stroke-linejoin:miter;stroke-opacity:1"
       d="m 119.30722,-26.773858 c 0.0102,0.04896 0.0254,0.09714 0.0306,0.146883 0.0451,0.43698 -0.053,-0.150366 0.0158,0.30713 0.021,0.139676 0.0452,0.274898 0.0452,0.416133"
       id="path385" />
    <path
       style="fill:none;stroke:#000000;stroke-width:0.264583px;stroke-linecap:butt;stroke-linejoin:miter;stroke-opacity:1"
       d="m 118.55137,-26.053527 c -0.0522,0.262105 -0.0568,0.52498 -0.0568,0.790548"
       id="path387" />
    <path
       style="fill:none;stroke:#000000;stroke-width:0.264583px;stroke-linecap:butt;stroke-linejoin:miter;stroke-opacity:1"
       d="m 120.05737,-27.177581 c 0.0263,0.05779 0.0555,0.114377 0.079,0.173368 0.0215,0.05402 0.04,0.109334 0.056,0.165236 0.0326,0.113634 0.0361,0.331946 0.12327,0.419097"
       id="path389" />
    <path
       style="fill:none;stroke:#000000;stroke-width:0.264583px;stroke-linecap:butt;stroke-linejoin:miter;stroke-opacity:1"
       d="m 120.94517,-27.996038 c 0.1179,0.09191 0.12458,0.235635 0.18189,0.365759 0.0358,0.08124 0.088,0.160786 0.12816,0.240872 0.0103,0.02047 0.0249,0.08947 0.0634,0.08947"
       id="path391" />
    <path
       style="fill:none;stroke:#000000;stroke-width:0.264583px;stroke-linecap:butt;stroke-linejoin:miter;stroke-opacity:1"
       d="m 56.845083,-6.1754244 c 0.07399,-0.1268256 0.09279,-0.2304878 0.167161,-0.3048595 7.94e-4,-8.467e-4 0.04542,8.202e-4 0.04694,0 0.03462,-0.018613 0.0707,-0.073707 0.09312,-0.1090626 0.0097,-0.015227 0.06249,-0.00175 0.07518,-0.014425 0.02352,-0.023527 0.07724,-0.074629 0.125365,-0.098847 0.0374,-0.01882 0.122436,-0.047173 0.150526,-0.075263 0.04579,-0.04579 0.0917,-0.1103768 0.150916,-0.1505988 0.04186,-0.028437 0.185481,-0.1246952 0.198226,-0.1498155 0.0433,-0.085352 0.124632,-0.1689735 0.163526,-0.2539503 0.05316,-0.116129 0.09363,-0.2395085 0.181811,-0.3271337 0.02384,-0.023683 0.09114,-0.014163 0.123259,-0.025194 0.0016,-5.821e-4 0.09887,-0.050069 0.100454,-0.050387 0.04941,-0.00988 0.101751,0.00988 0.151159,0 0.03511,-0.00702 0.389541,-0.1810348 0.417224,-0.2133168 0.105982,-0.1235827 0.161216,-0.3265472 0.251301,-0.476693 0.05832,-0.097201 0.184452,-0.2429343 0.22674,-0.3275118 0.0075,-0.015023 -0.0093,-0.036412 0,-0.050386 0.024,-0.035982 0.05159,-0.014407 0.07558,-0.050387 0.0429,-0.064352 0.08754,-0.1371923 0.125966,-0.1974294 0.02228,-0.03493 0.08728,-0.00193 0.121779,-0.024892 0.03955,-0.026316 0.06428,-0.070361 0.100772,-0.1007729 0.07346,-0.061216 0.169821,-0.1194319 0.22674,-0.1763525 0.0319,-0.031899 0.1387,-0.2288871 0.15021,-0.2752288 0.04176,-0.1681187 -0.09016,0.137238 0.02519,-0.1511591 0.01905,-0.047652 0.06719,-0.091575 0.09155,-0.1403088 0.01111,-0.022206 0.03262,-0.082835 0.04873,-0.09865 0.08685,-0.08525 0.125117,0.074729 0.17798,0.048292 0.04282,-0.021413 -0.0043,-0.010115 0.01678,-0.041509 0.05797,-0.08642 0.112681,-0.167037 0.176353,-0.251933 0.07305,-0.09741 0.08804,-0.264391 0.176352,-0.352705 0.01328,-0.01328 0.03711,-0.01191 0.05039,-0.02519 0.02207,-0.02206 0.06062,-0.09712 0.07473,-0.125331 0.03227,-0.06453 0.128262,-0.103067 0.168521,-0.143327 0.0059,-0.0059 -0.0059,-0.01924 0,-0.02519 0.0263,-0.02647 0.0703,-0.02768 0.100156,-0.05008 0.06478,-0.04859 0.155871,-0.133035 0.201546,-0.201546 0.237805,-0.356709 0.469209,-0.712894 0.805863,-0.982217 0.183594,-0.146876 0.514281,-0.331285 0.729667,-0.40278 0.06442,-0.02138 0.109329,-0.07822 0.176041,-0.10046 0.08814,-0.02938 0.169749,-0.07328 0.251328,-0.10047 0.03244,-0.01081 0.06833,-0.06477 0.100771,-0.07558 0.02199,-0.0073 0.05475,0.01786 0.06952,0 0.01551,-0.01875 0.01421,-0.02978 0.04978,-0.04802 0.01797,-0.0092 0.05016,0.0093 0.06809,0 0.243234,-0.125593 0.546658,-0.113051 0.802843,-0.200919 0.107297,-0.0368 0.257871,0.02202 0.367946,0 0.115371,-0.02307 0.30245,0.0074 0.399764,-0.02519 0.145095,-0.04857 0.290595,-0.04468 0.445087,-0.07558 0.06104,-0.01221 0.288978,-0.02876 0.340427,0 0.03665,0.02049 0.03312,0.02919 0.05007,0.04888 0.0099,0.01149 0.116978,0 0.132641,0 0.08183,0 0.170471,0.01338 0.250745,0 0.113073,-0.01884 0.242097,-0.02289 0.352082,-0.05039 0.01151,-0.0029 0.01368,-0.02231 0.02519,-0.02519 0.06053,-0.01513 0.141486,0.01981 0.200927,0 0.03518,-0.01173 0.03726,-0.02519 0.07923,-0.02519"
       id="path393" />
    <path
       style="fill:none;stroke:#000000;stroke-width:0.264583px;stroke-linecap:butt;stroke-linejoin:miter;stroke-opacity:1"
       d="m 65.526184,-13.821343 c -0.06331,0.319131 0.07667,0.625043 0.07667,0.905733 0,0.03207 -0.01947,0.145134 0.02365,0.145134"
       id="path395" />
    <path
       style="fill:none;stroke:#000000;stroke-width:0.264583px;stroke-linecap:butt;stroke-linejoin:miter;stroke-opacity:1"
       d="m 66.073202,-13.713049 c -0.03016,0.269002 0.05038,0.517474 0.05038,0.783355"
       id="path397" />
    <path
       style="fill:none;stroke:#000000;stroke-width:0.264583px;stroke-linecap:butt;stroke-linejoin:miter;stroke-opacity:1"
       d="m 66.745074,-13.748223 c 0,0.311797 0,0.623594 0,0.935391"
       id="path399" />
    <path
       style="fill:none;stroke:#000000;stroke-width:0.264583px;stroke-linecap:butt;stroke-linejoin:miter;stroke-opacity:1"
       d="m 67.174196,-13.08183 c 0.105215,0.003 0.190691,0.01046 0.259538,-0.0609 0.01077,-0.01116 0.02869,-0.05345 0.04318,-0.06715 0.03437,-0.03251 0.08813,-0.03905 0.113662,-0.06297 0.02965,-0.02777 0.06797,-0.119171 0.09642,-0.147616 0.05182,-0.05182 -0.0026,0.08008 0.05007,-0.02519 0.06868,-0.137358 0.221922,-0.371302 0.372028,-0.45583 0.03129,-0.01762 0.295061,-0.129937 0.30303,-0.137907 0.0059,-0.0059 -0.0059,-0.01901 0,-0.02487 0.0104,-0.01039 0.05085,0.0074 0.06414,0 0.05442,-0.03042 0.112054,-0.0446 0.168481,-0.06925 0.01924,-0.0084 0.07977,0.01431 0.09408,0 0.04754,-0.04755 0.166974,-0.04501 0.245293,-0.07123 0.06212,-0.02079 0.08577,-0.04308 0.145759,-0.07207 0.01902,-0.0092 0.08154,0.0146 0.09521,0 0.0057,-0.0061 -0.0059,-0.01905 0,-0.02488 0.01778,-0.01755 0.05073,0.0061 0.07496,0 0.09345,-0.02351 0.184597,-0.0447 0.276503,-0.07558 0.06808,-0.02288 0.158149,-0.0027 0.225523,-0.02519 0.05163,-0.01721 0.09866,-0.03722 0.151159,-0.05039 0.04141,-0.01038 0.110987,0.01881 0.148608,0 0.06069,-0.03034 -0.0053,-0.02519 0.04705,-0.02519"
       id="path401" />
    <path
       style="fill:none;stroke:#000000;stroke-width:0.264583px;stroke-linecap:butt;stroke-linejoin:miter;stroke-opacity:1"
       d="m 122.09084,-29.082929 c -0.36853,0 0.01,-0.02738 -0.22366,0.05039 -0.0239,0.008 -0.0504,0 -0.0756,0 -0.0252,0.0084 -0.0509,0.01533 -0.0756,0.02519 -0.0647,0.02586 -0.0983,0.05849 -0.15116,0.100773 -0.19585,0.156677 -0.34451,0.261906 -0.3779,0.529058 -0.005,0.04166 -0.0156,0.08698 0,0.125966 0.0328,0.08202 0.11677,0.141964 0.1773,0.202491 0.0463,0.04625 0.13129,0.162303 0.20154,0.176353 0.21113,0.04223 0.38424,-0.05734 0.52813,-0.201234 0.15739,-0.157391 0.51712,-0.584741 0.3527,-0.831377 -0.0512,-0.07674 -0.14134,-0.116148 -0.20155,-0.176352 -0.0214,-0.02141 -0.0271,-0.0562 -0.0504,-0.07558 -0.12015,-0.100128 -0.38309,-0.115369 -0.52905,-0.100773 -0.0519,0.0052 -0.27713,0.04301 -0.27713,0.100773"
       id="path403" />
    <path
       style="fill:none;stroke:#000000;stroke-width:0.264583px;stroke-linecap:butt;stroke-linejoin:miter;stroke-opacity:1"
       d="m 70.039703,-14.409055 c 0.02913,-0.05446 0.327101,-0.01762 0.389384,-0.04876 0.0084,-0.0042 0.02687,-0.04675 0.06863,-0.02519 0.05971,0.03082 -0.0075,0.02488 0.05008,0.02488 0.04277,0 0.130053,-0.01358 0.170455,0 0.05145,0.01729 0.0941,0.04732 0.142899,0.07229 0.06333,0.03241 0.228658,0 0.29437,0 0.05605,0 0.225237,-0.0139 0.225237,0.04242 0.11261,-0.117062 0.296977,-0.192512 0.367123,-0.292144 0.0059,-0.0083 0.0645,-0.02572 0.06999,-0.03212 0.01122,-0.01309 0.01017,-0.03556 0.0224,-0.04657 0.02395,-0.02157 0.07957,0.0055 0.109771,-0.01102 0.02896,-0.01581 0.153305,-0.04236 0.154,-0.04341 0.01514,-0.02281 0.0074,-0.02371 0.04068,-0.04033 0.04928,-0.02463 0.170148,0 0.226544,0 0.04896,0.0328 0.09603,0.06861 0.146883,0.09839 0.05647,0.03306 0.226904,0 0.285923,0 0.234929,0 0.469859,0 0.704789,0 0.342321,0 0.715236,0.108205 1.066017,0.04974 0.236553,-0.03942 0.47492,-0.07558 0.716975,-0.07558"
       id="path405" />
    <path
       style="fill:none;stroke:#000000;stroke-width:0.264583px;stroke-linecap:butt;stroke-linejoin:miter;stroke-opacity:1"
       d="m 127.92284,-18.676001 c 0.088,-0.09989 0.21801,-0.174761 0.26416,-0.299666 0.24761,-0.670141 0.3864,-1.375977 0.60613,-2.055766 0.61381,-1.898942 1.31649,-3.74132 2.08202,-5.58001 0.63392,-1.522572 1.24412,-2.752629 2.09362,-4.182924 0.95121,-1.601522 2.08426,-3.077418 3.10395,-4.631977 0.13542,-0.206456 0.27692,-0.8191 0.50667,-0.940565 0.10218,-0.05402 0.048,0.01105 0.0635,0.03789 0.17006,0.294098 0.38103,0.565648 0.52653,0.872646 0.06,0.126679 0.0322,0.281527 0.0825,0.412386 0.42791,1.113848 0.9704,2.436924 1.46585,3.545124 0.73669,1.647782 1.61542,3.317308 2.62996,4.810844 0.11411,0.16799 0.57931,0.696596 0.67385,0.821232 0.78428,1.033857 1.52161,2.12875 2.41516,3.062359 0.0327,0.03415 0.19544,0.02953 0.24211,0.05287 0.38088,0.190463 0.95134,1.771064 1.17886,1.771064"
       id="path407" />
    <path
       style="fill:none;stroke:#000000;stroke-width:0.264583px;stroke-linecap:butt;stroke-linejoin:miter;stroke-opacity:1"
       d="m 136.82697,-19.955127 c 0.64552,0.39494 0.94303,1.010704 1.39031,1.584124 0.27858,0.357143 0.62043,0.581924 0.71782,0.971454 0.0213,0.08505 0.24499,0.427543 0.0774,0.427543"
       id="path409" />
    <path
       style="fill:none;stroke:#000000;stroke-width:0.264583px;stroke-linecap:butt;stroke-linejoin:miter;stroke-opacity:1"
       d="m 138.76431,-19.752281 c -0.84421,0.443308 -1.65896,1.075941 -2.3412,1.757029 -0.0841,0.08391 -0.12979,0.201051 -0.21377,0.285029"
       id="path411" />
    <path
       style="fill:none;stroke:#000000;stroke-width:0.264583px;stroke-linecap:butt;stroke-linejoin:miter;stroke-opacity:1"
       d="m 136.66507,-37.659542 c 0,0.703217 0,1.406434 0,2.109651"
       id="path413" />
    <path
       style="fill:none;stroke:#000000;stroke-width:0.264583px;stroke-linecap:butt;stroke-linejoin:miter;stroke-opacity:1"
       d="m 140.47915,-34.351973 c 1.51424,0.426146 1.67889,-2.616734 0.63462,-2.972481 -0.27556,-0.09387 -0.36989,0.691656 -0.43292,1.216669 -0.0702,0.58492 -0.2017,1.166692 -0.2017,1.755812 0,0.99353 0.19935,2.032068 0.44137,2.99141 0.0414,0.164136 0.11129,0.895121 0.28502,1.068858 0.0215,0.02146 -0.0429,-0.04291 -0.0644,-0.06437"
       id="path415" />
    <path
       style="fill:none;stroke:#000000;stroke-width:0.264583px;stroke-linecap:butt;stroke-linejoin:miter;stroke-opacity:1"
       d="m 140.05191,-32.726375 c 0.61315,0 1.22631,0 1.83946,0"
       id="path417" />
    <path
       style="fill:none;stroke:#000000;stroke-width:0.264583px;stroke-linecap:butt;stroke-linejoin:miter;stroke-opacity:1"
       d="m 143.87934,-34.659268 c 0.15118,0.175898 0.33957,0.325685 0.45353,0.527693 0.16638,0.294927 0.22634,0.640002 0.37644,0.943539 0.42425,0.857946 0.85853,1.198683 1.49098,1.831127"
       id="path419" />
    <path
       style="fill:none;stroke:#000000;stroke-width:0.264583px;stroke-linecap:butt;stroke-linejoin:miter;stroke-opacity:1"
       d="m 146.15481,-34.647636 c -0.49292,0.711123 -1.02205,1.392726 -1.41263,2.16903 -0.0213,0.04244 0.015,0.09745 0,0.142515 -0.047,0.141 -0.17244,0.374551 -0.24403,0.51773 -0.1318,0.263587 -0.42754,0.62504 -0.42754,0.926343"
       id="path421" />
    <path
       style="fill:none;stroke:#000000;stroke-width:0.264583px;stroke-linecap:butt;stroke-linejoin:miter;stroke-opacity:1"
       d="m 143.36454,-35.935202 c -0.29419,1.305357 -0.70953,2.779702 -0.5154,4.138569 0.0412,0.288507 0.20644,0.508775 0.28503,0.783829 0.0595,0.208363 0.11416,0.533274 0.21377,0.712573 0.161,0.289796 0.54862,0.412175 0.76644,0.625962"
       id="path423" />
    <path
       style="fill:none;stroke:#000000;stroke-width:0.264583px;stroke-linecap:butt;stroke-linejoin:miter;stroke-opacity:1"
       d="m 147.25435,-35.755335 c 0.263,1.158727 0.65091,2.937346 0.47708,4.154131 -0.0654,0.457993 -0.29524,0.875512 -0.4988,1.28263"
       id="path425" />
    <path
       style="fill:none;stroke:#000000;stroke-width:0.264583px;stroke-linecap:butt;stroke-linejoin:miter;stroke-opacity:1"
       d="m 110.04515,-25.970098 c 1.34553,-0.176361 2.70108,0.01062 4.03641,0.01062 0.88844,0 1.79029,-0.05365 2.66464,0.07126 0.42638,0.06091 1.007,0.06969 1.42514,0 0.13376,-0.02229 0.15145,-0.07126 0.28332,-0.07126"
       id="path427" />
    <path
       style="fill:none;stroke:#000000;stroke-width:0.264583px;stroke-linecap:butt;stroke-linejoin:miter;stroke-opacity:1"
       d="m 17.887985,17.821561 c 0.09816,0.426879 0.06489,0.867275 0.06489,1.302409"
       id="path784" />
    <path
       style="fill:none;stroke:#000000;stroke-width:0.264583px;stroke-linecap:butt;stroke-linejoin:miter;stroke-opacity:1"
       d="m 16.573193,19.436691 c 0.147886,0.295427 0.1777,0.803559 0.362807,1.0456"
       id="path786" />
    <path
       style="fill:none;stroke:#000000;stroke-width:0.264583px;stroke-linecap:butt;stroke-linejoin:miter;stroke-opacity:1"
       d="m 18.939071,18.788758 c 0.06174,0.600426 0.03998,1.207731 0.03998,1.811746"
       id="path788" />
    <path
       style="fill:none;stroke:#000000;stroke-width:0.264583px;stroke-linecap:butt;stroke-linejoin:miter;stroke-opacity:1"
       d="m 19.555721,20.558358 c 0.03762,-0.06034 0.07525,-0.120675 0.112871,-0.181012 0,-0.01188 -0.0059,-0.02532 0,-0.03563 0.08047,-0.140648 0.19841,-0.272387 0.250965,-0.430052 0.05087,-0.152608 0.127846,-0.342317 0.205746,-0.481066 0.01229,-0.02188 0.218705,0.20981 0.232831,0.238063 0.0219,0.0438 0.01634,0.09751 0.03563,0.142514 0.0774,0.180612 0.221723,0.344512 0.285029,0.534429 0.0084,0.02519 0.05193,0.05029 0.03563,0.07126 -0.01295,0.01667 -0.04222,0 -0.06332,0 -0.05824,0 -0.06058,-0.0033 -0.138509,0.03563 -0.05625,0.02812 -0.406774,0.245938 -0.427543,0.249399 -0.09423,0.0157 -0.228946,-0.03057 -0.320657,0 -0.07058,0.02353 -0.112007,0.03563 -0.198233,0.03563"
       id="path792" />
    <path
       style="fill:none;stroke:#000000;stroke-width:0.264583px;stroke-linecap:butt;stroke-linejoin:miter;stroke-opacity:1"
       d="m 26.092412,19.786224 c -0.161682,0.08231 -0.263744,0.187554 -0.343204,0.346473 -0.07465,0.149294 -0.0037,0.189299 0.07081,0.319765 0.149726,0.2622 0.258266,0.244906 0.499476,0.07261 0.06834,-0.04881 0.106133,-0.134938 0.178143,-0.178144 0.0322,-0.01932 0.07684,-0.01309 0.106887,-0.03563 0.04249,-0.03187 0.0337,-0.104959 0.07126,-0.142514 0.0084,-0.0084 0.03026,0.01059 0.03563,0 0.08441,-0.166663 -0.132723,-0.529998 -0.285028,-0.56915 -0.05652,-0.01453 -0.168039,0.02517 -0.205012,0.03442"
       id="path794" />
    <path
       style="fill:none;stroke:#000000;stroke-width:0.264583px;stroke-linecap:butt;stroke-linejoin:miter;stroke-opacity:1"
       d="m 27.430031,20.216824 c 0.01363,0.22657 -0.03631,0.441734 -0.03631,0.667371"
       id="path796" />
    <path
       style="fill:none;stroke:#000000;stroke-width:0.264583px;stroke-linecap:butt;stroke-linejoin:miter;stroke-opacity:1"
       d="m 29.184224,19.863172 c -0.214101,0.09531 -0.112541,0.02839 -0.29663,0.212473 -0.03563,0.03563 -0.08435,0.06182 -0.106883,0.106886 -0.03784,0.07569 -0.0037,0.323175 0.03563,0.391915 0.05751,0.100639 0.305885,0.279795 0.42621,0.2494 0.06238,-0.01576 0.128698,-0.03195 0.179125,-0.07191 0.132138,-0.10471 0.51679,-0.936989 0.42423,-1.029549 -0.07251,-0.07251 -0.168298,-0.117282 -0.250359,-0.17878"
       id="path798" />
    <path
       style="fill:none;stroke:#000000;stroke-width:0.264583px;stroke-linecap:butt;stroke-linejoin:miter;stroke-opacity:1"
       d="m 30.829064,20.716345 -0.03563,0.121131"
       id="path800" />
    <path
       style="fill:none;stroke:#000000;stroke-width:0.264583px;stroke-linecap:butt;stroke-linejoin:miter;stroke-opacity:1"
       d="m 30.7614,19.702345 c 0,0.436203 0,0.872407 0,1.30861"
       id="path802" />
    <path
       style="fill:none;stroke:#000000;stroke-width:0.264583px;stroke-linecap:butt;stroke-linejoin:miter;stroke-opacity:1"
       d="m 49.250144,81.053505 c -0.08678,0.273262 -0.219564,0.53599 -0.260339,0.819788 -0.128609,0.895157 -0.138853,1.803881 -0.245629,2.701906 -0.13667,1.149461 -0.376975,2.286156 -0.484491,3.438708 -0.05433,0.582448 0.02808,1.170627 0,1.754931 -0.250201,5.20596 -0.21762,0.939688 -0.21762,4.022468 0,1.151504 -0.313619,2.666577 0.287851,3.677997 0.07238,0.121716 0.198998,0.230513 0.338052,0.257299 0.641861,0.123637 1.305134,0.08732 1.953721,0.1686 0.884311,0.110818 1.761561,0.272124 2.642465,0.407379 3.235605,0.496803 6.239028,0.78739 9.536819,0.662567 1.945566,-0.07364 3.436837,-0.55173 5.412422,-0.835004 0.294542,-0.04223 0.600284,0.05524 0.892665,0 1.651084,-0.311962 3.434556,-0.901464 4.748241,-1.952413 0.322908,-0.258326 0.470649,-0.184933 0.570058,-0.570058 0.490001,-1.898351 0.17312,-5.085905 -0.448159,-6.949741 -0.06194,-0.185817 -0.104103,-0.377995 -0.142515,-0.570058 -0.01347,-0.06729 0.04607,-0.32162 0,-0.372314 -0.210561,-0.231696 -0.714002,-0.693137 -1.028131,-0.794197 -4.038092,-1.299126 -8.420352,-2.432347 -12.536821,-3.370625 -3.797027,-0.865466 -7.648115,-1.082662 -11.502549,-1.368425 -0.810485,-0.06009 -1.635947,0.06631 -2.445895,0 -0.39387,-0.03225 -1.0369,-0.285031 -1.456455,-0.285031"
       id="path804" />
    <path
       style="fill:none;stroke:#000000;stroke-width:0.264583px;stroke-linecap:butt;stroke-linejoin:miter;stroke-opacity:1"
       d="m 100.22346,82.015533 c 0,0.215794 0.0266,0.433234 0,0.647377 -0.1096,0.881584 -0.271945,1.755809 -0.407914,2.633713 -0.06968,1.338228 -0.08893,2.680038 -0.209032,4.014687 -0.08851,0.983607 -0.306522,1.951894 -0.416192,2.933366 -0.0024,0.02058 -0.484198,5.636892 0.113898,5.973088 0.188634,0.106034 0.420587,-0.108196 0.635722,-0.131527 0.926468,-0.100476 1.863518,-0.09846 2.786408,-0.227709 5.80741,-0.813289 1.64365,-0.667096 7.84288,-1.166452 4.6407,-0.373814 9.33875,-0.274003 13.97059,-0.762135 2.0495,-0.21599 4.08757,-0.531723 6.12516,-0.840539 7.71744,-1.169654 1.82709,-0.523454 6.96946,-0.980591 0.73116,-0.065 1.45984,-0.159353 2.19222,-0.208743 0.36668,-0.02474 1.32038,0.01926 1.33072,0 0.25958,-0.483338 0,-1.097275 0,-1.645909 0,-0.93176 0,-1.863521 0,-2.795281 0,-0.185287 0.16626,-2.757725 0,-3.064954 -0.18006,-0.332706 -0.69121,-0.31578 -1.05618,-0.415319 -1.29751,-0.353867 -2.51886,-0.232611 -3.86012,-0.285028 -5.14469,-0.20106 -10.2392,-0.293042 -15.36945,-0.794853 -1.85254,-0.181205 -11.23914,-1.268953 -12.21041,-1.41967 -2.25795,-0.350374 -4.48013,-0.904446 -6.73149,-1.294942 -0.56312,-0.09767 -1.14705,-0.05063 -1.70627,-0.168579 -1.514264,-0.319379 -3.511673,-1.169186 -5.197333,-1.169186"
       id="path806" />
    <path
       style="fill:none;stroke:#000000;stroke-width:0.264583px;stroke-linecap:butt;stroke-linejoin:miter;stroke-opacity:1"
       d="m 119.88734,63.419928 c -0.12914,0.270256 -0.28009,0.531133 -0.38741,0.810771 -0.17525,0.456634 -0.2073,0.583009 0,0.997601 0.10622,0.21245 0.21613,0.461788 0.42754,0.570058 0.17376,0.08899 1.64899,-1.372143 1.38045,-1.683605 -0.29825,-0.345924 -1.61773,1.636144 -1.09412,0.588891"
       id="path808" />
    <path
       style="fill:none;stroke:#000000;stroke-width:0.264583px;stroke-linecap:butt;stroke-linejoin:miter;stroke-opacity:1"
       d="m 110.27776,135.17355 c 0.0219,0.23013 -0.196,2.15311 0.42754,2.15967 2.16548,0.0228 1.41667,-5.98754 -1.03915,-3.52643 -0.23344,0.23394 -0.42431,0.50682 -0.63303,0.76305 -0.27178,0.33366 -0.85055,0.81759 -0.58088,1.15296 0.70064,0.87135 2.56526,1.21742 2.56526,-0.26964"
       id="path810" />
    <path
       style="fill:none;stroke:#000000;stroke-width:0.264583px;stroke-linecap:butt;stroke-linejoin:miter;stroke-opacity:1"
       d="m 110.23641,133.45815 c -0.32651,-2.4969 -1.50696,-4.67483 -2.60535,-6.87162 -0.19653,-0.39306 -0.61943,-1.21378 -0.57006,-1.27116 1.46428,-1.70218 3.15445,-2.18957 5.31281,-3.50742 1.99854,-1.22027 3.96182,-2.49828 5.97302,-3.69758 1.42533,-0.84995 2.87699,-1.65559 4.33456,-2.44898 0.44395,-0.24165 1.02371,-0.25047 1.39577,-0.5926 0.30399,-0.27954 -0.31229,-0.78468 -0.59243,-1.08812 -0.94927,-1.02823 -1.97907,-1.97908 -2.96861,-2.96861 -3.14861,-3.14861 1.53982,1.60445 -5.17491,-5.9754 -0.66543,-0.75116 -1.41918,-1.41918 -2.12877,-2.12878 -0.30012,-0.30012 -0.60024,-0.60023 -0.90035,-0.90035 -0.0475,-0.0475 -0.16197,-0.0782 -0.14252,-0.14251 0.12491,-0.41308 1.37509,-1.32737 1.48346,-1.43577 0.23885,-0.23889 0.39395,-0.550681 0.62036,-0.801403 0.57645,-0.638346 1.5193,-1.267713 2.01046,-2.004456 0.23064,-0.345951 0.072,-0.852906 0.20987,-1.125742"
       id="path812" />
    <path
       style="fill:none;stroke:#000000;stroke-width:0.264583px;stroke-linecap:butt;stroke-linejoin:miter;stroke-opacity:1"
       d="m 110.67122,124.23838 c 0,-3.29359 0.003,-8.88052 -0.0689,-10.51467 -0.0443,-1.0135 -0.34204,-2.00037 -0.47605,-3.00596 -0.47799,-3.58668 -0.65888,-6.93712 -2.10805,-10.31851 -0.0529,-0.1235 -0.22463,-0.165 -0.28502,-0.28503 -0.5646,-1.122042 1.20883,-2.785306 1.20883,-3.350673"
       id="path814" />
    <path
       style="fill:none;stroke:#000000;stroke-width:0.264583px;stroke-linecap:butt;stroke-linejoin:miter;stroke-opacity:1"
       d="m 110.24477,133.63632 c -0.80569,-2.74934 -0.1334,-4.69863 1.55542,-7.02503 2.45981,-3.38845 3.18201,-4.04251 6.49113,-6.94436 1.2741,-1.11729 2.86437,-1.91955 3.90065,-3.26036 0.19472,-0.25193 0.10684,-3.94502 0.16284,-5.11715 0.1945,-4.07088 0.56136,-8.14526 0.93842,-12.202521 0.013,-0.139586 0.13054,-1.557298 0.3344,-1.968873 0.1909,-0.385405 1.0774,-0.829128 1.42302,-1.425924 0.40649,-0.701906 0.29792,-1.413227 0.29792,-2.17455"
       id="path816" />
    <path
       style="fill:none;stroke:#000000;stroke-width:0.264583px;stroke-linecap:butt;stroke-linejoin:miter;stroke-opacity:1"
       d="m 109.91616,133.10723 c -0.66568,1.66422 -0.26486,1.0516 -0.97264,-2.35671 -0.95046,-4.57694 -1.35559,-9.22553 -2.48426,-13.76832 -0.6741,-2.71316 -0.94855,-1.55005 -1.26669,-2.50447 -0.49736,-1.49206 -0.28361,-3.9455 -0.55855,-5.54563 -0.18087,-1.05263 -1.24353,-3.44012 -0.84758,-4.81854 0.36905,-1.28481 2.37819,-1.93968 2.93369,-3.04369 0.11989,-0.23827 0,-0.70596 0,-0.99222"
       id="path818" />
    <path
       style="fill:none;stroke:#000000;stroke-width:0.264583px;stroke-linecap:butt;stroke-linejoin:miter;stroke-opacity:1"
       d="m 110.94462,133.67694 c -1.05398,-3.55322 -3.26326,-6.59804 -4.86186,-9.90715 -1.95906,-4.05529 -3.51592,-8.36966 -4.9522,-12.63075 -0.76916,-2.28189 -1.150523,-4.67339 -1.912142,-6.96414 -0.424103,-1.27559 -1.286444,-2.29036 -2.018173,-3.18799 -0.504878,-0.61935 -1.27426,-1.051222 -1.673735,-1.852693 -1.014122,-2.034625 -1.250659,-4.395102 -1.004621,-6.643227 0.03502,-0.319955 0.142515,-0.516763 0.142515,-0.842862"
       id="path820" />
    <path
       style="fill:none;stroke:#000000;stroke-width:0.264583px;stroke-linecap:butt;stroke-linejoin:miter;stroke-opacity:1"
       d="m 94.304698,92.256376 c -0.829233,-0.332793 -5.838931,-0.226004 -6.206342,-0.927539 -0.172415,-0.329211 0.380601,-0.649147 0.648013,-0.907211 2.820675,-2.722092 3.290546,-2.895278 6.410129,-5.587537 1.518237,-1.310267 2.950368,-2.721563 4.512376,-3.979331 0.458156,-0.368914 1.026186,-0.575916 1.527296,-0.88396 0.0572,-0.03518 0.14115,-0.07534 0.14252,-0.142515 0.013,-0.638291 -0.47074,-1.193739 -0.80351,-1.73858 -0.666503,-1.09126 -1.3654,-2.16396 -2.106818,-3.205771 -0.710798,-0.99878 -1.850647,-1.860404 -1.189549,-3.277676 0.706867,-1.515399 2.101393,-3.007596 3.567977,-3.811633 0.48849,-0.267808 2.01267,-0.671978 2.33554,-0.887222 0.73901,-0.49267 -0.25551,0.148513 0.14251,-0.28503 0.17632,-0.192045 0.2643,0.394256 0.83174,0.558382 0.29077,0.0841 0.60539,0 0.90809,0 2.6016,0 5.41807,-0.08373 7.95339,-0.696913 0.47792,-0.115588 0.92789,-0.326599 1.39819,-0.470093 0.28498,-0.08695 0.64387,0.05977 0.93708,0 0.2722,-0.05549 0.59958,-0.200218 0.85509,-0.285027 0.62322,-0.206865 1.03653,-0.644369 1.56883,-0.998985 0.35511,-0.236575 0.78992,-0.335785 1.14495,-0.572476 0.39898,-0.265983 0.18139,-0.285028 0.56332,-0.285028"
       id="path822" />
    <path
       style="fill:none;stroke:#000000;stroke-width:0.264583px;stroke-linecap:butt;stroke-linejoin:miter;stroke-opacity:1"
       d="m 102.60761,78.685037 c -1.1974,0.41338 -2.690171,0.856573 -3.313021,1.929829 -0.04007,0.06906 -0.183026,0.02682 -0.218371,0.09841 -0.04206,0.08519 0.02304,0.192855 0,0.285028 -0.07364,0.294563 -0.288856,0.597408 -0.387522,0.891577 -0.06602,0.196831 -0.373542,1.025226 -0.280289,1.183912 0.245578,0.417896 0.805341,0.531757 1.128667,0.855086 0.03359,0.03359 -0.03359,0.108924 0,0.142515 0.08973,0.08972 0.486996,0.20919 0.554356,0.282448 0.0716,0.07788 0.0632,0.203441 0.13671,0.277432 0.13073,0.131635 0.3807,0.05909 0.55656,0 0.3449,-0.115883 0.62649,-0.47728 0.9976,-0.570058 0.32057,-0.08014 0.52563,-0.09677 0.85509,-0.285028 0.52408,-0.299474 1.31343,-0.887616 1.70843,-1.282631 0.13961,-0.13961 0.074,-0.656503 0.13669,-0.843847 0.35931,-1.0733 0.13016,-2.15007 -0.71257,-2.992802 -0.15713,-0.157131 -0.58441,-0.299376 -0.71257,-0.427543 -0.0751,-0.07511 -0.0541,-0.226108 -0.14252,-0.28503 -0.079,-0.0527 -0.20597,0.0527 -0.28503,0 -0.49128,-0.327517 0.11018,-0.285028 -0.28503,-0.285028"
       id="path824" />
    <path
       style="fill:none;stroke:#000000;stroke-width:0.264583px;stroke-linecap:butt;stroke-linejoin:miter;stroke-opacity:1"
       d="m 116.21222,64.825025 c -0.62715,-0.373293 -1.03311,-0.777539 -1.73063,-0.976831 -0.57188,-0.163394 -3.84724,-0.04449 -4.43785,0 -1.83577,0.138289 0.22771,0.115069 -1.30192,0.28503 -0.23607,0.02622 -0.47505,0 -0.71257,0 -0.40932,0.0475 -0.8194,0.08896 -1.22798,0.142515 -0.62157,0.08146 -1.22931,0.258953 -1.85318,0.320429 -1.14582,0.112911 -2.32457,0.05232 -3.47626,0.150392 -1.14236,0.09728 -2.817019,-0.622104 -3.833631,-0.283234 -0.687353,0.229116 -2.187863,3.165001 -2.485226,3.957965 -0.224506,0.598686 -0.299394,1.520519 -0.71257,1.995202 -0.19299,0.221718 -0.479187,-0.402669 -1.256901,-0.698767 -5.493027,-2.091359 -0.814334,-0.317876 -3.099077,-0.681207 -0.11057,-0.0176 -2.047201,-0.744339 -2.313398,-0.571624 -0.165439,0.107339 -0.264348,0.295148 -0.418341,0.418343 -0.181811,0.145449 -0.733649,0.33501 -0.855085,0.570058 -0.207333,0.401299 -0.148545,1.188617 -0.236398,1.627873 -0.325273,1.626364 -0.895273,3.27166 -1.510971,4.80768 -0.300943,0.750784 -0.594808,1.557359 -0.924021,2.298089 -0.282712,0.6361 -0.759669,1.215996 -0.712573,1.262152 0.26135,0.256133 0.682628,0.453594 0.966801,0.697172 0.542173,0.464722 1.358535,1.186394 1.680451,1.554493 0.215984,0.24697 -0.201523,1.050499 -0.269719,1.32329 -0.179901,0.719603 -0.366506,1.425281 -0.570058,2.137717 -0.05837,0.204274 -0.243364,0.361736 -0.285031,0.570058 -0.09659,0.482968 -0.368321,2.18018 -0.570055,2.551806 -0.695889,1.28194 1.837706,2.358921 2.268739,3.20344 0.196704,0.3854 -0.55543,1.090811 -0.704578,1.282559 -0.805735,1.035868 -2.287095,2.735501 -1.787657,4.23381 0.274981,0.824952 1.822635,1.927664 2.565257,2.422744 0.270219,0.180145 0.396094,0.50555 0.710782,0.712571 0.118361,0.0779 -0.353473,1.1959 -0.418706,1.34872 -0.310099,0.72643 -0.284094,1.298 -0.430554,2.03031 -0.04883,0.24413 -0.224356,0.0291 -0.142515,0.27465 0.118674,0.35601 0.407268,0.63391 0.559681,0.97684 0.07955,0.17899 0.06284,0.39113 0.142515,0.57006 0.330372,0.74189 0.393184,0.56489 0.71746,1.14859 0.554927,0.99887 0.884061,2.07247 1.282629,3.13532 0.196003,0.52267 0.633868,0.7927 0.853244,1.28078 0.151392,0.34752 0.302784,0.69503 0.454176,1.04254 0.09601,0.28902 0.169963,0.58633 0.288023,0.86706 0.348414,0.82851 0.644914,1.15276 1.078346,1.97084 0.505513,0.95413 0.928412,1.95118 1.448996,2.89718 0.31264,0.56812 0.808511,1.01498 1.140113,1.56765 0.650785,1.08464 1.155671,2.31928 1.999578,3.28374 0.544746,0.62257 1.533144,0.92133 2.137717,1.42514 0.13158,0.10966 0.156075,0.31482 0.285028,0.42755 0.901253,0.78788 2.303669,1.58926 3.142639,2.42824 0.45025,0.45024 0.8527,0.92485 1.42515,1.28263 0.57685,0.36053 1.27226,0.33789 1.85268,0.57006 0.15903,0.0636 0.27435,0.20843 0.42755,0.28503 1.32538,0.66269 2.98068,0.68896 4.37119,1.15246"
       id="path826" />
    <text
       xml:space="preserve"
       style="font-size:4.23333px;line-height:1.25;font-family:sans-serif;stroke-width:0.264583"
       x="25.19726"
       y="151.41451"
       id="text3580"><tspan
         sodipodi:role="line"
         id="tspan3578"
         style="stroke-width:0.264583"
         x="25.19726"
         y="151.41451">AG Multiobjetivo (objetivossao conflitantes) --&gt;  PARETO</tspan></text>
    <text
       xml:space="preserve"
       transform="scale(0.26458333)"
       id="text12646"
       style="font-size:16px;line-height:1.25;font-family:sans-serif;white-space:pre;shape-inside:url(#rect12648)" />
    <path
       style="fill:none;stroke:#000000;stroke-width:0.264583px;stroke-linecap:butt;stroke-linejoin:miter;stroke-opacity:1"
       d="m 32.772209,165.69928 c -0.257183,6.27113 -0.130942,12.57604 -0.130942,18.8586 0,2.1264 0.09875,4.33763 0,6.46887 -0.04,0.86322 -0.16251,1.72112 -0.208431,2.58404 -0.09931,1.86612 0.142359,3.76057 0,5.62372 -0.138506,1.81276 -0.292552,3.58923 -0.292552,5.41972"
       id="path14005" />
    <path
       style="fill:none;stroke:#000000;stroke-width:0.264583px;stroke-linecap:butt;stroke-linejoin:miter;stroke-opacity:1"
       d="m 26.218295,202.77389 c 1.608061,0.1929 3.297335,-0.21634 4.902242,0 0.445254,0.06 0.875197,0.20423 1.315697,0.29262 1.197482,0.2403 3.709908,-0.0644 5.018291,0 1.805297,0.0888 3.58812,0.39228 5.39982,0.4617 2.203011,0.0844 4.500295,0 6.699615,0 4.629423,0 9.258845,0 13.888265,0 2.304375,0 4.568793,0.17882 6.872076,0.17882 0.689057,0 1.517269,0.11916 2.207807,0 3.333591,-0.57526 6.776551,-0.56787 10.165945,-0.56787"
       id="path14007" />
    <path
       style="fill:none;stroke:#000000;stroke-width:0.264583px;stroke-linecap:butt;stroke-linejoin:miter;stroke-opacity:1"
       d="m 44.91905,167.8717 c -0.224406,2.05689 -0.657966,4.18519 -0.426132,6.2717 0.11299,1.0169 0.806727,1.67622 1.140116,2.56526 0.08505,0.2268 0.04413,0.49122 0.142512,0.71257 0.09647,0.21705 0.301657,0.36863 0.427543,0.57005 0.741389,1.18623 -0.05734,0.0278 0.427545,0.9976 0.444461,0.88893 1.319303,1.81881 1.852687,2.70778 0.131617,0.21936 0.153408,0.4932 0.285028,0.71257 0.795334,1.32556 -0.285626,-0.9988 0.570058,0.71257 0.812641,1.62529 2.295149,3.86281 3.568139,5.1358 0.594389,0.59439 1.339572,1.04316 1.995201,1.56766 0.896954,0.71756 1.767473,1.41956 2.850288,1.85269 0.759092,0.30363 1.749626,0.6501 2.56526,0.71257 0.668001,0.0511 1.473948,-0.11246 2.14871,0 0.403437,0.0672 0.743474,0.32838 1.140116,0.42754 0.138258,0.0346 0.289285,-0.0346 0.427543,0 0.437615,0.1094 0.832091,0.31491 1.282628,0.42754 0.178843,0.0447 0.391219,-0.0447 0.570058,0 0.06518,0.0163 0.07878,0.12127 0.142516,0.14252 0.04504,0.015 1.053536,0.14251 1.138173,0.14251"
       id="path14011" />
    <path
       style="fill:none;stroke:#000000;stroke-width:0.264583px;stroke-linecap:butt;stroke-linejoin:miter;stroke-opacity:1"
       d="m 24.154824,163.69864 c 0.147782,0.77195 0.296227,1.54167 0.424803,2.31711 0.114673,0.69158 0.235593,2.70952 0.724124,3.22284 0.163754,0.17207 0.537096,-0.47039 1.054205,-1.2492 1.064487,-1.6032 1.686276,-3.17803 2.200819,-5.03956 0.163759,-0.59246 0.142513,-0.0603 0.142513,-0.42755"
       id="path14013" />
    <path
       style="fill:none;stroke:#000000;stroke-width:0.264583px;stroke-linecap:butt;stroke-linejoin:miter;stroke-opacity:1"
       d="m 91.447278,204.00573 c -0.667094,-0.57851 -1.37291,-0.56828 -2.221349,-0.56828 -1.522884,0 -2.928856,1.80504 -2.56526,3.25942 0.05704,0.22818 0.437121,0.53532 0.570058,0.71257 0.104148,0.13887 0.11067,0.34036 0.285027,0.42754 0.710568,0.35529 2.218497,0.13998 2.797429,-0.43895 0.150223,-0.15023 0.167183,-0.39329 0.285028,-0.57006 0.310878,-0.46632 0.126762,-0.64147 -0.278312,-0.91525 -0.205291,-0.13875 -1.002562,0.1225 -1.122651,0.14251 -0.140573,0.0234 -0.326139,-0.10014 -0.427543,0 -0.11693,0.11548 0.0132,0.21742 -0.23128,0.21742"
       id="path14015" />
    <path
       style="fill:none;stroke:#000000;stroke-width:0.264583px;stroke-linecap:butt;stroke-linejoin:miter;stroke-opacity:1"
       d="m 94.983521,203.97267 c -0.319852,-0.0533 -1.198674,-0.24794 -1.567659,-0.14252 -0.129193,0.0369 -0.169812,0.2159 -0.285028,0.28503 -0.421375,0.25282 -1.527815,0.73555 -1.710174,1.28263 -0.07511,0.22533 0,0.47505 0,0.71257 0,0.28503 -0.07811,0.58097 0,0.85509 0.208061,0.7301 0.389171,0.5035 0.853374,0.85166 0.346239,0.25968 0.571273,1.0183 0.997601,1.14011 1.019389,0.29126 2.089124,0.33362 2.850288,-0.42754"
       id="path14017" />
    <path
       style="fill:none;stroke:#000000;stroke-width:0.264583px;stroke-linecap:butt;stroke-linejoin:miter;stroke-opacity:1"
       d="m 60.688367,191.46332 c -0.239294,0.34708 -0.575968,0.58644 -0.423957,1.04247 0.09489,0.28466 1.069964,1.23295 1.253498,1.12974 0.0469,-0.0264 -0.01889,-0.11106 0,-0.16144 0.214241,-0.571 0.283244,-0.85969 0.283244,-1.46363"
       id="path14019" />
    <path
       style="fill:none;stroke:#000000;stroke-width:0.264583px;stroke-linecap:butt;stroke-linejoin:miter;stroke-opacity:1"
       d="m 53.552936,187.8917 c -0.218149,0.21815 -0.436298,0.4363 -0.65445,0.65445 -0.09501,0.095 -0.22222,0.16625 -0.285027,0.28503 -0.05085,0.0962 1.022202,1.25757 1.324541,1.11807 0.08019,-0.037 -0.273354,-1.15628 -0.273354,-1.33754"
       id="path14021" />
    <path
       style="fill:none;stroke:#000000;stroke-width:0.264583px;stroke-linecap:butt;stroke-linejoin:miter;stroke-opacity:1"
       d="m 48.648828,181.13036 c 0.209643,0.2095 -1.257964,1.50151 -1.000717,1.89919 0.20189,0.31211 0.573762,0.43125 0.809709,0.6672 0.07511,0.0751 0.06831,0.20902 0.142516,0.28503 0.223136,0.22853 0.360013,-0.98074 0.360013,-1.08966"
       id="path14023" />
    <path
       style="fill:none;stroke:#000000;stroke-width:0.264583px;stroke-linecap:butt;stroke-linejoin:miter;stroke-opacity:1"
       d="m 45.005661,174.36358 c -0.487164,0.43709 0.213223,1.55075 -0.06755,2.07655 -0.08371,0.15676 -0.215503,0.2046 -0.142515,0.42122 0.12088,0.35876 0.419354,0.69427 0.570058,0.9976 0.07513,0.15123 0.73387,0.4809 0.838727,0.55954 0.05374,0.0403 0.108616,0.20052 0.142512,0.14252 0.07728,-0.13225 0.0475,-2.13411 0,-2.36483 -0.007,-0.0342 -0.712412,-0.59543 -0.818086,-0.7011"
       id="path14025" />
    <path
       style="fill:none;stroke:#000000;stroke-width:0.264583px;stroke-linecap:butt;stroke-linejoin:miter;stroke-opacity:1"
       d="m 87.055652,202.3943 c 2.069991,-0.58514 4.175128,-1.20216 6.354008,-1.04064 0.736793,0.0546 1.721221,0.33621 2.422745,0.57006 0.515149,0.17171 -0.135776,0.14251 0.266406,0.14251"
       id="path14027" />
    <path
       style="fill:none;stroke:#000000;stroke-width:0.264583px;stroke-linecap:butt;stroke-linejoin:miter;stroke-opacity:1"
       d="m 90.408325,192.78152 c 0.549439,1.43983 0.746096,2.97146 0.843682,4.49899 0.02175,0.34056 -0.05186,0.68647 0,1.02376 0.0096,0.0625 0.432935,1.62751 0.564788,1.62751"
       id="path14029" />
    <path
       style="fill:none;stroke:#000000;stroke-width:0.264583px;stroke-linecap:butt;stroke-linejoin:miter;stroke-opacity:1"
       d="m 30.114382,172.19663 c -0.631197,5.17112 -0.142229,10.38316 -0.142229,15.57203"
       id="path14031" />
    <path
       style="fill:none;stroke:#000000;stroke-width:0.264583px;stroke-linecap:butt;stroke-linejoin:miter;stroke-opacity:1"
       d="m 27.814471,185.8743 c 0.855194,0.92047 1.007057,3.39983 1.544428,4.20953 0.17517,0.26394 0.531257,-0.3534 0.753425,-0.57921 1.369298,-1.39175 2.195597,-2.87863 3.061914,-4.61126"
       id="path14033" />
    <path
       style="fill:none;stroke:#000000;stroke-width:0.264583px;stroke-linecap:butt;stroke-linejoin:miter;stroke-opacity:1"
       d="m 60.066702,206.35896 c -2.447184,0.10157 -4.813604,-0.10688 -7.129526,-0.57006 -0.45023,-0.0901 -0.838961,0.005 -1.282628,-0.14252 -0.373235,-0.12441 -4.156027,-0.0908 -4.519181,0 -0.266634,0.0667 -0.425945,0.28503 -0.712573,0.28503"
       id="path14035" />
    <path
       style="fill:none;stroke:#000000;stroke-width:0.264583px;stroke-linecap:butt;stroke-linejoin:miter;stroke-opacity:1"
       d="m 47.548022,208.93601 c -0.389629,-0.58081 -1.198761,-0.46081 -1.721112,-0.77422 -0.115216,-0.0691 -0.169813,-0.2159 -0.285028,-0.28503 -0.157096,-0.0942 -0.57231,-0.0529 -0.705832,-0.14251 -0.332348,-0.22316 -0.469839,-0.45027 -0.814977,-0.79541 -0.05884,-0.0588 -0.237149,-0.0826 -0.263478,-0.26171 -0.04094,-0.27842 0.05519,-0.56829 0,-0.84425 -0.116472,-0.58235 -0.203887,-1.4242 0.515319,-1.7838 1.007581,-0.50379 2.088166,-0.86377 3.135315,-1.28263"
       id="path14037" />
    <path
       style="fill:none;stroke:#000000;stroke-width:0.264583px;stroke-linecap:butt;stroke-linejoin:miter;stroke-opacity:1"
       d="m 123.50385,171.3095 c -2.63808,-0.24212 -1.40612,1.68805 -0.14928,1.26911 0.25494,-0.085 0.38004,-0.38004 0.57006,-0.57006 0.23736,-0.23736 0.5803,-0.5244 0.71258,-0.85509 0.22953,-0.57384 -0.12633,-1.47567 -0.71258,-1.71017 -0.92897,-0.37159 -1.64126,0.95107 -1.42514,1.70471 0.0472,0.16464 0.20843,0.27435 0.28503,0.42754 0.23602,0.47205 -0.0323,0.42755 0.28324,0.42755"
       id="path14039" />
    <path
       style="fill:none;stroke:#000000;stroke-width:0.264583px;stroke-linecap:butt;stroke-linejoin:miter;stroke-opacity:1"
       d="m 115.85701,170.4542 c 1.98695,-0.82995 3.96122,-1.67601 6.08268,-2.16363 3.53735,-0.81307 7.27313,-0.49882 10.85304,-0.32 1.62368,0.0811 3.27112,0 4.8979,0"
       id="path14041" />
    <path
       style="fill:none;stroke:#000000;stroke-width:0.264583px;stroke-linecap:butt;stroke-linejoin:miter;stroke-opacity:1"
       d="m 40.408455,184.76018 c -0.08797,0.40453 -0.17194,0.80995 -0.263914,1.21359 -0.0573,0.25147 -0.321755,0.98475 0.142515,1.14011 0.19685,0.0659 0.847259,-0.362 1.138428,-0.4267 0.05296,-0.0118 1.319255,-0.12541 1.140113,-0.55563 -0.138456,-0.33251 -1.869479,0.1016 -1.899205,-0.0914 -0.03409,-0.22134 0.528349,-0.78149 0.63827,-1.00133 0.08501,-0.17002 0.212421,-0.66305 0.04764,-0.56828 -0.196704,0.11312 -0.235124,0.2692 -0.411718,0.2692"
       id="path14043" />
    <path
       style="fill:none;stroke:#000000;stroke-width:0.264583px;stroke-linecap:butt;stroke-linejoin:miter;stroke-opacity:1"
       d="m 38.869979,177.78876 c 0.232188,0.20259 0.467075,0.40214 0.696566,0.60779 0.94524,0.84702 0.08117,-1.32377 -0.1636,-1.32377"
       id="path14045" />
    <path
       style="fill:none;stroke:#000000;stroke-width:0.264583px;stroke-linecap:butt;stroke-linejoin:miter;stroke-opacity:1"
       d="m 45.389625,190.3696 c 0.231915,2.0819 1.858253,1.60601 0.839017,0.59102 -0.242403,-0.24139 -0.573135,-0.37576 -0.839017,-0.59102 z"
       id="path14047" />
    <path
       style="fill:none;stroke:#000000;stroke-width:0.264583px;stroke-linecap:butt;stroke-linejoin:miter;stroke-opacity:1"
       d="m 54.246377,194.74257 c -0.102931,0.9909 0.333685,0.87984 0.822455,1.36861 0.189423,0.18942 -0.234553,0.14251 0.140726,0.14251"
       id="path14049" />
    <path
       style="fill:none;stroke:#000000;stroke-width:0.264583px;stroke-linecap:butt;stroke-linejoin:miter;stroke-opacity:1"
       d="m 39.887699,174.53445 c -0.0065,1.67267 -0.112427,3.35679 0.283207,4.94957 0.08484,0.34157 -0.04861,0.79986 0,1.14011 0.26738,1.87166 0.86269,3.57148 1.710172,5.26644 0.197535,0.39507 0.263345,0.87214 0.427543,1.28264 0.258797,0.64699 0.776549,1.18953 0.997601,1.85268 0.07657,0.22971 0.125396,0.49973 0.28503,0.71258 0.876139,1.16818 2.012079,2.19928 3.135315,3.13531 0.391525,0.32627 0.716492,0.8577 1.140116,1.14012 0.403738,0.26916 0.98961,0.47061 1.425144,0.71257 0.692406,0.38467 1.314704,0.87433 1.995201,1.28263 0.615405,0.36924 1.458296,0.41907 2.137717,0.57006 0.562068,0.1249 1.147083,0.50749 1.710172,0.57005 1.507963,0.16755 0.319762,-0.17844 1.282628,0.14252 0.173578,0.0579 1.282632,0.13801 1.282632,0.24565"
       id="path14051" />
    <path
       style="fill:none;stroke:#000000;stroke-width:0.264583px;stroke-linecap:butt;stroke-linejoin:miter;stroke-opacity:1"
       d="m 108.21467,194.52079 c 1.18284,-2.39026 2.83919,-4.80197 4.41306,-6.77586 0.18533,-0.23242 2.05304,-0.67807 2.26666,-0.72148 0.31633,-0.0643 2.62582,2.58018 2.66888,2.56526 1.13196,-0.39202 1.94734,-1.12336 2.91082,-1.83439 0.63514,-0.46872 1.25985,-0.95267 1.91398,-1.39451 0.17667,-0.11933 0.4024,-0.15658 0.57256,-0.28503 1.03342,-0.78004 2.25296,-1.91148 3.06872,-2.92989 0.22127,-0.27624 0.36423,-0.61006 0.58898,-0.88348 0.23081,-0.28079 0.53561,-0.49413 0.77105,-0.77105 0.81405,-0.95748 1.65116,-2.22866 2.34652,-3.26377 0.51479,-0.76631 0.66507,-1.34257 1.25009,-2.04041 0.76929,-0.91764 1.50989,-1.37041 2.45157,-2.15556 0.39173,-0.32662 0.16177,-0.31966 0.71542,-0.43039 1.04959,-0.20991 1.68196,0.36574 2.41915,0.9976 0.32063,0.27483 0.80421,0.54569 1.14011,0.71258 0.58207,0.28919 -0.14787,-0.007 0.14074,0.28146 0.0122,0.0122 0.25841,-0.0116 0.27452,0 0.14553,0.10467 0.29843,0.46127 0.4797,0.64255"
       id="path14053" />
    <path
       style="fill:none;stroke:#000000;stroke-width:0.264583px;stroke-linecap:butt;stroke-linejoin:miter;stroke-opacity:1"
       d="m 114.78832,185.63014 c -0.85075,0.40238 -1.52218,1.04648 -2.26429,1.60331 -0.30196,0.22658 -0.73099,0.45755 -0.9976,0.71257 -0.32601,0.31184 0.50281,0.76725 0.85509,1.04907 0.47625,0.38101 3.32684,-0.32732 3.60176,-1.15205 0.0751,-0.22534 -0.039,-0.47829 0,-0.71258 0.1382,-0.82922 0.32171,-0.0282 0.14251,-1.28262 -0.009,-0.0665 -0.11756,-0.0801 -0.14251,-0.14252 -0.27212,-0.68029 -0.58518,-1.66833 -1.5406,-1.42514 -1.76051,0.4481 -2.42275,1.11094 -2.42275,2.85028 0,1.13086 -0.13587,0.86173 0.57006,1.56766 0.56095,0.56095 0.006,0.28948 0.57006,0.71257 0.66124,0.49593 1.39117,-0.53645 1.39117,-1.13475"
       id="path14055" />
    <path
       style="fill:none;stroke:#000000;stroke-width:0.264583px;stroke-linecap:butt;stroke-linejoin:miter;stroke-opacity:1"
       d="m 52.370992,167.32168 c 0.833549,3.47257 1.606846,7.02401 3.002322,10.32707 0.598004,1.41547 2.305765,3.65241 3.072675,4.59147 1.242081,1.52091 3.794691,3.24522 5.091901,4.14689 3.500334,2.43302 7.26935,4.25595 11.185536,5.90719 0.10687,0.0451 5.587436,2.56792 7.02996,2.56792"
       id="path14057" />
    <path
       style="fill:none;stroke:#000000;stroke-width:0.264583px;stroke-linecap:butt;stroke-linejoin:miter;stroke-opacity:1"
       d="m 61.934621,158.81044 c 1.496097,3.04121 3.034866,6.07783 4.720373,9.02311 0.142769,0.24947 0.344929,0.45991 0.517395,0.68986 0.39002,0.6501 0.829339,1.27306 1.170057,1.9503 0.295603,0.58758 0.400973,1.26422 0.732837,1.8321 0.371811,0.63623 0.908357,1.16064 1.357506,1.74485 1.516078,1.97195 2.972305,4.08788 4.8372,5.76054 1.469011,1.31758 3.000692,2.40396 4.592949,3.54038 1.465461,1.04593 2.705211,2.23435 4.307904,3.09318 0.896432,0.48037 2.087737,0.4388 3.011704,0.90078"
       id="path14059" />
    <path
       style="fill:none;stroke:#000000;stroke-width:0.264583px;stroke-linecap:butt;stroke-linejoin:miter;stroke-opacity:1"
       d="m 75.002304,156.34213 c 2.734316,3.38915 4.52002,7.38212 6.865456,10.99808 0.805768,1.24225 0.549503,1.21446 1.522794,2.5335 3.331141,4.51451 7.570475,8.75434 12.688093,11.19876 2.305011,1.10098 4.765933,2.0518 7.212523,2.80132 0.25702,0.0787 0.99584,0.33803 0.99584,0.70904"
       id="path14061" />
    <text
       xml:space="preserve"
       style="font-size:4.23333px;line-height:1.25;font-family:sans-serif;stroke-width:0.264583"
       x="154.25826"
       y="64.190262"
       id="text14923"><tspan
         sodipodi:role="line"
         id="tspan14921"
         style="stroke-width:0.264583"
         x="154.25826"
         y="64.190262">Fit = K1*1/Distancia + K2*Med Dist ao Obstaculo</tspan></text>
    <text
       xml:space="preserve"
       transform="scale(0.26458333)"
       id="text22069"
       style="font-size:16px;line-height:1.25;font-family:sans-serif;white-space:pre;shape-inside:url(#rect22071)" />
    <path
       style="fill:none;stroke:#000000;stroke-width:0.264583px;stroke-linecap:butt;stroke-linejoin:miter;stroke-opacity:1"
       d="m 190.45031,136.76947 c 0.35439,-0.97225 1.02725,-1.76037 1.54163,-2.63933 0.65724,-1.12306 1.36455,-2.59774 1.75446,-3.78205 0.0442,-0.13411 0.59607,-0.65066 0.42492,-0.80195 -0.24769,-0.21895 -1.32575,-0.92066 -1.55108,-0.99577 -0.55245,-0.18415 -1.27704,-0.0692 -1.85269,-0.28503 -0.16037,-0.0601 -0.27011,-0.21755 -0.42754,-0.28503 -0.9688,-0.4152 -1.99961,-0.69964 -2.99295,-0.99766 -0.8838,-0.26514 -1.80687,-0.22282 -2.56348,-0.71257 -0.049,-0.0317 0.76361,-2.10879 0.85642,-2.39577 0.45438,-1.40493 -0.20892,0.36388 0.28503,-1.28263 0.11663,-0.38876 0.38749,-0.73621 0.42754,-1.14011 0.10393,-1.04805 0.0473,-2.13036 0.14252,-3.18138 0.002,-0.0274 0.30852,-1.35268 0.14251,-1.56589 -0.0718,-0.0923 -0.4767,-0.18541 -0.51422,-0.22445 -0.17812,-0.18536 -0.20988,-0.40415 -0.41684,-0.55937 -0.5401,-0.40507 -1.4183,-0.44458 -2.02604,-0.57776 -0.38248,-0.0838 -0.74088,-0.27457 -1.12947,-0.32267 -1.25137,-0.15492 -2.52311,0.0563 -3.78278,0 -1.67247,-0.0747 -3.92549,-0.74364 -5.57545,-0.51015 -1.12787,0.15961 -2.32362,0.63605 -3.4718,0.63605"
       id="path23516" />
    <path
       style="fill:none;stroke:#000000;stroke-width:0.264583px;stroke-linecap:butt;stroke-linejoin:miter;stroke-opacity:1"
       d="m 186.29424,114.94916 c -0.24046,1.24179 -0.21337,0.72776 -0.21337,1.52941 0,0.13351 -0.0757,0.70189 0,0.85329 0.059,0.11806 0.61065,0.55413 0.77721,0.36807 0.18567,-0.2074 0.23455,-2.18538 0,-2.3826 -0.1718,-0.14447 -0.37589,-0.24545 -0.56384,-0.36817 z"
       id="path23518" />
    <path
       style="fill:none;stroke:#000000;stroke-width:0.264583px;stroke-linecap:butt;stroke-linejoin:miter;stroke-opacity:1"
       d="m 184.75445,124.07479 c 0.15418,0.68816 -1.08449,0.73682 -1.21719,1.26761 -0.17836,0.71345 0.18632,1.24962 0.42755,1.85269 0.15052,0.3763 -0.21078,0.21676 0.14251,0.57006 0.0843,0.0843 0.75458,0.28344 0.8515,0.28323 0.97115,-0.002 0.84974,-1.57833 0.57005,-2.13771 -0.1861,-0.37221 -0.68062,-1.02905 -0.9976,-1.28263 -0.19976,-0.15981 -0.48376,-0.17062 -0.71257,-0.28503"
       id="path23520" />
    <path
       style="fill:none;stroke:#000000;stroke-width:0.264583px;stroke-linecap:butt;stroke-linejoin:miter;stroke-opacity:1"
       d="m 192.30279,128.54309 c 0.6919,0.49884 1.14835,1.30688 1.82928,1.81758 0.038,0.0285 0.10893,-0.0336 0.14252,0 0.0336,0.0336 0,0.19002 0,0.14251 0,-0.95286 -0.28909,-0.92389 -0.85509,-1.67854 -0.0806,-0.1075 -0.27073,-0.41864 -0.28503,-0.28503 -0.0277,0.25879 1.0369,0.97629 1.2413,1.11256 0.14251,0.095 0.29052,0.18226 0.42754,0.28502 0.0537,0.0403 0.12911,0.20835 0.14252,0.14252 0.0117,-0.0573 -1.25755,-1.816 -1.37749,-1.65358 -0.16773,0.22714 -2.7e-4,1.41109 0.14251,1.58972 0.107,0.13375 0.30643,0.16391 0.42755,0.28503 0.32433,0.32433 -0.0308,0.28503 0.27433,0.28503 0.26717,0 0.44346,-0.24691 0.61,-0.41345 0.81383,-0.81383 0.79122,-1.24582 0.14251,-2.327 -0.44466,-0.7411 -1.73288,-0.0352 -1.93463,0.57006 -0.36966,1.10897 0.41028,1.69292 0.9958,2.27842"
       id="path23522" />
    <path
       style="fill:none;stroke:#000000;stroke-width:0.264583px;stroke-linecap:butt;stroke-linejoin:miter;stroke-opacity:1"
       d="m 199.02161,108.79001 c 0.16451,2.55066 -0.21708,5.14793 0,7.69411 0.0549,0.64438 0.2958,1.26125 0.38149,1.90226 0.0979,0.73251 0.066,1.47878 0.16839,2.21068 0.0427,0.30531 0.33802,2.07711 0.46266,2.14147 0.41316,0.21336 3.87113,0.29283 4.38004,0.29283 2.14309,0 4.17762,-0.0481 6.30724,-0.18213 0.62471,-0.0393 1.49186,0.0854 2.16285,0 1.47716,-0.18797 -0.0549,-0.0575 1.42515,-0.42755 0.13826,-0.0346 0.29234,0.0451 0.42754,0 0.0451,-0.015 -0.0336,-0.10892 0,-0.14251 0.43933,-0.43933 1.43053,-0.56903 1.986,-0.85509 0.29601,-0.15244 0.28229,-3.04386 0.26595,-3.19251 -0.18588,-1.69089 -0.47734,-3.36851 -0.71665,-5.05267 -0.0793,-0.55807 -0.1066,-1.12615 -0.23915,-1.67401 -0.14997,-0.61985 -0.46112,-1.19373 -0.60501,-1.81501 -0.1156,-0.49914 -0.0725,-1.02457 -0.16916,-1.52771 -0.22832,-1.18807 -0.89088,-2.49826 -0.89088,-3.70318 0,-0.54801 -1.09892,0.19164 -2.56381,0.57798 -0.67413,0.17779 -1.36645,0.27774 -2.05129,0.40834 -1.25499,0.23933 -2.29063,0.45816 -3.54798,0.53849 -1.04876,0.067 -2.11647,-0.0863 -3.16371,0 -1.15621,0.0953 -2.67011,0.72011 -3.7384,0.72011"
       id="path23524" />
    <path
       style="fill:none;stroke:#000000;stroke-width:0.264583px;stroke-linecap:butt;stroke-linejoin:miter;stroke-opacity:1"
       d="m 206.43835,113.01855 c 1.01567,0.85519 1.45246,2.31132 2.37102,3.22989"
       id="path23526" />
    <path
       style="fill:none;stroke:#000000;stroke-width:0.264583px;stroke-linecap:butt;stroke-linejoin:miter;stroke-opacity:1"
       d="m 208.91536,113.15349 c -0.79767,1.04447 -2.14955,2.61736 -2.14955,3.78569"
       id="path23528" />
    <path
       style="fill:none;stroke:#000000;stroke-width:0.264583px;stroke-linecap:butt;stroke-linejoin:miter;stroke-opacity:1"
       d="m 194.69248,128.69544 c 2.9371,-2.00535 5.08796,-4.89611 7.27734,-7.63284 0.64837,-0.81047 1.4266,-1.56462 2.00564,-2.43318 0.0264,-0.0395 0,-0.095 0,-0.14251 0.0475,-0.095 0.0788,-0.20005 0.14251,-0.28503 0.33157,-0.44209 1.09828,-1.20041 1.16231,-1.4021"
       id="path23530" />
    <path
       style="fill:none;stroke:#000000;stroke-width:0.264583px;stroke-linecap:butt;stroke-linejoin:miter;stroke-opacity:1"
       d="m 185.76436,125.52364 c 2.85441,-1.47726 5.6557,-3.07076 8.33384,-4.85708 0.38995,-0.2601 0.70407,-0.63707 1.14012,-0.85509 0.13436,-0.0672 0.30255,-0.0592 0.42754,-0.14251 0.1677,-0.1118 0.27016,-0.30164 0.42754,-0.42755 0.44532,-0.35625 1.09602,-0.51819 1.56766,-0.85508 0.60616,-0.43297 1.3232,-0.94447 1.9952,-1.28263 0.0126,-0.006 0.25481,0.006 0.27241,0 0.27366,-0.0924 1.79751,-1.04689 1.79751,-1.20991"
       id="path23532" />
    <path
       style="fill:none;stroke:#000000;stroke-width:0.264583px;stroke-linecap:butt;stroke-linejoin:miter;stroke-opacity:1"
       d="m 187.89241,116.546 c 0.90185,0.0906 1.76467,-0.21696 2.65614,-0.28503 1.28692,-0.0983 2.60484,-0.15194 3.88588,-0.31207 0.37294,0.17768 0.55766,-0.24254 0.85509,-0.28503 0.80211,-0.11458 1.60594,-0.127 2.38863,-0.28502 0.45392,-0.0917 0.85041,-0.31949 1.28262,-0.42755 0.18435,-0.0461 0.38374,0.0373 0.57006,0 0.76682,-0.15336 1.51645,-0.44276 2.28023,-0.57006 0.596,-0.0993 1.26413,0.0256 1.85269,-0.14251 0.59597,-0.17028 0.81012,-0.28503 1.37311,-0.28503"
       id="path23534" />
    <path
       style="fill:none;stroke:#000000;stroke-width:0.264583px;stroke-linecap:butt;stroke-linejoin:miter;stroke-opacity:1"
       d="m 108.52516,128.03925 c 1.3527,-5.11478 2.82273,-10.17823 4.02882,-15.33477 0.11763,-0.5029 0.12274,-1.02901 0.25473,-1.52833 0.63436,-2.39987 1.34925,-4.77777 2.04223,-7.16138 0.33297,-1.14529 0.78996,-2.25785 1.03552,-3.42501 0.98759,-4.694001 1.17778,-9.511081 1.42754,-14.277598 0.11311,-2.15865 0.45549,-4.325114 0.69409,-6.473158 0.34141,-3.073537 0.6408,-6.162265 0.959,-9.231622 0.0794,-0.766175 -0.23856,-1.79406 0,-2.521447 0.42665,-1.300861 0.25887,-2.77154 0.40426,-4.135125"
       id="path39083" />
    <path
       style="fill:none;stroke:#000000;stroke-width:0.264583px;stroke-linecap:butt;stroke-linejoin:miter;stroke-opacity:1"
       d="m 110.47748,138.63869 c 4.8293,0.69189 9.64395,2.02803 14.16686,3.84699 4.54666,1.82852 9.06608,3.74344 13.4599,5.9137 0.63652,0.31439 7.3146,3.32884 5.83904,6.33168 -0.48757,0.99223 -1.30463,1.78633 -2.0003,2.64556 -3.77784,4.66601 -4.03316,4.59416 -6.95262,8.57544 -0.95963,1.30864 -2.9933,3.98877 -1.31612,5.6776 2.17425,2.18933 6.93301,4.16415 9.44761,5.21205 1.54087,0.64212 3.14328,1.12541 4.70893,1.70445 0.1361,0.0503 2.51127,0.90749 2.7259,1.19366 0.25494,0.33992 0.30834,0.8054 0.57006,1.14012 0.42786,0.54721 1.04001,0.93078 1.47352,1.47352 0.36384,0.45553 0.56672,1.02139 0.90084,1.49914 1.842,2.63376 4.12623,4.93053 6.27519,7.32042 0.49943,0.55542 0.94446,1.19945 1.5845,1.5845 2.97739,1.7912 6.09453,3.37584 9.31855,4.67159 0.47308,0.19013 1.00795,0.16847 1.49797,0.3093 1.41211,0.40582 1.39955,2.70842 1.39955,3.90667"
       id="path39085" />
    <path
       style="fill:none;stroke:#000000;stroke-width:0.264583px;stroke-linecap:butt;stroke-linejoin:miter;stroke-opacity:1"
       d="m 156.93383,100.63398 c 1.86776,-3.695847 -0.18571,0.0192 4.71679,-5.930931 2.61443,-3.173089 4.17055,-7.132362 6.53964,-10.449086 0.63892,-0.89449 1.14517,-1.908619 1.71017,-2.850287 0.17625,-0.293746 0.41686,-0.54869 0.57006,-0.855086 0.0425,-0.08498 -0.0306,-0.374962 0,-0.28503 0.4428,1.299469 0.43874,2.877042 0.60986,4.150915 0.48944,3.643585 1.16954,7.331507 2.07486,10.860321 0.24078,0.938516 0.29165,1.922237 0.57006,2.850287 0.14702,0.490064 0.45907,0.925684 0.57006,1.425144 0.22498,1.012423 -0.16767,1.257473 0.57006,1.995203"
       id="path39087" />
    <path
       style="fill:none;stroke:#000000;stroke-width:0.264583px;stroke-linecap:butt;stroke-linejoin:miter;stroke-opacity:1"
       d="m 164.09758,93.756778 c 2.74072,0.439859 5.51052,0.306374 8.27198,0.306374"
       id="path39089" />
    <path
       style="fill:none;stroke:#000000;stroke-width:0.264583px;stroke-linecap:butt;stroke-linejoin:miter;stroke-opacity:1"
       d="m 187.93536,85.745406 c -6.60163,-1.453306 -9.51235,3.766447 -9.51235,9.372775 0,0.851019 -0.27054,2.109531 0.28503,2.850287 0.12747,0.169958 0.47505,0.09501 0.57006,0.28503 0.21665,0.433309 0.0684,0.991833 0.28503,1.425144 0.21244,0.424898 0.8042,0.519178 1.14011,0.855088 0.75804,0.75804 2.62595,1.9952 3.70537,1.9952 2.66545,0 5.84119,-7.387908 4.84549,-8.18161 -1.41227,-1.125768 -3.54604,1.140116 -4.7787,1.140116"
       id="path39091" />
    <path
       style="fill:none;stroke:#000000;stroke-width:0.264583px;stroke-linecap:butt;stroke-linejoin:miter;stroke-opacity:1"
       d="m 191.39751,88.345197 c 1.61104,1.258162 1.15005,-0.865069 1.82238,-1.082016 0.61191,-0.197454 2.94901,-0.221824 3.59504,0 0.89487,0.307258 1.69336,1.805342 1.99521,2.558028 0.25512,0.636186 0.75339,1.283378 0.85508,1.995202 0.0806,0.56433 -0.11179,1.151186 0,1.710174 0.47825,2.391225 0.68112,5.596887 0,7.980805 -0.28985,1.01447 -0.9491,3.1087 -2.51296,2.56526 -0.38076,-0.13231 -0.53261,-0.61323 -0.85509,-0.85509 -2.85061,-2.13795 -4.98602,-9.705815 0.55893,-9.705815 0.69191,0 1.35947,-0.09641 1.9952,0.28503 2.41903,1.451417 2.65681,4.521118 4.22785,6.092203"
       id="path39093" />
    <path
       style="fill:none;stroke:#000000;stroke-width:0.264583px;stroke-linecap:butt;stroke-linejoin:miter;stroke-opacity:1"
       d="m 205.75684,83.560588 c -0.0858,-0.854779 -0.14917,-1.712097 -0.2573,-2.564336 -0.34043,-2.683269 -0.86544,-5.450025 -1.71017,-7.973761 -0.38987,-1.16481 -1.68404,-2.602537 -1.68404,-3.624202"
       id="path39095" />
    <path
       style="fill:none;stroke:#000000;stroke-width:0.264583px;stroke-linecap:butt;stroke-linejoin:miter;stroke-opacity:1"
       d="m 199.82959,74.978463 c 0,-1.362837 0,-2.725674 0,-4.088511 0,-0.62706 -0.11812,-3.721889 0.28503,-4.266012 0.57745,-0.779381 4.39997,4.446045 4.39997,4.62448"
       id="path39097" />
    <path
       style="fill:none;stroke:#000000;stroke-width:0.264583px;stroke-linecap:butt;stroke-linejoin:miter;stroke-opacity:1"
       d="m 186.81167,81.085131 c -1.81994,-1.383337 -2.46408,-3.786738 -4.02901,-5.35318 -1.66943,-1.671037 -4.81045,-4.928984 -7.11512,-5.697209 -1.30075,-0.433581 -2.71406,-0.535998 -3.99041,-0.855086 -0.51588,0.171794 -0.5301,-0.46173 -0.85508,-0.570058 -1.12212,-0.374036 -2.6225,-0.570058 -3.8417,-0.570058"
       id="path39099" />
    <path
       style="fill:none;stroke:#000000;stroke-width:0.264583px;stroke-linecap:butt;stroke-linejoin:miter;stroke-opacity:1"
       d="m 170.88487,77.383454 c -0.93263,-1.230929 -0.80489,-3.205493 -1.42515,-4.601073 -0.51693,-1.163103 -3.30283,-5.555943 -2.85029,-6.747443 0.14975,-0.394256 0.8359,-0.112808 1.25423,-0.166323 3.87383,-0.495577 4.4126,-0.216445 7.69577,1.425144"
       id="path39101" />
    <text
       xml:space="preserve"
       style="font-size:4.23333px;line-height:1.25;font-family:sans-serif;stroke-width:0.264583"
       x="217.46658"
       y="94.90831"
       id="text40887"><tspan
         sodipodi:role="line"
         id="tspan40885"
         style="stroke-width:0.264583"
         x="217.46658"
         y="94.90831">Fit = Fitness maximo que o AG1 chega depois de N geracoes</tspan></text>
  </g>
</svg>
