<?xml version="1.0" encoding="UTF-8" standalone="no"?>
<!-- Created with Inkscape (http://www.inkscape.org/) -->

<svg
   xmlns:dc="http://purl.org/dc/elements/1.1/"
   xmlns:cc="http://creativecommons.org/ns#"
   xmlns:rdf="http://www.w3.org/1999/02/22-rdf-syntax-ns#"
   xmlns:svg="http://www.w3.org/2000/svg"
   xmlns="http://www.w3.org/2000/svg"
   xmlns:sodipodi="http://sodipodi.sourceforge.net/DTD/sodipodi-0.dtd"
   xmlns:inkscape="http://www.inkscape.org/namespaces/inkscape"
   width="374.87943mm"
   height="140.87201mm"
   viewBox="0 0 374.87943 140.87201"
   version="1.1"
   id="svg8"
   inkscape:version="0.92.3 (2405546, 2018-03-11)"
   sodipodi:docname="EvolutivosA02.svg"
   inkscape:export-filename="/home/simoes/Documents/MaterialAulaDistancia/EvolutivosA02.png"
   inkscape:export-xdpi="96"
   inkscape:export-ydpi="96">
  <defs
     id="defs2" />
  <sodipodi:namedview
     id="base"
     pagecolor="#ffffff"
     bordercolor="#666666"
     borderopacity="1.0"
     inkscape:pageopacity="1"
     inkscape:pageshadow="2"
     inkscape:zoom="0.98994949"
     inkscape:cx="233.15792"
     inkscape:cy="309.30351"
     inkscape:document-units="mm"
     inkscape:current-layer="layer1"
     showgrid="false"
     inkscape:window-width="1366"
     inkscape:window-height="741"
     inkscape:window-x="0"
     inkscape:window-y="27"
     inkscape:window-maximized="1" />
  <metadata
     id="metadata5">
    <rdf:RDF>
      <cc:Work
         rdf:about="">
        <dc:format>image/svg+xml</dc:format>
        <dc:type
           rdf:resource="http://purl.org/dc/dcmitype/StillImage" />
        <dc:title></dc:title>
      </cc:Work>
    </rdf:RDF>
  </metadata>
  <g
     inkscape:label="Layer 1"
     inkscape:groupmode="layer"
     id="layer1"
     transform="translate(-12.027128,-5.5947616)">
    <text
       xml:space="preserve"
       style="font-style:normal;font-weight:normal;font-size:4.23333311px;line-height:1.25;font-family:sans-serif;letter-spacing:0px;word-spacing:0px;fill:#000000;fill-opacity:1;stroke:none;stroke-width:0.26458332"
       x="12.027128"
       y="8.8834496"
       id="text12"><tspan
         sodipodi:role="line"
         id="tspan10"
         x="12.027128"
         y="8.8834496"
         style="stroke-width:0.26458332">1- Inicia a População</tspan><tspan
         sodipodi:role="line"
         x="12.027128"
         y="14.175116"
         style="stroke-width:0.26458332"
         id="tspan14" /><tspan
         sodipodi:role="line"
         x="12.027128"
         y="19.466782"
         style="stroke-width:0.26458332"
         id="tspan16">2- Avaliação: Depende da Aplicação (Função f(x), Provar café, Protótipo, Chão de Fábrica(Alg. supervisor), Simulador(Brooks-&gt;&quot;O melhor modelo do mundo é o próprio mundo&quot;))</tspan><tspan
         sodipodi:role="line"
         x="12.027128"
         y="24.75845"
         style="stroke-width:0.26458332"
         id="tspan18" /><tspan
         sodipodi:role="line"
         x="12.027128"
         y="30.050116"
         style="stroke-width:0.26458332"
         id="tspan20">3- Seleção: a) O cara que tem maior nota tem que ter maior probabilidade de ser escolhido </tspan><tspan
         sodipodi:role="line"
         x="12.027128"
         y="35.341782"
         style="stroke-width:0.26458332"
         id="tspan24">                   b) Nunca perder o melhor de todos!!!!!!!!!!!!!!!!!!!!!!!!!!</tspan><tspan
         sodipodi:role="line"
         x="12.027128"
         y="40.63345"
         style="stroke-width:0.26458332"
         id="tspan26">                   Métodos: Elitismo(Melhor transa com todos); Torneio de 2(Pai + Mae =&gt; Filho); Roleta(Pai + Mae =&gt; Filho) </tspan><tspan
         sodipodi:role="line"
         x="12.027128"
         y="45.925114"
         style="stroke-width:0.26458332"
         id="tspan22">               </tspan><tspan
         sodipodi:role="line"
         x="12.027128"
         y="51.216782"
         style="stroke-width:0.26458332"
         id="tspan17" /><tspan
         sodipodi:role="line"
         x="12.027128"
         y="56.508446"
         style="stroke-width:0.26458332"
         id="tspan19" /><tspan
         sodipodi:role="line"
         x="12.027128"
         y="61.800114"
         style="stroke-width:0.26458332"
         id="tspan21" /><tspan
         sodipodi:role="line"
         x="12.027128"
         y="67.091782"
         style="stroke-width:0.26458332"
         id="tspan23" /><tspan
         sodipodi:role="line"
         x="12.027128"
         y="72.383446"
         style="stroke-width:0.26458332"
         id="tspan25" /><tspan
         sodipodi:role="line"
         x="12.027128"
         y="77.67511"
         style="stroke-width:0.26458332"
         id="tspan27" /><tspan
         sodipodi:role="line"
         x="12.027128"
         y="82.966782"
         style="stroke-width:0.26458332"
         id="tspan29" /><tspan
         sodipodi:role="line"
         x="12.027128"
         y="88.258446"
         style="stroke-width:0.26458332"
         id="tspan31" /><tspan
         sodipodi:role="line"
         x="12.027128"
         y="93.55011"
         style="stroke-width:0.26458332"
         id="tspan33" /><tspan
         sodipodi:role="line"
         x="12.027128"
         y="98.841782"
         style="stroke-width:0.26458332"
         id="tspan35" /><tspan
         sodipodi:role="line"
         x="12.027128"
         y="104.13345"
         style="stroke-width:0.26458332"
         id="tspan37" /><tspan
         sodipodi:role="line"
         x="12.027128"
         y="109.42511"
         style="stroke-width:0.26458332"
         id="tspan39" /><tspan
         sodipodi:role="line"
         x="12.027128"
         y="114.71677"
         style="stroke-width:0.26458332"
         id="tspan41" /><tspan
         sodipodi:role="line"
         x="12.027128"
         y="120.00845"
         style="stroke-width:0.26458332"
         id="tspan43" /><tspan
         sodipodi:role="line"
         x="12.027128"
         y="125.30011"
         style="stroke-width:0.26458332"
         id="tspan45" /><tspan
         sodipodi:role="line"
         x="12.027128"
         y="130.59178"
         style="stroke-width:0.26458332"
         id="tspan47" /><tspan
         sodipodi:role="line"
         x="12.027128"
         y="135.88344"
         style="stroke-width:0.26458332"
         id="tspan49" /><tspan
         sodipodi:role="line"
         x="12.027128"
         y="141.17511"
         style="stroke-width:0.26458332"
         id="tspan51" /><tspan
         sodipodi:role="line"
         x="12.027128"
         y="146.46678"
         style="stroke-width:0.26458332"
         id="tspan53">..</tspan></text>
  </g>
</svg>
