<?xml version="1.0" encoding="UTF-16"?>
<!DOCTYPE svg PUBLIC "-//W3C//DTD SVG 1.1//EN" "http://www.w3.org/Graphics/SVG/1.1/DTD/svg11.dtd">
<!-- Creator: CorelDRAW 2019 (64 Bit) -->
<svg xmlns="http://www.w3.org/2000/svg" xml:space="preserve" width="55mm" height="55mm" version="1.1" shape-rendering="geometricPrecision" text-rendering="geometricPrecision" image-rendering="optimizeQuality" fill-rule="evenodd" clip-rule="evenodd"
viewBox="0 0 5500 5500"
 xmlns:xlink="http://www.w3.org/1999/xlink">
 <defs>
   <linearGradient id="id0" gradientUnits="userSpaceOnUse" x1="3369.88" y1="4304.06" x2="3369.88" y2="255.68">
    <stop offset="0" stop-opacity="1" stop-color="#FF3604"/>
    <stop offset="0.501961" stop-opacity="1" stop-color="#FF072C"/>
    <stop offset="1" stop-opacity="1" stop-color="#FF6A01"/>
   </linearGradient>
   <linearGradient id="id1" gradientUnits="userSpaceOnUse" x1="2648.81" y1="967.56" x2="954.61" y2="1515.33">
    <stop offset="0" stop-opacity="1" stop-color="#B04305"/>
    <stop offset="0.34902" stop-opacity="1" stop-color="#9E230F"/>
    <stop offset="1" stop-opacity="1" stop-color="#8B021A"/>
   </linearGradient>
   <linearGradient id="id2" gradientUnits="userSpaceOnUse" x1="2629.01" y1="3097.66" x2="983.46" y2="3658.01">
    <stop offset="0" stop-opacity="1" stop-color="#8D0519"/>
    <stop offset="0.65098" stop-opacity="1" stop-color="#9E240F"/>
    <stop offset="1" stop-opacity="1" stop-color="#B04305"/>
   </linearGradient>
 </defs>
 <g id="Camada_x0020_1">
  <metadata id="CorelCorpID_0Corel-Layer"/>
  <polygon fill="url(#id0)" points="3515.02,255.68 4574.18,255.68 3283.57,2334.79 4574.18,4304.06 3515.02,4304.06 2165.57,2334.79 "/>
  <polygon fill="url(#id1)" points="1981.64,251.67 922.47,251.67 2090.42,2231.22 2680.94,1329.09 "/>
  <polygon fill="url(#id2)" points="2002.6,4300.05 943.43,4300.05 2089.67,2455.63 2669.04,3290.91 "/>
  <path fill="#ED3237" fill-rule="nonzero" stroke="#ED3237" stroke-width="7.62" stroke-miterlimit="22.9256" d="M1895.07 5251.67l-71.58 0 0 -584.25 348.94 0 0 64.42 -277.36 0 0 188.78 245.9 0 0 64.42 -245.9 0 0 266.63zm451.24 -584.25l0 519.83 285.27 0 0 64.42 -356.85 0 0 -584.25 71.58 0zm465.7 519.83l299.73 0 0 64.42 -371.31 0 0 -584.25 355.06 0 0 64.42 -283.48 0 0 188.78 252.16 0 0 64.42 -252.16 0 0 202.21zm611.39 -283.18l161.65 -236.65 79.03 0 -198.33 287.8 207.43 296.45 -79.93 0 -171.19 -247.54 -1.79 0 -171.19 247.54 -80.82 0 209.21 -298.24 -196.54 -286.01 78.14 0 162.54 236.65 1.79 0z"/>
 </g>
</svg>
