<?xml version="1.0" encoding="UTF-16"?>
<!DOCTYPE svg PUBLIC "-//W3C//DTD SVG 1.1//EN" "http://www.w3.org/Graphics/SVG/1.1/DTD/svg11.dtd">
<!-- Creator: CorelDRAW 2019 (64 Bit) -->
<svg xmlns="http://www.w3.org/2000/svg" xml:space="preserve" width="179mm" height="125mm" version="1.1" shape-rendering="geometricPrecision" text-rendering="geometricPrecision" image-rendering="optimizeQuality" fill-rule="evenodd" clip-rule="evenodd"
viewBox="0 0 17900 12500"
 xmlns:xlink="http://www.w3.org/1999/xlink">
 <defs>
     <clipPath id="id0">
      <path d="M5000.58 5691.44c0,0 -473.92,-703.06 -78.12,-973.87 395.8,-270.81 953.05,614.52 953.05,614.52l-874.93 359.35z"/>
     </clipPath>
     <clipPath id="id1">
      <path d="M5979.66 5181.07c0,0 -609.32,-1708.2 151.03,-2041.5 760.36,-333.31 661.41,1374.89 661.41,1374.89 0,0 302.07,-3713.25 1328.03,-3687.21 1025.97,26.03 -46.83,3044.01 -46.83,3044.01 0,0 650.97,-2080.57 1369.66,-1908.7 718.69,171.87 -345.14,2494.94 -880.12,2984.12 -534.98,489.18 -2583.18,234.39 -2583.18,234.39z"/>
     </clipPath>
    <clipPath id="id2">
     <path d="M4406.46 6746.14c0,0 -208.31,1729.03 -124.98,3228.9 83.32,1499.88 1760.27,1718.61 4385.05,1718.61 2624.79,0 3728.87,-572.86 3728.87,-1479.04 0,-906.18 -10.43,-2645.62 -41.67,-3051.83 -31.24,-406.22 -927.01,-479.13 -7947.27,-416.64z"/>
    </clipPath>
     <clipPath id="id3">
      <path d="M1475.52 2549.94c23.43,308.57 -35.16,1113.2 503.86,1058.51 539.02,-54.68 1038.98,-167.95 1003.83,-445.28 -31.96,-252.16 -41.33,-878.84 -177.84,-1019.86 260.97,-81.08 443.74,-327.99 281.1,-391.95 -142.69,-56.11 -277.46,253.62 -321.16,366.36 -1.57,-0.46 -3.13,-0.99 -4.74,-1.33 -205.79,-44.74 -1309.85,107.14 -1285.05,433.55zm1310.84 -422.5c-2.17,-1.4 -4.38,-2.67 -6.61,-3.85 17.6,-49.28 148.4,-399.82 287.97,-344.93 148.32,58.33 -36.11,292.88 -281.36,348.78z"/>
     </clipPath>
     <clipPath id="id4">
      <path d="M5055.92 2467.09c-77.23,-87.66 -300.48,-294.31 -722.15,-343.2 0,0 -277.32,367.16 124.99,605.42 264.35,156.56 437.63,60.15 535.36,-56.51l0.01 -0.01c168.23,-44.74 77.86,-310.7 445.01,-1130.94 367.16,-820.24 664.02,-796.79 726.52,-863.19 62.49,-66.4 -82.03,-58.59 -82.03,-58.59 -369.12,101.52 -742.13,804.6 -886.65,1425.64 -43.91,188.69 -95.37,324.65 -141.06,421.38z"/>
     </clipPath>
      <clipPath id="id5">
       <path d="M8802.27 36.41l2024.59 591.54c65.98,19.28 104.19,89.04 84.91,155.02l-100.04 342.41c-19.28,65.98 -89.04,104.19 -155.02,84.91l-2024.58 -591.53c-65.98,-19.28 -104.2,-89.04 -84.92,-155.02l100.05 -342.41c19.28,-65.98 89.03,-104.19 155.01,-84.92z"/>
      </clipPath>
     <clipPath id="id6">
      <path d="M16052.71 4432.91c0,0 492.2,313.66 701.77,365.57 -31.03,64.44 -125.49,280.01 -50.65,374.66 86.06,108.84 277.88,-121.87 78.04,-371.64 237.47,-14.43 1046.86,-944.76 723.83,-1212.27 -333.3,-276.02 -927,322.9 -942.63,374.97 -15.62,52.08 96.34,-322.9 -46.87,-346.33 -143.21,-23.43 -322.89,13.02 -463.49,815.04zm712.26 376.47c0,0 -127.66,241.88 -51.51,338.19 76.15,96.31 248.6,-116.46 51.51,-338.19z"/>
     </clipPath>
     <clipPath id="id7">
      <path d="M12741.71 1603.62c0,0 -264.3,180.97 37.76,542.92 302.06,361.95 434.86,401.01 434.86,401.01l588.5 1156.16c0,0 57.28,114.58 156.23,57.29 98.95,-57.29 -41.66,-213.53 -52.08,-234.36 -10.41,-20.83 -624.95,-1054.6 -624.95,-1054.6 0,0 -44.31,-1150.99 -540.32,-868.42zm63.71 -2.06c0,0 315.09,-49.47 437.47,617.14 0,0 -65.11,-713.48 -437.47,-617.14zm-31.25 26.04c0,0 335.91,26.04 476.52,789 0,0 -98.94,-841.07 -476.52,-789zm-10.41 26.04l466.11 809.83c0,0 -110.7,-731.22 -466.11,-809.83zm-31.25 13.03c0,0 455.69,755.14 484.34,822.84 28.64,67.7 -471.92,-448.25 -484.34,-822.84zm-29.9 18.92c0,0 -192.72,316.35 481.71,813.71 0,0 -489.54,-418.36 -481.71,-813.71z"/>
     </clipPath>
     <clipPath id="id8">
      <path d="M2553.08 6427.13c0,0 23.43,-138.02 16.93,-166.66 -6.51,-28.64 -230.49,-95.06 -290.38,-483.05 -59.9,-387.99 367.15,-361.96 367.15,-361.96 0,0 481.73,-26.04 554.64,5.21 72.92,31.25 156.24,124.99 153.64,182.28 -2.6,57.29 -117.18,182.28 -200.5,158.84 0,0 20.83,263 5.2,309.87 -15.62,46.88 -47.71,310.66 -333.31,236.97 0,0 36.43,145.81 58.57,177.06 22.14,31.25 20.83,109.36 20.83,109.36 0,0 -121.08,-19.52 -352.77,-167.92z"/>
     </clipPath>
     <clipPath id="id9">
      <path d="M2864.78 11609.7c-409.34,6.77 -489.54,26.03 -473.92,-111.97 15.63,-138.01 54.69,-174.47 26.05,-169.26 -28.65,5.21 -117.18,0 -138.02,-106.76 -20.83,-106.76 -182.33,-1015.53 -161.5,-1203.02 20.83,-187.48 -171.86,-1208.23 -62.49,-1479.04 0,0 -54.71,-213.54 -5.24,-283.84 0,0 -492.18,-330.7 -518.22,-679.64 -26.03,-348.93 343.72,-984.29 677.03,-1067.62 0,0 7.81,-32.55 55.98,-46.87 48.17,-14.32 268.21,-122.39 311.18,-104.16 42.96,18.23 214.82,101.54 242.16,154.92 0,0 46.88,28.64 45.57,6.51 -1.3,-22.13 -20.83,-84.64 -2.6,-97.65 18.23,-13.02 339.82,71.61 341.12,119.78 1.3,48.18 140.61,89.84 217.43,186.18 76.82,96.35 203.1,226.55 235.65,295.55 32.56,69 -102.86,-635.38 -50.78,-679.65 52.07,-44.27 45.56,-33.86 46.21,-46.22 0.65,-12.37 -5.85,-72.25 -18.87,-81.37 -13.03,-9.12 -214.84,-111.97 -105.47,-300.76 0,0 26.04,-10.41 33.86,37.76 7.81,48.17 82.02,143.22 115.87,105.46 33.85,-37.76 7.81,-117.18 -117.18,-162.75 -124.99,-45.57 125,-57.28 154.94,-46.87 29.95,10.42 80.72,49.48 88.54,66.4 7.81,16.93 96.34,-134.12 179.67,-134.12 83.32,0 -97.65,256.49 -114.58,365.86 -16.92,109.37 1.31,109.37 1.31,109.37 0,0 44.27,-14.33 55.98,14.32 11.72,28.64 368.48,842.38 128.92,1128.81 -239.56,286.44 -583.28,39.06 -583.28,39.06 0,0 289.03,877.57 229.14,1088.48 0,0 -7.82,49.49 28.63,148.44 36.46,98.95 229.14,2221.17 166.64,2512.81 0,0 6.51,62.49 -130.2,50.78 0,0 316.38,222.63 251.28,282.52 -65.1,59.89 -601.52,91.13 -718.69,28.64 -117.18,-62.49 54.67,-239.56 36.45,-276.02 -18.23,-36.46 -96.34,-5.21 -109.36,-44.27 -13.02,-39.05 -106.77,-851.5 -111.97,-994.71 -5.21,-143.21 -10.42,1036.38 -122.39,1044.19 -111.97,7.81 -127.6,7.81 -98.95,23.44 113.42,61.86 383.45,300.52 -25.9,307.29z"/>
     </clipPath>
     <clipPath id="id10">
      <path d="M11134.09 3076.97c0,0 41.66,-132.8 26.04,-169.26 -15.63,-36.46 -289.04,127.59 -330.71,-283.83 0,0 -18.22,-174.47 20.84,-268.21 0,0 -140.63,-54.69 -44.28,-153.64 0,0 49.47,-49.47 9.11,-53.38 -40.36,-3.91 -125.01,-158.9 238.24,-129.61 363.25,29.3 581.34,210.9 585.25,256.47 3.9,45.57 66.11,299.42 -205.72,493.45l18.24 270.81c0,0 -127.6,132.81 -317.01,37.2z"/>
     </clipPath>
     <clipPath id="id11">
      <path d="M10417.82 5774.06c-36.46,-10.42 -52.08,-650.99 -20.83,-723.9 0,0 -78.13,-33.85 -49.48,-111.97 28.64,-78.12 102.85,-630.16 102.85,-630.16 0,0 -348.96,-131.5 -222.66,-464.81 126.29,-333.31 239.56,-618.45 775.97,-772.09 0,0 108.06,-81.37 133.45,-70.3 25.39,11.06 64.45,66.4 87.89,78.12 23.43,11.71 205.04,-98.33 233.69,-94.43 28.64,3.9 70.31,49.47 74.21,65.1 3.9,15.62 136.71,-65.1 136.71,-65.1l52.08 148.42c0,0 497.36,283.79 499.97,736.88 2.6,453.09 -223.94,505.17 -260.4,515.59 -36.45,10.41 158.83,572.85 130.19,614.52 -28.65,41.66 -88.54,91.13 -88.54,91.13 0,0 286.44,1137.93 203.11,1283.76 -83.33,145.82 -1947.76,-62.5 -1788.21,-600.76z"/>
     </clipPath>
      <clipPath id="id12">
       <path d="M11734.55 3992.69c0,0 65.1,117.18 23.44,121.09 -41.67,3.91 3.91,174.46 -184.88,-395.8l-198.59 -562.48 158.39 -105.88c3.9,15.62 136.71,-65.1 136.71,-65.1l52.08 148.42 154.08 449.61 -238.26 100.25 97.03 309.89z"/>
      </clipPath>
      <clipPath id="id13">
       <path d="M10417.82 5774.06c-36.46,-10.42 -52.08,-650.99 -20.83,-723.9 0,0 -78.13,-33.85 -49.48,-111.97 28.64,-78.12 102.85,-630.16 102.85,-630.16 0,0 -348.96,-131.5 -222.66,-464.81 126.29,-333.31 239.56,-618.45 775.97,-772.09 0,0 108.06,-81.37 133.45,-70.3 25.39,11.06 64.45,66.4 87.89,78.12 23.43,11.71 205.04,-98.33 233.69,-94.43 28.64,3.9 70.31,49.47 74.21,65.1 3.9,15.62 136.71,-65.1 136.71,-65.1l52.08 148.42c0,0 497.36,283.79 499.97,736.88 2.6,453.09 -223.94,505.17 -260.4,515.59 -36.45,10.41 158.83,572.85 130.19,614.52 -28.65,41.66 -88.54,91.13 -88.54,91.13 0,0 286.44,1137.93 203.11,1283.76 -83.33,145.82 -1947.76,-62.5 -1788.21,-600.76z"/>
      </clipPath>
    <clipPath id="id14">
     <path d="M4563.9 6152.44c0,0 -541.63,281.23 -276.02,869.72 265.6,588.49 880.13,124.98 880.13,124.98 0,0 -208.31,552.05 182.28,697.87 390.59,145.81 677.03,-125 677.03,-125 0,0 -20.83,406.22 458.29,411.43 479.13,5.21 723.91,-218.73 723.91,-218.73 0,0 31.23,393.2 541.61,395.8 510.38,2.61 632.76,-213.52 632.76,-213.52 0,0 70.28,262.99 481.71,273.41 411.42,10.41 723.9,-325.49 723.9,-325.49 0,0 236.93,231.75 624.92,164.04 387.99,-67.71 395.8,-395.8 395.8,-395.8 0,0 117.11,273.41 419.16,260.39 302.06,-13.02 419.24,-343.73 419.24,-343.73 0,0 166.63,132.82 408.8,93.76 242.17,-39.06 354.14,-450.49 354.14,-450.49 0,0 351.52,80.72 479.12,-101.56 127.6,-182.28 28.64,-419.24 -80.72,-492.15 -109.37,-72.91 -239.56,-158.84 -343.72,-195.29 0,0 180.96,-144.52 152.32,-335.91 -28.64,-191.39 -173.18,-329.42 -467.43,-329.42 0,0 83.29,-304.67 -343.76,-473.93 -427.05,-169.26 -648.39,-80.72 -648.39,-80.72 0,0 163.99,-247.38 -145.88,-330.71 -309.87,-83.32 -606.72,190.09 -606.72,190.09 0,0 85.92,-364.55 -195.3,-458.29 -281.23,-93.74 -838.48,239.56 -838.48,239.56 0,0 32.55,-153.62 -63.8,-171.85 -96.35,-18.23 -210.92,170.57 -205.71,279.93 0,0 -27.43,-430.97 -425.83,-472.63 -398.41,-41.66 -541.62,390.58 -541.62,390.58 0,0 46.87,-505.17 -338.52,-494.75 -385.38,10.42 -544.22,322.89 -580.68,492.15 0,0 -52.11,-367.15 -427.08,-346.32 -374.97,20.83 -479.13,463.5 -479.13,463.5 0,0 -278.66,-270.82 -557.28,-135.41 -278.62,135.41 -283.83,515.59 -283.83,515.59 0,0 -406.24,-39.05 -601.55,169.26 -195.3,208.32 -103.67,459.64 -103.67,459.64z"/>
    </clipPath>
     <clipPath id="id15">
      <path d="M8438.05 5416.77c1238.23,0 2242.01,511.8 2242.01,1143.13 0,631.33 -1003.78,1143.13 -2242.01,1143.13 -1238.22,0 -2242,-511.8 -2242,-1143.13 0,-631.33 1003.78,-1143.13 2242,-1143.13z"/>
     </clipPath>
     <clipPath id="id16">
      <path d="M4563.9 6152.44c0,0 -541.63,281.23 -276.02,869.72 265.6,588.49 880.13,124.98 880.13,124.98 0,0 -208.31,552.05 182.28,697.87 390.59,145.81 677.03,-125 677.03,-125 0,0 -20.83,406.22 458.29,411.43 479.13,5.21 723.91,-218.73 723.91,-218.73 0,0 31.23,393.2 541.61,395.8 510.38,2.61 632.76,-213.52 632.76,-213.52 0,0 70.28,262.99 481.71,273.41 411.42,10.41 723.9,-325.49 723.9,-325.49 0,0 236.93,231.75 624.92,164.04 387.99,-67.71 395.8,-395.8 395.8,-395.8 0,0 117.11,273.41 419.16,260.39 302.06,-13.02 419.24,-343.73 419.24,-343.73 0,0 166.63,132.82 408.8,93.76 242.17,-39.06 354.14,-450.49 354.14,-450.49 0,0 351.52,80.72 479.12,-101.56 127.6,-182.28 28.64,-419.24 -80.72,-492.15 -109.37,-72.91 -239.56,-158.84 -343.72,-195.29 0,0 180.96,-144.52 152.32,-335.91 -28.64,-191.39 -173.18,-329.42 -467.43,-329.42 0,0 83.29,-304.67 -343.76,-473.93 -427.05,-169.26 -648.39,-80.72 -648.39,-80.72 0,0 163.99,-247.38 -145.88,-330.71 -309.87,-83.32 -606.72,190.09 -606.72,190.09 0,0 85.92,-364.55 -195.3,-458.29 -281.23,-93.74 -838.48,239.56 -838.48,239.56 0,0 32.55,-153.62 -63.8,-171.85 -96.35,-18.23 -210.92,170.57 -205.71,279.93 0,0 -27.43,-430.97 -425.83,-472.63 -398.41,-41.66 -541.62,390.58 -541.62,390.58 0,0 46.87,-505.17 -338.52,-494.75 -385.38,10.42 -544.22,322.89 -580.68,492.15 0,0 -52.11,-367.15 -427.08,-346.32 -374.97,20.83 -479.13,463.5 -479.13,463.5 0,0 -278.66,-270.82 -557.28,-135.41 -278.62,135.41 -283.83,515.59 -283.83,515.59 0,0 -406.24,-39.05 -601.55,169.26 -195.3,208.32 -103.67,459.64 -103.67,459.64z"/>
     </clipPath>
     <clipPath id="id17">
      <path d="M12244.86 7412.91c0,0 -161.44,-210.93 -26.04,-341.12 135.4,-130.19 -161.45,-406.21 78.12,-432.25 239.57,-26.04 380.18,-104.16 406.22,-15.63 26.04,88.54 119.78,-276.02 385.38,-291.64 265.6,-15.63 223.94,36.46 104.16,213.53 -119.78,177.06 229.15,114.56 281.23,265.6 52.07,151.03 -114.57,213.53 -72.91,255.19 41.66,41.66 380.2,203.1 249.99,346.32l-1406.15 0z"/>
     </clipPath>
     <clipPath id="id18">
      <path d="M14374.7 11161.56c0,0 63.8,253.88 -138.01,227.84 -201.81,-26.04 -597.62,-236.96 -593.71,-253.89 3.91,-16.93 -26.03,-39.06 260.4,-164.05 0,0 -63.8,-24.74 -57.29,-66.4 6.51,-41.66 25.98,-1248.62 41.61,-1423.09 15.62,-174.47 18.19,-807.27 79.38,-993.45 0,0 -61.2,-19.52 -49.48,-79.41 11.72,-59.9 48.13,-529.91 31.2,-557.26 -16.92,-27.35 -442.71,-35.19 -485.68,-39.1 -42.96,-3.9 -31.25,-80.72 -31.25,-80.72 0,0 -167.97,50.75 -263.02,37.73 -95.05,-13.02 -351.54,-167.96 -316.38,-270.81 35.15,-102.86 207.01,-28.64 274.71,-16.93 67.71,11.72 -26.06,-143.9 -0.02,-155.62 26.03,-11.71 153.63,44.92 299.45,182.94 0,0 -16.28,-14.32 54.03,-45.57 70.3,-31.25 395.8,-139.33 532.5,-171.88 0,0 148.42,-869.72 283.82,-1005.13 135.4,-135.41 262.99,-356.75 390.58,-330.71 127.6,26.04 93.75,187.49 106.77,216.13 13.02,28.64 768.15,1700.37 596.29,2111.8 0,0 148.39,453.08 12.99,932.21 -135.4,479.12 179.65,1760.28 197.88,1788.92 18.23,28.64 -13.02,78.12 -109.37,80.72 0,0 -49.46,-18.23 -26.03,46.87 23.43,65.11 104.15,276.03 -41.67,252.59 -145.82,-23.44 -637.97,49.47 -635.37,-36.46 2.61,-85.93 174.47,-205.7 161.45,-234.35 -13.02,-28.65 -7.81,15.62 -62.5,-7.81 -54.68,-23.44 -218.72,-307.27 -231.74,-348.94 -13.02,-41.66 -91.15,369.76 -140.62,387.99 -49.47,18.23 -140.92,15.84 -140.92,15.84z"/>
     </clipPath>
     <clipPath id="id19">
      <path d="M14328.44 6298.35c0,0 24.73,-265.61 23.43,-289.04 -1.3,-23.44 -356.75,121.08 -380.18,-192.7 0,0 -11.72,-191.38 -10.42,-230.45 0,0 -83.32,-14.32 -57.28,-54.68 26.04,-40.36 144.5,-109.36 161.42,-210.92 0,0 -239.56,-48.18 -131.5,-251.29 108.06,-203.11 332.01,-111.97 338.52,-96.35 6.51,15.63 604.12,315.05 604.12,315.05 0,0 5.17,369.77 -285.17,553.35 0,0 -44.3,78.1 40.33,157.52 84.63,79.43 -303.27,299.51 -303.27,299.51z"/>
     </clipPath>
 </defs>
 <g id="Camada_x0020_1">
  <metadata id="CorelCorpID_0Corel-Layer"/>
  <g id="_1976641429168">
   <path fill="#214865" fill-opacity="0.258824" d="M8761.48 11693.65c0,0 -4870.13,1893.2 -7432.41,-210.79 -2562.29,-2104 -700.59,-4861.39 562.45,-5291.23 1263.04,-429.84 9323.48,-4502.7 9909.15,-5270.75 585.68,-768.04 4277.18,83.68 5714.55,4020.85 317.24,868.97 124.99,3333.06 -8753.74,6751.92z"/>
   <path fill="#74A3CC" fill-opacity="0.258824" d="M3933.01 3139.8c0,0 -3481.49,1097.62 -2334.45,4079.76 1147.05,2982.15 7896.48,2940.49 9292.2,3440.45 1395.73,499.96 4707.95,2812.26 6395.31,479.12 1687.36,-2333.14 -775.13,-4804.38 -3220.66,-5818.57 -2445.54,-1014.2 -4237.05,-3618.15 -10132.4,-2180.76z"/>
   <g>
    <path fill="#F8DF6E" d="M5000.58 5691.44c0,0 -473.92,-703.06 -78.12,-973.87 395.8,-270.81 953.05,614.52 953.05,614.52l-874.93 359.35z"/>
    <g clip-path="url(#id0)">
     <g>
      <path id="1" fill="#A8D171" d="M5392.52 5231.84l22.51 -283.42c1.47,-18.46 -12.45,-33.63 -30.92,-33.7l-0.01 0c-18.47,-0.07 -34.78,14.97 -36.25,33.44l-15.99 201.36 -247.33 -335.66c-15.4,-20.9 -45.09,-25.39 -65.98,-10l-0.01 0.01c-20.9,15.4 -25.4,45.08 -10,65.98l1213.73 1647.2c15.4,20.9 45.09,25.39 65.99,9.99l0 0c20.9,-15.4 25.4,-45.08 10,-65.98l-905.74 -1229.22z"/>
     </g>
    </g>
    <path fill="none" d="M5000.58 5691.44c0,0 -473.92,-703.06 -78.12,-973.87 395.8,-270.81 953.05,614.52 953.05,614.52l-874.93 359.35z"/>
    <path fill="#F8DF6E" d="M5979.66 5181.07c0,0 -609.32,-1708.2 151.03,-2041.5 760.36,-333.31 661.41,1374.89 661.41,1374.89 0,0 302.07,-3713.25 1328.03,-3687.21 1025.97,26.03 -46.83,3044.01 -46.83,3044.01 0,0 650.97,-2080.57 1369.66,-1908.7 718.69,171.87 -345.14,2494.94 -880.12,2984.12 -534.98,489.18 -2583.18,234.39 -2583.18,234.39z"/>
    <g clip-path="url(#id1)">
     <g>
      <path id="1" fill="#A8D171" d="M5910.3 3668.47l0.01 0c13.77,-12.31 35.7,-11.65 48.74,1.47l282.28 284.02 -78.74 -668.23c-3.04,-25.78 15.56,-49.34 41.34,-52.39l0.01 0c25.78,-3.03 49.35,15.56 52.39,41.35l132.22 1122.05 267.61 -269.25c13.03,-13.12 34.97,-13.78 48.74,-1.47l0.01 0c13.77,12.32 14.37,33.12 1.33,46.23l-307.67 309.56 97.21 824.89c3.04,25.78 -15.56,49.35 -41.35,52.39l0 0c-25.78,3.03 -49.35,-15.56 -52.39,-41.34l-150.11 -1273.82c-9.46,0.2 -18.98,-3.26 -25.96,-10.28l-317 -318.94c-13.04,-13.12 -12.44,-33.92 1.33,-46.24z"/>
      <path fill="#A8D171" d="M8015.37 1720.74l0.94 -1.29 253.16 -371.64c10.42,-15.29 6.01,-35.63 -9.78,-45.21l-0.01 0c-15.79,-9.58 -37.24,-4.91 -47.65,10.38l-158.41 232.55 124.13 -568.72c4.89,-22.38 -9.42,-44.69 -31.82,-49.58l0 0c-22.39,-4.89 -44.7,9.42 -49.59,31.81l-316.44 1449.82 -215.54 -316.41c-10.41,-15.29 -31.85,-19.96 -47.64,-10.39l-0.01 0.01c-15.8,9.57 -20.2,29.92 -9.79,45.2l253.17 371.65 0.12 0.16 -220.32 1009.41 -269.26 -270.9c-13.04,-13.12 -34.97,-13.78 -48.74,-1.48l0 0.01c-13.78,12.31 -14.38,33.11 -1.34,46.24l302.31 304.15 -367.49 1683.67c-4.89,22.39 9.43,44.7 31.82,49.59l0 0c22.4,4.88 44.7,-9.43 49.59,-31.82l132.64 -607.7 299.72 -301.57c13.05,-13.11 12.45,-33.92 -1.32,-46.23l-0.01 0c-13.77,-12.32 -35.71,-11.65 -48.75,1.47l-223.03 224.39 38.94 -178.41 304.26 -306.12c13.04,-13.11 12.44,-33.92 -1.33,-46.23l-0.01 0c-13.77,-12.32 -35.71,-11.65 -48.75,1.47l-227.55 228.95 485.49 -2224.34c5.75,-2.59 10.84,-6.68 14.55,-12.12l253.16 -371.64c10.42,-15.29 6.01,-35.63 -9.78,-45.21l-0.01 0c-15.79,-9.58 -37.24,-4.91 -47.65,10.38l-174.96 256.85 32.98 -151.15z"/>
      <path fill="#A8D171" d="M9089.86 2942.73l358.87 -267.21c14.84,-11.04 17.32,-31.7 5.53,-45.92l-0.01 0c-11.8,-14.22 -33.59,-16.81 -48.43,-5.76l-246.24 183.34 318.52 -619.24c10.48,-20.38 2.39,-45.62 -17.99,-56.1l-0.01 -0.01c-20.38,-10.48 -45.61,-2.39 -56.1,17.99l-606.74 1179.58 -80.55 -350.99c-4.14,-18.03 -22.41,-30.19 -40.61,-27.01l-0.01 0c-18.2,3.17 -29.69,20.52 -25.56,38.55l99.13 431.98 -1364.05 2651.85c-10.48,20.38 -2.38,45.62 18,56.1l0 0c20.38,10.48 45.62,2.39 56.1,-17.99l920.38 -1789.3 392.81 -200.01c16.49,-8.39 22.41,-28.34 13.17,-44.33l0 -0.01c-9.24,-16 -30.29,-22.21 -46.77,-13.82l-306.75 156.18 527.53 -1025.57 338.29 -251.88c14.84,-11.05 17.32,-31.71 5.53,-45.92l-0.01 -0.01c-11.8,-14.21 -33.59,-16.8 -48.43,-5.76l-225.66 168.02 60.06 -116.75z"/>
     </g>
    </g>
    <path fill="none" d="M5979.66 5181.07c0,0 -609.32,-1708.2 151.03,-2041.5 760.36,-333.31 661.41,1374.89 661.41,1374.89 0,0 302.07,-3713.25 1328.03,-3687.21 1025.97,26.03 -46.83,3044.01 -46.83,3044.01 0,0 650.97,-2080.57 1369.66,-1908.7 718.69,171.87 -345.14,2494.94 -880.12,2984.12 -534.98,489.18 -2583.18,234.39 -2583.18,234.39z"/>
   </g>
   <path fill="#1E5343" d="M4406.46 6746.14c0,0 -208.31,1729.03 -124.98,3228.9 83.32,1499.88 1760.27,1718.61 4385.05,1718.61 2624.79,0 3728.87,-572.86 3728.87,-1479.04 0,-906.18 -10.43,-2645.62 -41.67,-3051.83 -31.24,-406.22 -927.01,-479.13 -7947.27,-416.64z"/>
   <g clip-path="url(#id2)">
    <g>
     <path id="1" fill="#3B6559" d="M5439.63 10510.09c0,0 1354.05,-1385.31 2656.03,-1817.56 1301.98,-432.25 -192.69,786.4 -864.51,1218.65 -671.82,432.26 -2484.17,1317.6 -1791.52,598.91z"/>
     <path fill="#3B6559" d="M7548.8 10197.63c0,0 1791.52,-1807.14 2359.18,-1760.27 567.66,46.86 -72.91,775.97 -552.04,1104.07 -479.13,328.1 -2676.86,1426.97 -1807.14,656.2z"/>
    </g>
   </g>
   <path fill="none" d="M4406.46 6746.14c0,0 -208.31,1729.03 -124.98,3228.9 83.32,1499.88 1760.27,1718.61 4385.05,1718.61 2624.79,0 3728.87,-572.86 3728.87,-1479.04 0,-906.18 -10.43,-2645.62 -41.67,-3051.83 -31.24,-406.22 -927.01,-479.13 -7947.27,-416.64z"/>
   <g>
    <path fill="#F79433" d="M1475.52 2549.94c23.43,308.57 -35.16,1113.2 503.86,1058.51 539.02,-54.68 1038.98,-167.95 1003.83,-445.28 -31.96,-252.16 -41.33,-878.84 -177.84,-1019.86 260.97,-81.08 443.74,-327.99 281.1,-391.95 -142.69,-56.11 -277.46,253.62 -321.16,366.36 -1.57,-0.46 -3.13,-0.99 -4.74,-1.33 -205.79,-44.74 -1309.85,107.14 -1285.05,433.55zm1310.84 -422.5c-2.17,-1.4 -4.38,-2.67 -6.61,-3.85 17.6,-49.28 148.4,-399.82 287.97,-344.93 148.32,58.33 -36.11,292.88 -281.36,348.78z"/>
    <g clip-path="url(#id3)">
     <g>
      <path id="1" fill="#F8DF6E" d="M2084.1 1885.66c0,0 105.46,753.84 167.96,996.01 0,0 -394.51,234.37 -714.8,164.05 -320.28,-70.31 -406.21,-7.81 -406.21,-7.81 0,0 281.23,-855.4 953.05,-1152.25z"/>
      <path fill="#F8DF6E" d="M2420.01 3877.68c0,0 -105.46,-753.84 -167.95,-996.01 0,0 339.82,-132.8 660.11,-62.5 320.28,70.31 406.21,7.81 406.21,7.81 0,0 -226.55,753.85 -898.37,1050.7z"/>
     </g>
    </g>
    <path fill="none" d="M1475.52 2549.94c23.43,308.57 -35.16,1113.2 503.86,1058.51 539.02,-54.68 1038.98,-167.95 1003.83,-445.28 -31.96,-252.16 -41.33,-878.84 -177.84,-1019.86 260.97,-81.08 443.74,-327.99 281.1,-391.95 -142.69,-56.11 -277.46,253.62 -321.16,366.36 -1.57,-0.46 -3.13,-0.99 -4.74,-1.33 -205.79,-44.74 -1309.85,107.14 -1285.05,433.55zm1310.84 -422.5c-2.17,-1.4 -4.38,-2.67 -6.61,-3.85 17.6,-49.28 148.4,-399.82 287.97,-344.93 148.32,58.33 -36.11,292.88 -281.36,348.78z"/>
    <path fill="#F8DF6E" d="M5055.92 2467.09c-77.23,-87.66 -300.48,-294.31 -722.15,-343.2 0,0 -277.32,367.16 124.99,605.42 264.35,156.56 437.63,60.15 535.36,-56.51l0.01 -0.01c168.23,-44.74 77.86,-310.7 445.01,-1130.94 367.16,-820.24 664.02,-796.79 726.52,-863.19 62.49,-66.4 -82.03,-58.59 -82.03,-58.59 -369.12,101.52 -742.13,804.6 -886.65,1425.64 -43.91,188.69 -95.37,324.65 -141.06,421.38z"/>
    <g clip-path="url(#id4)">
     <g>
      <path id="1" fill="#F79433" d="M4302.53 1995l31.24 128.89c0,0 30.81,433.03 722.15,343.2 39.06,-300.77 78.56,-339.3 -753.39,-472.09z"/>
     </g>
    </g>
    <path fill="none" d="M5055.92 2467.09c-77.23,-87.66 -300.48,-294.31 -722.15,-343.2 0,0 -277.32,367.16 124.99,605.42 264.35,156.56 437.63,60.15 535.36,-56.51l0.01 -0.01c168.23,-44.74 77.86,-310.7 445.01,-1130.94 367.16,-820.24 664.02,-796.79 726.52,-863.19 62.49,-66.4 -82.03,-58.59 -82.03,-58.59 -369.12,101.52 -742.13,804.6 -886.65,1425.64 -43.91,188.69 -95.37,324.65 -141.06,421.38z"/>
    <g>
     <rect fill="#F79433" transform="matrix(0.566804 0.165607 -0.165607 0.566804 8246.42 100.513)" width="5318.12" height="291.04" rx="145.52" ry="145.52"/>
     <path fill="#F8DF6E" d="M8802.27 36.41l2024.59 591.54c65.98,19.28 104.19,89.04 84.91,155.02l-100.04 342.41c-19.28,65.98 -89.04,104.19 -155.02,84.91l-2024.58 -591.53c-65.98,-19.28 -104.2,-89.04 -84.92,-155.02l100.05 -342.41c19.28,-65.98 89.03,-104.19 155.01,-84.92z"/>
     <g clip-path="url(#id5)">
      <g>
       <g>
        <path id="1" fill="#FAAA59" d="M12277 1415.39c-318.32,-162.23 -659.22,-320.06 -984.97,-481.15 -585.44,-289.52 -1086.28,-408.26 -1713.13,-588.91 -576.88,-166.25 -1182.15,-253.15 -1736.92,-195.13 458.17,-59.38 1085.11,5.2 1577.58,138.43 634,171.51 1302.2,347.03 1882.7,632.45 326.4,160.49 668.27,317.92 987.22,479.65 6.57,3.43 9.11,9.49 5.67,13.54 -3.45,4.05 -11.57,4.55 -18.15,1.12z"/>
       </g>
       <path fill="none" d="M12283.24 1408.06c-264.51,-137.96 -584.11,-273.36 -862.18,-417.66 -676.03,-350.83 -1098.05,-433.54 -1840.57,-650.49 -474.4,-138.61 -583.62,-143.28 -1069.65,-196.78 -176.75,-19.46 -503.61,-25.25 -668.86,7.07"/>
       <g>
        <path fill="#FAAA59" d="M11340.44 1281.71c-318.32,-162.22 -659.23,-320.05 -984.97,-481.14 -585.44,-289.52 -1086.28,-408.26 -1713.13,-588.91 -576.89,-166.25 -1182.15,-253.15 -1736.92,-195.13 458.17,-59.38 1085.11,5.2 1577.58,138.43 634,171.51 1302.2,347.03 1882.7,632.45 326.4,160.48 668.26,317.92 987.21,479.65 6.58,3.43 9.12,9.49 5.67,13.54 -3.44,4.04 -11.57,4.54 -18.14,1.11z"/>
       </g>
       <path fill="none" d="M11346.67 1274.39c-264.5,-137.96 -584.1,-273.36 -862.17,-417.66 -676.03,-350.83 -1098.05,-433.54 -1840.58,-650.49 -474.4,-138.61 -583.61,-143.28 -1069.64,-196.79 -176.76,-19.45 -503.61,-25.24 -668.86,7.08"/>
       <g>
        <path fill="#FAAA59" d="M7036.62 -452.51c318.32,162.23 659.22,320.06 984.97,481.15 585.44,289.52 1086.28,408.26 1713.13,588.91 576.88,166.25 1182.15,253.15 1736.92,195.13 -458.17,59.38 -1085.11,-5.2 -1577.58,-138.43 -634,-171.51 -1302.2,-347.03 -1882.7,-632.45 -326.4,-160.49 -668.26,-317.92 -987.21,-479.65 -6.58,-3.43 -9.12,-9.49 -5.68,-13.54 3.45,-4.05 11.58,-4.54 18.15,-1.12z"/>
       </g>
       <path fill="none" d="M7030.38 -445.18c264.51,137.96 584.11,273.36 862.18,417.66 676.03,350.83 1098.05,433.54 1840.57,650.49 474.41,138.61 583.62,143.28 1069.65,196.78 176.76,19.46 503.61,25.25 668.86,-7.07"/>
       <g>
        <path fill="#FAAA59" d="M7269.17 -210.4c318.32,162.22 659.22,320.05 984.97,481.14 585.44,289.52 1086.28,408.26 1713.13,588.91 576.88,166.25 1182.15,253.15 1736.92,195.13 -458.17,59.38 -1085.11,-5.2 -1577.58,-138.43 -634,-171.51 -1302.2,-347.03 -1882.7,-632.45 -326.4,-160.49 -668.27,-317.92 -987.22,-479.65 -6.57,-3.43 -9.11,-9.49 -5.67,-13.54 3.45,-4.04 11.57,-4.54 18.15,-1.11z"/>
       </g>
       <path fill="none" d="M7262.93 -203.08c264.51,137.96 584.11,273.36 862.18,417.66 676.03,350.83 1098.05,433.54 1840.57,650.49 474.4,138.61 583.62,143.28 1069.65,196.78 176.75,19.46 503.61,25.25 668.86,-7.07"/>
       <g>
        <path fill="#FAAA59" d="M7960.21 -492.77c318.32,162.22 659.22,320.06 984.97,481.15 585.44,289.52 1086.28,408.25 1713.13,588.9 576.88,166.25 1182.15,253.15 1736.92,195.13 -458.17,59.38 -1085.11,-5.19 -1577.58,-138.42 -634,-171.51 -1302.2,-347.03 -1882.7,-632.45 -326.4,-160.49 -668.27,-317.93 -987.22,-479.66 -6.57,-3.43 -9.11,-9.49 -5.67,-13.53 3.45,-4.05 11.57,-4.55 18.15,-1.12z"/>
       </g>
       <path fill="none" d="M7953.97 -485.44c264.51,137.96 584.11,273.35 862.18,417.66 676.03,350.83 1098.05,433.54 1840.57,650.49 474.4,138.61 583.62,143.27 1069.65,196.78 176.75,19.46 503.6,25.25 668.86,-7.08"/>
       <g>
        <path fill="#FAAA59" d="M8192.76 -250.67c318.32,162.22 659.22,320.06 984.97,481.15 585.44,289.52 1086.27,408.25 1713.13,588.9 576.88,166.25 1182.15,253.15 1736.92,195.13 -458.17,59.38 -1085.11,-5.19 -1577.58,-138.42 -634,-171.51 -1302.2,-347.03 -1882.7,-632.45 -326.4,-160.49 -668.27,-317.93 -987.22,-479.66 -6.57,-3.43 -9.11,-9.49 -5.67,-13.53 3.45,-4.05 11.57,-4.55 18.15,-1.12z"/>
       </g>
       <path fill="none" d="M8186.52 -243.34c264.51,137.96 584.11,273.35 862.17,417.66 676.04,350.83 1098.05,433.54 1840.58,650.49 474.4,138.61 583.62,143.27 1069.65,196.78 176.75,19.46 503.6,25.25 668.86,-7.08"/>
       <g>
        <path fill="#FAAA59" d="M11353.41 1455.65c-318.32,-162.22 -659.22,-320.06 -984.97,-481.15 -585.44,-289.52 -1086.27,-408.25 -1713.13,-588.9 -576.88,-166.25 -1182.15,-253.15 -1736.91,-195.13 458.16,-59.38 1085.1,5.19 1577.58,138.42 633.99,171.51 1302.19,347.03 1882.69,632.45 326.4,160.49 668.27,317.93 987.22,479.66 6.57,3.43 9.11,9.49 5.67,13.53 -3.45,4.05 -11.57,4.55 -18.15,1.12z"/>
       </g>
       <path fill="none" d="M11359.65 1448.32c-264.51,-137.96 -584.11,-273.35 -862.17,-417.66 -676.04,-350.83 -1098.05,-433.54 -1840.58,-650.49 -474.4,-138.61 -583.62,-143.27 -1069.65,-196.78 -176.75,-19.46 -503.6,-25.25 -668.85,7.08"/>
       <g>
        <path fill="#FAAA59" d="M10416.85 1321.98c-318.32,-162.22 -659.22,-320.06 -984.97,-481.15 -585.44,-289.52 -1086.28,-408.25 -1713.13,-588.9 -576.88,-166.25 -1182.15,-253.15 -1736.92,-195.13 458.17,-59.38 1085.11,5.19 1577.58,138.42 634,171.51 1302.2,347.03 1882.7,632.45 326.4,160.49 668.26,317.93 987.21,479.66 6.58,3.43 9.12,9.49 5.68,13.53 -3.45,4.05 -11.58,4.55 -18.15,1.12z"/>
       </g>
       <path fill="none" d="M10423.09 1314.65c-264.51,-137.96 -584.11,-273.35 -862.18,-417.66 -676.03,-350.83 -1098.05,-433.54 -1840.57,-650.49 -474.4,-138.61 -583.62,-143.27 -1069.65,-196.78 -176.76,-19.46 -503.61,-25.25 -668.86,7.08"/>
       <rect fill="#F58634" transform="matrix(0.566804 0.165607 -0.1104 0.377852 8956.94 -47.2698)" width="59.53" height="2037.3"/>
       <rect fill="#F58634" transform="matrix(0.566804 0.165607 -0.1104 0.377852 10704.1 463.2)" width="59.53" height="2037.3"/>
      </g>
     </g>
     <path fill="none" d="M8802.27 36.41l2024.59 591.54c65.98,19.28 104.19,89.04 84.91,155.02l-100.04 342.41c-19.28,65.98 -89.04,104.19 -155.02,84.91l-2024.58 -591.53c-65.98,-19.28 -104.2,-89.04 -84.92,-155.02l100.05 -342.41c19.28,-65.98 89.03,-104.19 155.01,-84.92z"/>
    </g>
    <path fill="#F79433" d="M16052.71 4432.91c0,0 492.2,313.66 701.77,365.57 -31.03,64.44 -125.49,280.01 -50.65,374.66 86.06,108.84 277.88,-121.87 78.04,-371.64 237.47,-14.43 1046.86,-944.76 723.83,-1212.27 -333.3,-276.02 -927,322.9 -942.63,374.97 -15.62,52.08 96.34,-322.9 -46.87,-346.33 -143.21,-23.43 -322.89,13.02 -463.49,815.04zm712.26 376.47c0,0 -127.66,241.88 -51.51,338.19 76.15,96.31 248.6,-116.46 51.51,-338.19z"/>
    <g clip-path="url(#id6)">
     <g>
      <path id="1" fill="#F8DF6E" d="M16836.47 4185.53c0,0 -78.12,205.72 15.62,213.53 93.74,7.81 70.31,-231.75 70.31,-231.75 0,0 182.28,143.22 252.58,33.85 70.31,-109.37 -210.92,-106.76 -210.92,-106.76 0,0 221.33,-96.34 182.28,-179.68 -39.06,-83.33 -236.96,117.18 -242.17,158.84 -5.21,41.67 44.27,-182.27 -49.48,-203.11 -93.74,-20.83 -33.84,195.3 -26.03,218.74 7.81,23.44 -234.36,-33.85 -239.57,122.39 -5.21,156.23 247.38,-26.05 247.38,-26.05z"/>
     </g>
    </g>
    <path fill="none" d="M16052.71 4432.91c0,0 492.2,313.66 701.77,365.57 -31.03,64.44 -125.49,280.01 -50.65,374.66 86.06,108.84 277.88,-121.87 78.04,-371.64 237.47,-14.43 1046.86,-944.76 723.83,-1212.27 -333.3,-276.02 -927,322.9 -942.63,374.97 -15.62,52.08 96.34,-322.9 -46.87,-346.33 -143.21,-23.43 -322.89,13.02 -463.49,815.04zm712.26 376.47c0,0 -127.66,241.88 -51.51,338.19 76.15,96.31 248.6,-116.46 51.51,-338.19z"/>
    <path fill="#F79433" d="M12741.71 1603.62c0,0 -264.3,180.97 37.76,542.92 302.06,361.95 434.86,401.01 434.86,401.01l588.5 1156.16c0,0 57.28,114.58 156.23,57.29 98.95,-57.29 -41.66,-213.53 -52.08,-234.36 -10.41,-20.83 -624.95,-1054.6 -624.95,-1054.6 0,0 -44.31,-1150.99 -540.32,-868.42zm63.71 -2.06c0,0 315.09,-49.47 437.47,617.14 0,0 -65.11,-713.48 -437.47,-617.14zm-31.25 26.04c0,0 335.91,26.04 476.52,789 0,0 -98.94,-841.07 -476.52,-789zm-10.41 26.04l466.11 809.83c0,0 -110.7,-731.22 -466.11,-809.83zm-31.25 13.03c0,0 455.69,755.14 484.34,822.84 28.64,67.7 -471.92,-448.25 -484.34,-822.84zm-29.9 18.92c0,0 -192.72,316.35 481.71,813.71 0,0 -489.54,-418.36 -481.71,-813.71z"/>
    <g clip-path="url(#id7)">
     <g>
      <rect fill="#F8DF6E" transform="matrix(0.952847 -0.322208 0.189158 0.559385 12997.8 2907.64)" width="1040.7" height="2125.49"/>
     </g>
    </g>
    <path fill="none" d="M12741.71 1603.62c0,0 -264.3,180.97 37.76,542.92 302.06,361.95 434.86,401.01 434.86,401.01l588.5 1156.16c0,0 57.28,114.58 156.23,57.29 98.95,-57.29 -41.66,-213.53 -52.08,-234.36 -10.41,-20.83 -624.95,-1054.6 -624.95,-1054.6 0,0 -44.31,-1150.99 -540.32,-868.42zm63.71 -2.06c0,0 315.09,-49.47 437.47,617.14 0,0 -65.11,-713.48 -437.47,-617.14zm-31.25 26.04c0,0 335.91,26.04 476.52,789 0,0 -98.94,-841.07 -476.52,-789zm-10.41 26.04l466.11 809.83c0,0 -110.7,-731.22 -466.11,-809.83zm-31.25 13.03c0,0 455.69,755.14 484.34,822.84 28.64,67.7 -471.92,-448.25 -484.34,-822.84zm-29.9 18.92c0,0 -192.72,316.35 481.71,813.71 0,0 -489.54,-418.36 -481.71,-813.71z"/>
   </g>
   <g>
    <path fill="#E68B6C" d="M2553.08 6427.13c0,0 23.43,-138.02 16.93,-166.66 -6.51,-28.64 -230.49,-95.06 -290.38,-483.05 -59.9,-387.99 367.15,-361.96 367.15,-361.96 0,0 481.73,-26.04 554.64,5.21 72.92,31.25 156.24,124.99 153.64,182.28 -2.6,57.29 -117.18,182.28 -200.5,158.84 0,0 20.83,263 5.2,309.87 -15.62,46.88 -47.71,310.66 -333.31,236.97 0,0 36.43,145.81 58.57,177.06 22.14,31.25 20.83,109.36 20.83,109.36 0,0 -121.08,-19.52 -352.77,-167.92z"/>
    <g clip-path="url(#id8)">
     <g>
      <path id="1" fill="#FA7346" d="M2618.11 6152.37c0,0 35.14,134.1 197.89,178.37 162.75,44.27 76.82,11.72 76.82,11.72l-66.37 -33.83c0,0 -83.18,-33.01 -208.34,-156.26z"/>
      <path fill="#FEFEFE" d="M3132.17 6110.7c0,0 -152.34,55.98 -334.61,-7.82 0,0 -13.02,109.37 177.07,104.16 0,0 177.07,9.12 157.54,-96.34z"/>
      <path fill="#FA7346" d="M2534.78 5936.24c0,0 -42.97,49.48 -5.21,84.63 37.75,35.15 35.15,-23.44 5.21,-84.63z"/>
      <path fill="#BC0E25" d="M3207.87 5817.74l-53.31 -55.95c0,0 -27.42,-13.06 -20.25,-65.14 0,0 -130.87,85.94 -263.67,-24.73 0,0 -76.82,147.12 -266.91,54.68 0,0 80.68,173.15 -22.18,183.57 0,0 -135.41,-57.29 -110.67,79.42 24.73,136.71 101.55,78.12 101.55,78.12 0,0 29.51,192.84 -6.07,186.91 -35.59,-5.94 -586.34,-76.26 -463.96,-477.27 122.39,-401 645.78,-744.73 963.46,-627.55 317.69,117.18 609.33,531.2 142.01,667.94z"/>
     </g>
    </g>
    <path fill="none" d="M2553.08 6427.13c0,0 23.43,-138.02 16.93,-166.66 -6.51,-28.64 -230.49,-95.06 -290.38,-483.05 -59.9,-387.99 367.15,-361.96 367.15,-361.96 0,0 481.73,-26.04 554.64,5.21 72.92,31.25 156.24,124.99 153.64,182.28 -2.6,57.29 -117.18,182.28 -200.5,158.84 0,0 20.83,263 5.2,309.87 -15.62,46.88 -47.71,310.66 -333.31,236.97 0,0 36.43,145.81 58.57,177.06 22.14,31.25 20.83,109.36 20.83,109.36 0,0 -121.08,-19.52 -352.77,-167.92z"/>
    <path fill="#FEFEFE" d="M2864.78 11609.7c-409.34,6.77 -489.54,26.03 -473.92,-111.97 15.63,-138.01 54.69,-174.47 26.05,-169.26 -28.65,5.21 -117.18,0 -138.02,-106.76 -20.83,-106.76 -182.33,-1015.53 -161.5,-1203.02 20.83,-187.48 -171.86,-1208.23 -62.49,-1479.04 0,0 -54.71,-213.54 -5.24,-283.84 0,0 -492.18,-330.7 -518.22,-679.64 -26.03,-348.93 343.72,-984.29 677.03,-1067.62 0,0 7.81,-32.55 55.98,-46.87 48.17,-14.32 268.21,-122.39 311.18,-104.16 42.96,18.23 214.82,101.54 242.16,154.92 0,0 46.88,28.64 45.57,6.51 -1.3,-22.13 -20.83,-84.64 -2.6,-97.65 18.23,-13.02 339.82,71.61 341.12,119.78 1.3,48.18 140.61,89.84 217.43,186.18 76.82,96.35 203.1,226.55 235.65,295.55 32.56,69 -102.86,-635.38 -50.78,-679.65 52.07,-44.27 45.56,-33.86 46.21,-46.22 0.65,-12.37 -5.85,-72.25 -18.87,-81.37 -13.03,-9.12 -214.84,-111.97 -105.47,-300.76 0,0 26.04,-10.41 33.86,37.76 7.81,48.17 82.02,143.22 115.87,105.46 33.85,-37.76 7.81,-117.18 -117.18,-162.75 -124.99,-45.57 125,-57.28 154.94,-46.87 29.95,10.42 80.72,49.48 88.54,66.4 7.81,16.93 96.34,-134.12 179.67,-134.12 83.32,0 -97.65,256.49 -114.58,365.86 -16.92,109.37 1.31,109.37 1.31,109.37 0,0 44.27,-14.33 55.98,14.32 11.72,28.64 368.48,842.38 128.92,1128.81 -239.56,286.44 -583.28,39.06 -583.28,39.06 0,0 289.03,877.57 229.14,1088.48 0,0 -7.82,49.49 28.63,148.44 36.46,98.95 229.14,2221.17 166.64,2512.81 0,0 6.51,62.49 -130.2,50.78 0,0 316.38,222.63 251.28,282.52 -65.1,59.89 -601.52,91.13 -718.69,28.64 -117.18,-62.49 54.67,-239.56 36.45,-276.02 -18.23,-36.46 -96.34,-5.21 -109.36,-44.27 -13.02,-39.05 -106.77,-851.5 -111.97,-994.71 -5.21,-143.21 -10.42,1036.38 -122.39,1044.19 -111.97,7.81 -127.6,7.81 -98.95,23.44 113.42,61.86 383.45,300.52 -25.9,307.29z"/>
    <g clip-path="url(#id9)">
     <g>
      <path id="1" fill="#E68B6C" d="M3339.18 5710.88c0,0 -33.86,502.57 132.8,575.48 166.66,72.91 178.41,10.58 178.41,10.58 0,0 81.17,27.56 211.78,-51.4 130.6,-78.97 310.27,-617.99 310.27,-617.99 0,0 -466.1,-231.75 -833.26,83.33z"/>
      <path fill="#E68B6C" d="M2136.16 8219.8c0,0 187.49,-122.38 252.59,-252.58 0,0 178.37,118.48 134.1,126.29 -44.27,7.82 -130.2,-3.91 -121.08,6.51 9.11,10.42 235.66,167.96 177.07,230.46 -58.59,62.49 -229.15,58.59 -442.68,-110.68z"/>
      <path fill="#C8C5E2" d="M1977.9 8469.95c0,0 533.81,387.99 1661.32,83.32 0,0 -1078.03,523.4 -1661.32,-83.32z"/>
      <path fill="#C8C5E2" d="M3162.6 8915.21c0,0 49.92,727.76 -53.15,1332.55l11.48 503.25c0,0 247.36,-1187.41 41.67,-1835.8z"/>
      <path fill="#C8C5E2" d="M2960.43 10019.16c0,0 -257.8,-54.68 -200.51,231.76 57.29,286.43 387.44,-292.71 200.51,-231.76z"/>
      <path fill="#C8C5E2" d="M3747.94 9973.36c0,0 -194.34,-54.68 -151.15,231.76 43.19,286.43 292.06,-292.71 151.15,-231.76z"/>
      <path fill="#C8C5E2" d="M2774.57 6912.77c0,0 264.09,1566.22 285.68,1746.57 21.58,180.35 -103.41,-1533.05 -285.68,-1746.57z"/>
      <path fill="#C8C5E2" d="M2110.55 7592.4c0,0 265.61,302.06 260.4,385.39 -5.21,83.32 151.03,-67.7 -260.4,-385.39z"/>
      <path fill="#C8C5E2" d="M2045.43 8226.46c0,0 75.51,-5.21 130.2,-37.76 54.68,-32.55 -161.45,173.17 -130.2,37.76z"/>
      <circle fill="#C8C5E2" transform="matrix(0.429123 -0.142939 0.186614 0.560239 2915.67 6986.26)" r="84.88"/>
      <circle fill="#C8C5E2" transform="matrix(0.429123 -0.142939 0.186614 0.560239 2981.96 7315.51)" r="84.88"/>
      <circle fill="#C8C5E2" transform="matrix(0.429123 -0.142939 0.186614 0.560239 3030.53 7644.77)" r="84.88"/>
      <circle fill="#C8C5E2" transform="matrix(0.429123 -0.142939 0.186614 0.560239 3090.92 7974.03)" r="84.88"/>
      <circle fill="#C8C5E2" transform="matrix(0.429123 -0.142939 0.186614 0.560239 3145.4 8303.29)" r="84.88"/>
      <path fill="#C8C5E2" d="M2226.12 7107.13c0,0 -114.57,335.91 -117.18,424.44 -2.6,88.54 -75.51,-96.34 -75.51,-119.78 0,-23.44 75.51,-109.37 192.69,-304.66z"/>
      <path fill="#ED1B24" d="M2135.19 6434.93c0,0 96.35,205.71 661.41,164.05 0,0 -26.04,52.07 83.32,54.68 0,0 -111.97,59.89 -128.9,227.85 0,0 141.92,2.6 180.98,-152.33 0,0 14.32,145.82 166.65,203.1 0,0 -19.53,-227.85 -123.68,-282.53 0,0 61.18,-27.34 19.52,-75.51 0,0 186.19,23.44 303.37,-37.76 117.17,-61.19 -522.09,-488.26 -1162.67,-101.55z"/>
      <path fill="#F79433" d="M2101.05 11347.17c0,0 203.74,-20.06 319.3,-19.14 115.55,0.91 281.91,-53.45 457.83,-35.38 175.91,18.07 424.55,-16.78 455.17,-18.89 30.61,-2.11 104.81,-62.97 430.96,-35.14 326.16,27.83 677.69,181.46 677.69,181.46 0,0 -348.93,585.89 -445.28,585.89 -96.34,0 -1804.54,-127.59 -1804.54,-127.59 0,0 -91.13,-291.65 -91.13,-531.21z"/>
     </g>
    </g>
    <path fill="none" d="M2864.78 11609.7c-409.34,6.77 -489.54,26.03 -473.92,-111.97 15.63,-138.01 54.69,-174.47 26.05,-169.26 -28.65,5.21 -117.18,0 -138.02,-106.76 -20.83,-106.76 -182.33,-1015.53 -161.5,-1203.02 20.83,-187.48 -171.86,-1208.23 -62.49,-1479.04 0,0 -54.71,-213.54 -5.24,-283.84 0,0 -492.18,-330.7 -518.22,-679.64 -26.03,-348.93 343.72,-984.29 677.03,-1067.62 0,0 7.81,-32.55 55.98,-46.87 48.17,-14.32 268.21,-122.39 311.18,-104.16 42.96,18.23 214.82,101.54 242.16,154.92 0,0 46.88,28.64 45.57,6.51 -1.3,-22.13 -20.83,-84.64 -2.6,-97.65 18.23,-13.02 339.82,71.61 341.12,119.78 1.3,48.18 140.61,89.84 217.43,186.18 76.82,96.35 203.1,226.55 235.65,295.55 32.56,69 -102.86,-635.38 -50.78,-679.65 52.07,-44.27 45.56,-33.86 46.21,-46.22 0.65,-12.37 -5.85,-72.25 -18.87,-81.37 -13.03,-9.12 -214.84,-111.97 -105.47,-300.76 0,0 26.04,-10.41 33.86,37.76 7.81,48.17 82.02,143.22 115.87,105.46 33.85,-37.76 7.81,-117.18 -117.18,-162.75 -124.99,-45.57 125,-57.28 154.94,-46.87 29.95,10.42 80.72,49.48 88.54,66.4 7.81,16.93 96.34,-134.12 179.67,-134.12 83.32,0 -97.65,256.49 -114.58,365.86 -16.92,109.37 1.31,109.37 1.31,109.37 0,0 44.27,-14.33 55.98,14.32 11.72,28.64 368.48,842.38 128.92,1128.81 -239.56,286.44 -583.28,39.06 -583.28,39.06 0,0 289.03,877.57 229.14,1088.48 0,0 -7.82,49.49 28.63,148.44 36.46,98.95 229.14,2221.17 166.64,2512.81 0,0 6.51,62.49 -130.2,50.78 0,0 316.38,222.63 251.28,282.52 -65.1,59.89 -601.52,91.13 -718.69,28.64 -117.18,-62.49 54.67,-239.56 36.45,-276.02 -18.23,-36.46 -96.34,-5.21 -109.36,-44.27 -13.02,-39.05 -106.77,-851.5 -111.97,-994.71 -5.21,-143.21 -10.42,1036.38 -122.39,1044.19 -111.97,7.81 -127.6,7.81 -98.95,23.44 113.42,61.86 383.45,300.52 -25.9,307.29z"/>
    <path fill="#FEFEFE" d="M2385.46 5488.62c0,0 -25.32,-31.59 -69.58,-445.62 0,0 -338.51,91.15 -304.66,-156.23 33.85,-247.38 372.36,-78.13 372.36,-78.13 0,0 -98.95,-218.73 59.89,-278.62 158.84,-59.89 281.23,151.03 291.65,203.11 0,0 255.19,-265.6 398.4,-54.68 143.22,210.92 -179.68,330.7 -179.68,330.7l131.18 397.56c0,0 -314.18,136.59 -699.56,81.91z"/>
   </g>
   <g>
    <path fill="#E68B6C" d="M11134.09 3076.97c0,0 41.66,-132.8 26.04,-169.26 -15.63,-36.46 -289.04,127.59 -330.71,-283.83 0,0 -18.22,-174.47 20.84,-268.21 0,0 -140.63,-54.69 -44.28,-153.64 0,0 49.47,-49.47 9.11,-53.38 -40.36,-3.91 -125.01,-158.9 238.24,-129.61 363.25,29.3 581.34,210.9 585.25,256.47 3.9,45.57 66.11,299.42 -205.72,493.45l18.24 270.81c0,0 -127.6,132.81 -317.01,37.2z"/>
    <g clip-path="url(#id10)">
     <g>
      <path id="1" fill="#ED1B24" d="M10662.55 2369.06l187.71 -13.39c0,0 133.87,18.61 338.28,-56.91 0,0 45.57,-7.82 23.44,53.37 -22.13,61.2 -2.6,117.18 186.18,135.41 188.79,18.23 147.13,126.95 126.31,151.68 -20.83,24.74 -45.57,57.29 -85.93,57.29 0,0 -20.47,40.74 -5.68,72.45 14.79,31.71 396.27,-76.36 396.27,-76.36l-26.02 -658.81c0,0 -898.37,-190.09 -921.81,-190.09 -23.43,0 -445.27,234.35 -437.46,260.39 7.82,26.04 218.71,264.97 218.71,264.97z"/>
     </g>
    </g>
    <path fill="none" d="M11134.09 3076.97c0,0 41.66,-132.8 26.04,-169.26 -15.63,-36.46 -289.04,127.59 -330.71,-283.83 0,0 -18.22,-174.47 20.84,-268.21 0,0 -140.63,-54.69 -44.28,-153.64 0,0 49.47,-49.47 9.11,-53.38 -40.36,-3.91 -125.01,-158.9 238.24,-129.61 363.25,29.3 581.34,210.9 585.25,256.47 3.9,45.57 66.11,299.42 -205.72,493.45l18.24 270.81c0,0 -127.6,132.81 -317.01,37.2z"/>
    <path fill="#FEFEFE" d="M10417.82 5774.06c-36.46,-10.42 -52.08,-650.99 -20.83,-723.9 0,0 -78.13,-33.85 -49.48,-111.97 28.64,-78.12 102.85,-630.16 102.85,-630.16 0,0 -348.96,-131.5 -222.66,-464.81 126.29,-333.31 239.56,-618.45 775.97,-772.09 0,0 108.06,-81.37 133.45,-70.3 25.39,11.06 64.45,66.4 87.89,78.12 23.43,11.71 205.04,-98.33 233.69,-94.43 28.64,3.9 70.31,49.47 74.21,65.1 3.9,15.62 136.71,-65.1 136.71,-65.1l52.08 148.42c0,0 497.36,283.79 499.97,736.88 2.6,453.09 -223.94,505.17 -260.4,515.59 -36.45,10.41 158.83,572.85 130.19,614.52 -28.65,41.66 -88.54,91.13 -88.54,91.13 0,0 286.44,1137.93 203.11,1283.76 -83.33,145.82 -1947.76,-62.5 -1788.21,-600.76z"/>
    <g clip-path="url(#id11)">
     <g>
      <path id="1" fill="#C8C5E2" d="M10500.43 4302.07c0,0 645.78,52.08 1036.37,-216.13 0,0 22.78,-42.96 13.67,-89.84 -9.11,-46.87 28,27.34 28.65,41.01 0.65,13.68 35.16,100.91 -26.69,114.58 -61.85,13.67 -329.45,201.15 -928.36,201.15 0,0 -145.82,7.81 -123.64,-50.77z"/>
      <path fill="#C8C5E2" d="M10696.98 3803.4c0,0 361.95,-106.76 570.26,-111.97 0,0 10.42,-408.82 0,-447.88 -10.41,-39.06 18.23,-15.62 23.44,28.64 5.21,44.27 5.21,419.24 5.21,419.24 0,0 85.93,-5.21 111.97,13.02 26.04,18.23 41.66,59.89 41.66,59.89 0,0 -41.66,-39.06 -80.72,-36.46 -39.06,2.61 -697.86,119.79 -671.82,75.52z"/>
      <path fill="#C8C5E2" d="M11226.84 4300.72c0,0 5.22,708.28 -26.03,807.23 -31.25,98.95 33.84,-25.4 33.84,-40.37 0,-14.97 39.07,-747.98 39.07,-747.98 0,0 283.83,218.73 627.55,85.93 0,0 22.14,-19.54 -44.26,-9.12 -66.4,10.42 -356.75,37.76 -571.57,-101.56 0,0 -43.88,-22.63 -58.6,5.87z"/>
      <path fill="#C8C5E2" d="M11026.99 5253.32c0,0 10.41,61.18 111.97,62.49 101.55,1.3 360.64,-26.04 476.52,-53.38 0,0 44.27,346.32 335.91,343.71 0,0 79.43,430.97 82.04,566.38 0,0 29.95,74.21 23.43,-42.97 -6.51,-117.18 -105.45,-755.17 -196.59,-934.84 0,0 83.32,-33.87 124.98,-78.14 0,0 -138.01,111.97 -958.26,136.75z"/>
      <ellipse fill="#C8C5E2" cx="11113.55" cy="3317.02" rx="35.15" ry="37.76"/>
      <ellipse fill="#C8C5E2" cx="10993.75" cy="4596.86" rx="32.55" ry="39.06"/>
      <ellipse fill="#C8C5E2" cx="10956" cy="5027.82" rx="33.85" ry="37.76"/>
      <path fill="#214865" d="M11734.55 3992.69c0,0 65.1,117.18 23.44,121.09 -41.67,3.91 3.91,174.46 -184.88,-395.8l-198.59 -562.48 158.39 -105.88 189.24 -145.41 -0.45 228.73 154.08 449.61 -238.26 100.25 97.03 309.89z"/>
     </g>
     <g clip-path="url(#id12)">
      <g>
       <polygon id="1" fill="#3E668A" points="11824.95,2861.22 11491.64,3660.64 11361.44,3392.43 11629.65,2741.44 "/>
       <polygon fill="#3E668A" points="11843.16,3167.18 11678.82,3726.56 11998.09,3711.4 "/>
       <polygon fill="#74A3CC" points="11512.52,3724.46 11637.52,3682.8 11926.55,3762.22 11806.77,4137.18 11663.55,4203.58 "/>
      </g>
     </g>
     <g clip-path="url(#id13)">
      <path fill="none" d="M11734.55 3992.69c0,0 65.1,117.18 23.44,121.09 -41.67,3.91 3.91,174.46 -184.88,-395.8l-198.59 -562.48 158.39 -105.88 189.24 -145.41 -0.45 228.73 154.08 449.61 -238.26 100.25 97.03 309.89z"/>
      <path fill="#E68B6C" d="M11462.52 3782.56c0,0 72.94,109.08 86.59,204.26 0,0 268.85,-11.57 215.47,-214.68 0,0 -46.88,-110.66 -302.06,10.42z"/>
     </g>
    </g>
    <path fill="none" d="M10417.82 5774.06c-36.46,-10.42 -52.08,-650.99 -20.83,-723.9 0,0 -78.13,-33.85 -49.48,-111.97 28.64,-78.12 102.85,-630.16 102.85,-630.16 0,0 -348.96,-131.5 -222.66,-464.81 126.29,-333.31 239.56,-618.45 775.97,-772.09 0,0 108.06,-81.37 133.45,-70.3 25.39,11.06 64.45,66.4 87.89,78.12 23.43,11.71 205.04,-98.33 233.69,-94.43 28.64,3.9 70.31,49.47 74.21,65.1 3.9,15.62 136.71,-65.1 136.71,-65.1l52.08 148.42c0,0 497.36,283.79 499.97,736.88 2.6,453.09 -223.94,505.17 -260.4,515.59 -36.45,10.41 158.83,572.85 130.19,614.52 -28.65,41.66 -88.54,91.13 -88.54,91.13 0,0 286.44,1137.93 203.11,1283.76 -83.33,145.82 -1947.76,-62.5 -1788.21,-600.76z"/>
    <path fill="#FEFEFE" d="M11083.11 1994.72l-29.78 24.32c0,0 288.57,292.48 585.25,256.47 0,0 83.14,-300.32 90.96,-331.57 7.81,-31.25 41.66,13.02 119.78,32.55 78.12,19.53 266.92,7.8 204.43,-177.08 -62.5,-184.88 -273.42,-106.76 -273.42,-106.76 0,0 164.05,-200.5 46.87,-265.6 -117.18,-65.11 -252.58,7.81 -263,72.9 0,0 -106.76,-231.74 -291.64,-164.04 -184.88,67.7 75.51,338.51 75.51,338.51 0,0 -122.38,174.47 -264.96,320.3z"/>
    <path fill="#BC0E25" d="M10816.53 2763.66c0,0 -61.19,11.71 -49.48,-6.51 11.72,-18.22 135.41,-128.89 222.64,-121.08 87.24,7.81 230.45,136.71 235.66,152.33 5.21,15.63 -27.34,9.11 -49.47,5.21 -22.14,-3.9 -175.28,-69.5 -182.76,-83.82 0,0 -64.14,34.32 -176.59,53.87z"/>
   </g>
   <path fill="#F8F5F5" d="M4563.9 6152.44c0,0 -541.63,281.23 -276.02,869.72 265.6,588.49 880.13,124.98 880.13,124.98 0,0 -208.31,552.05 182.28,697.87 390.59,145.81 677.03,-125 677.03,-125 0,0 -20.83,406.22 458.29,411.43 479.13,5.21 723.91,-218.73 723.91,-218.73 0,0 31.23,393.2 541.61,395.8 510.38,2.61 632.76,-213.52 632.76,-213.52 0,0 70.28,262.99 481.71,273.41 411.42,10.41 723.9,-325.49 723.9,-325.49 0,0 236.93,231.75 624.92,164.04 387.99,-67.71 395.8,-395.8 395.8,-395.8 0,0 117.11,273.41 419.16,260.39 302.06,-13.02 419.24,-343.73 419.24,-343.73 0,0 166.63,132.82 408.8,93.76 242.17,-39.06 354.14,-450.49 354.14,-450.49 0,0 351.52,80.72 479.12,-101.56 127.6,-182.28 28.64,-419.24 -80.72,-492.15 -109.37,-72.91 -239.56,-158.84 -343.72,-195.29 0,0 180.96,-144.52 152.32,-335.91 -28.64,-191.39 -173.18,-329.42 -467.43,-329.42 0,0 83.29,-304.67 -343.76,-473.93 -427.05,-169.26 -648.39,-80.72 -648.39,-80.72 0,0 163.99,-247.38 -145.88,-330.71 -309.87,-83.32 -606.72,190.09 -606.72,190.09 0,0 85.92,-364.55 -195.3,-458.29 -281.23,-93.74 -838.48,239.56 -838.48,239.56 0,0 32.55,-153.62 -63.8,-171.85 -96.35,-18.23 -210.92,170.57 -205.71,279.93 0,0 -27.43,-430.97 -425.83,-472.63 -398.41,-41.66 -541.62,390.58 -541.62,390.58 0,0 46.87,-505.17 -338.52,-494.75 -385.38,10.42 -544.22,322.89 -580.68,492.15 0,0 -52.11,-367.15 -427.08,-346.32 -374.97,20.83 -479.13,463.5 -479.13,463.5 0,0 -278.66,-270.82 -557.28,-135.41 -278.62,135.41 -283.83,515.59 -283.83,515.59 0,0 -406.24,-39.05 -601.55,169.26 -195.3,208.32 -103.67,459.64 -103.67,459.64z"/>
   <g clip-path="url(#id14)">
    <g>
     <path id="1" fill="#A27754" d="M8438.05 5416.77c1238.23,0 2242.01,511.8 2242.01,1143.13 0,631.33 -1003.78,1143.13 -2242.01,1143.13 -1238.22,0 -2242,-511.8 -2242,-1143.13 0,-631.33 1003.78,-1143.13 2242,-1143.13z"/>
    </g>
    <g clip-path="url(#id15)">
     <g>
      <path id="2" fill="#A8D171" d="M11453.23 6092.46l-2907.21 634.74 777.17 1099.49 1650.91 -531.21c0,0 729.11,-932.21 479.13,-1203.02z"/>
      <path fill="#F06E75" d="M6758.37 5520.92c0,0 1999.83,1218.65 2958.09,2187.32l-1572.79 270.81 -2478.96 -895.76c0,0 270.81,-1416.55 1093.66,-1562.37z"/>
      <path fill="#F29272" d="M9398.74 5326.91c0,0 -197.89,806.04 -838.47,1400.33 0,0 1248.24,270.74 2471.13,-233.76 1222.89,-504.5 -1632.66,-1166.57 -1632.66,-1166.57z"/>
     </g>
    </g>
    <g clip-path="url(#id16)">
     <path fill="none" d="M8438.05 5416.77c1238.23,0 2242.01,511.8 2242.01,1143.13 0,631.33 -1003.78,1143.13 -2242.01,1143.13 -1238.22,0 -2242,-511.8 -2242,-1143.13 0,-631.33 1003.78,-1143.13 2242,-1143.13z"/>
    </g>
   </g>
   <path fill="none" d="M4563.9 6152.44c0,0 -541.63,281.23 -276.02,869.72 265.6,588.49 880.13,124.98 880.13,124.98 0,0 -208.31,552.05 182.28,697.87 390.59,145.81 677.03,-125 677.03,-125 0,0 -20.83,406.22 458.29,411.43 479.13,5.21 723.91,-218.73 723.91,-218.73 0,0 31.23,393.2 541.61,395.8 510.38,2.61 632.76,-213.52 632.76,-213.52 0,0 70.28,262.99 481.71,273.41 411.42,10.41 723.9,-325.49 723.9,-325.49 0,0 236.93,231.75 624.92,164.04 387.99,-67.71 395.8,-395.8 395.8,-395.8 0,0 117.11,273.41 419.16,260.39 302.06,-13.02 419.24,-343.73 419.24,-343.73 0,0 166.63,132.82 408.8,93.76 242.17,-39.06 354.14,-450.49 354.14,-450.49 0,0 351.52,80.72 479.12,-101.56 127.6,-182.28 28.64,-419.24 -80.72,-492.15 -109.37,-72.91 -239.56,-158.84 -343.72,-195.29 0,0 180.96,-144.52 152.32,-335.91 -28.64,-191.39 -173.18,-329.42 -467.43,-329.42 0,0 83.29,-304.67 -343.76,-473.93 -427.05,-169.26 -648.39,-80.72 -648.39,-80.72 0,0 163.99,-247.38 -145.88,-330.71 -309.87,-83.32 -606.72,190.09 -606.72,190.09 0,0 85.92,-364.55 -195.3,-458.29 -281.23,-93.74 -838.48,239.56 -838.48,239.56 0,0 32.55,-153.62 -63.8,-171.85 -96.35,-18.23 -210.92,170.57 -205.71,279.93 0,0 -27.43,-430.97 -425.83,-472.63 -398.41,-41.66 -541.62,390.58 -541.62,390.58 0,0 46.87,-505.17 -338.52,-494.75 -385.38,10.42 -544.22,322.89 -580.68,492.15 0,0 -52.11,-367.15 -427.08,-346.32 -374.97,20.83 -479.13,463.5 -479.13,463.5 0,0 -278.66,-270.82 -557.28,-135.41 -278.62,135.41 -283.83,515.59 -283.83,515.59 0,0 -406.24,-39.05 -601.55,169.26 -195.3,208.32 -103.67,459.64 -103.67,459.64z"/>
   <g>
    <path fill="#214865" d="M12244.86 7412.91c0,0 -161.44,-210.93 -26.04,-341.12 135.4,-130.19 -161.45,-406.21 78.12,-432.25 239.57,-26.04 380.18,-104.16 406.22,-15.63 26.04,88.54 119.78,-276.02 385.38,-291.64 265.6,-15.63 223.94,36.46 104.16,213.53 -119.78,177.06 229.15,114.56 281.23,265.6 52.07,151.03 -114.57,213.53 -72.91,255.19 41.66,41.66 380.2,203.1 249.99,346.32l-1406.15 0z"/>
    <g clip-path="url(#id17)">
     <g>
      <path id="1" fill="#74A3CC" d="M12614.62 7608.21c0,0 -255.18,-208.32 -208.31,-390.59 46.86,-182.28 183.58,-237.47 130.2,-380.18 -53.39,-142.71 135.4,-276.03 171.86,-343.73 36.45,-67.7 -307.27,130.21 -276.02,265.61 31.24,135.4 -67.72,286.44 -83.34,380.18 -15.61,93.74 52.09,562.45 265.61,468.71z"/>
      <path fill="#74A3CC" d="M12852.47 7498.95c0,0 -65.99,-41.77 -112.86,-208.43 -46.87,-166.65 119.78,-249.98 140.61,-307.26 20.84,-57.29 -208.31,-203.11 -114.57,-234.36 93.74,-31.25 359.34,-359.34 359.34,-359.34 0,0 -307.26,281.23 -447.87,364.55 -140.61,83.33 59.53,218.58 59.53,218.58 0,0 -142.86,440.22 115.82,526.26z"/>
      <path fill="#74A3CC" d="M13239.57 7488.42c0,0 177.07,-78.11 98.95,-265.6 -78.12,-187.48 -145.82,-218.73 -145.82,-218.73 0,0 140.62,5.2 88.53,-119.78 -52.08,-124.99 -182.27,-119.78 -203.1,-208.32 -20.84,-88.53 83.32,-229.15 83.32,-229.15 0,0 -208.31,208.32 -140.61,291.65 67.7,83.32 181.7,52.07 171.86,140.61 -9.84,88.53 -114.57,20.83 -98.95,93.74 15.63,72.92 234.36,226.55 182.28,333.31 -52.09,106.76 -119.79,322.89 -36.46,182.27z"/>
     </g>
    </g>
    <path fill="none" d="M12244.86 7412.91c0,0 -161.44,-210.93 -26.04,-341.12 135.4,-130.19 -161.45,-406.21 78.12,-432.25 239.57,-26.04 380.18,-104.16 406.22,-15.63 26.04,88.54 119.78,-276.02 385.38,-291.64 265.6,-15.63 223.94,36.46 104.16,213.53 -119.78,177.06 229.15,114.56 281.23,265.6 52.07,151.03 -114.57,213.53 -72.91,255.19 41.66,41.66 380.2,203.1 249.99,346.32l-1406.15 0z"/>
    <rect fill="#F79433" x="12091.24" y="7412.9" width="1559.77" height="75.51"/>
    <path fill="#FEFEFE" d="M14374.7 11161.56c0,0 63.8,253.88 -138.01,227.84 -201.81,-26.04 -597.62,-236.96 -593.71,-253.89 3.91,-16.93 -26.03,-39.06 260.4,-164.05 0,0 -63.8,-24.74 -57.29,-66.4 6.51,-41.66 25.98,-1248.62 41.61,-1423.09 15.62,-174.47 18.19,-807.27 79.38,-993.45 0,0 -61.2,-19.52 -49.48,-79.41 11.72,-59.9 48.13,-529.91 31.2,-557.26 -16.92,-27.35 -442.71,-35.19 -485.68,-39.1 -42.96,-3.9 -31.25,-80.72 -31.25,-80.72 0,0 -167.97,50.75 -263.02,37.73 -95.05,-13.02 -351.54,-167.96 -316.38,-270.81 35.15,-102.86 207.01,-28.64 274.71,-16.93 67.71,11.72 -26.06,-143.9 -0.02,-155.62 26.03,-11.71 153.63,44.92 299.45,182.94 0,0 -16.28,-14.32 54.03,-45.57 70.3,-31.25 395.8,-139.33 532.5,-171.88 0,0 148.42,-869.72 283.82,-1005.13 135.4,-135.41 262.99,-356.75 390.58,-330.71 127.6,26.04 93.75,187.49 106.77,216.13 13.02,28.64 768.15,1700.37 596.29,2111.8 0,0 148.39,453.08 12.99,932.21 -135.4,479.12 179.65,1760.28 197.88,1788.92 18.23,28.64 -13.02,78.12 -109.37,80.72 0,0 -49.46,-18.23 -26.03,46.87 23.43,65.11 104.15,276.03 -41.67,252.59 -145.82,-23.44 -637.97,49.47 -635.37,-36.46 2.61,-85.93 174.47,-205.7 161.45,-234.35 -13.02,-28.65 -7.81,15.62 -62.5,-7.81 -54.68,-23.44 -218.72,-307.27 -231.74,-348.94 -13.02,-41.66 -91.15,369.76 -140.62,387.99 -49.47,18.23 -140.92,15.84 -140.92,15.84z"/>
    <g clip-path="url(#id18)">
     <g>
      <path id="1" fill="#C8C5E2" d="M14002.59 7833.49c0,0 499.96,15.61 666.61,-372.38 166.65,-387.98 182.27,-684.83 182.27,-684.83 0,0 31.25,-0.01 26.05,109.36 -5.21,109.37 -31.25,1169.18 -874.93,947.85z"/>
      <path fill="#C8C5E2" d="M13994.7 8830.77c0,0 119.76,1239.45 617.12,1880.03 0,0 35.79,21.48 18.22,-20.18 -17.58,-41.67 -518.98,-970.3 -599.02,-1834.56l-36.32 -25.29z"/>
      <path fill="#C8C5E2" d="M13877.36 8465.42c0,0 838.48,104.17 1434.78,-132.8 0,0 -403.62,226.54 -502.57,216.13 -98.95,-10.41 226.53,1949.06 699.15,2495.9 0,0 0,57.29 -42.96,-3.91 -42.97,-61.19 -554.67,-963.49 -682.27,-2163.92 0,0 -296.85,26.04 -398.41,-268.21 0,0 -416.63,2.6 -507.72,-143.19z"/>
      <path fill="#C8C5E2" d="M14468.39 9941.83c0,0 318.59,97 106.76,130.2 -211.82,33.2 -273.41,-164.05 -106.76,-130.2z"/>
      <path fill="#C8C5E2" d="M13929.38 9894.96c0,0 218.72,130.2 104.15,156.24 -114.57,26.04 -226.54,-156.24 -104.15,-156.24z"/>
      <path fill="#C8C5E2" d="M14736.56 6168.68c0,0 -209.63,186.19 -421.85,221.34 0,0 -16.93,29.95 23.43,20.83 40.37,-9.11 536.42,-218.73 398.42,-242.17z"/>
      <path fill="#E68B6C" d="M13425.45 7434.16c0,0 -2.61,37.77 3.91,135.41 6.51,97.65 2.51,162.46 2.51,162.46 0,0 -232.96,168.24 -240.78,169.55 -7.81,1.3 -561.15,-451.79 -561.15,-451.79l520.79 -196.6 274.72 180.97z"/>
      <path fill="#F79433" d="M13739.26 10894.89c0,0 510.38,252.59 723.91,299.46l-127.6 398.4c0,0 -1317.6,-289.04 -596.31,-697.86z"/>
      <path fill="#F79433" d="M14835.53 11144.87c0,0 156.24,-52.07 286.44,-44.27 130.2,7.81 617.14,5.21 617.14,5.21 0,0 -10.42,403.62 -302.06,385.39 -291.65,-18.23 -1076.07,22.19 -601.52,-346.33z"/>
     </g>
    </g>
    <path fill="none" d="M14374.7 11161.56c0,0 63.8,253.88 -138.01,227.84 -201.81,-26.04 -597.62,-236.96 -593.71,-253.89 3.91,-16.93 -26.03,-39.06 260.4,-164.05 0,0 -63.8,-24.74 -57.29,-66.4 6.51,-41.66 25.98,-1248.62 41.61,-1423.09 15.62,-174.47 18.19,-807.27 79.38,-993.45 0,0 -61.2,-19.52 -49.48,-79.41 11.72,-59.9 48.13,-529.91 31.2,-557.26 -16.92,-27.35 -442.71,-35.19 -485.68,-39.1 -42.96,-3.9 -31.25,-80.72 -31.25,-80.72 0,0 -167.97,50.75 -263.02,37.73 -95.05,-13.02 -351.54,-167.96 -316.38,-270.81 35.15,-102.86 207.01,-28.64 274.71,-16.93 67.71,11.72 -26.06,-143.9 -0.02,-155.62 26.03,-11.71 153.63,44.92 299.45,182.94 0,0 -16.28,-14.32 54.03,-45.57 70.3,-31.25 395.8,-139.33 532.5,-171.88 0,0 148.42,-869.72 283.82,-1005.13 135.4,-135.41 262.99,-356.75 390.58,-330.71 127.6,26.04 93.75,187.49 106.77,216.13 13.02,28.64 768.15,1700.37 596.29,2111.8 0,0 148.39,453.08 12.99,932.21 -135.4,479.12 179.65,1760.28 197.88,1788.92 18.23,28.64 -13.02,78.12 -109.37,80.72 0,0 -49.46,-18.23 -26.03,46.87 23.43,65.11 104.15,276.03 -41.67,252.59 -145.82,-23.44 -637.97,49.47 -635.37,-36.46 2.61,-85.93 174.47,-205.7 161.45,-234.35 -13.02,-28.65 -7.81,15.62 -62.5,-7.81 -54.68,-23.44 -218.72,-307.27 -231.74,-348.94 -13.02,-41.66 -91.15,369.76 -140.62,387.99 -49.47,18.23 -140.92,15.84 -140.92,15.84z"/>
    <path fill="#E68B6C" d="M14328.44 6298.35c0,0 24.73,-265.61 23.43,-289.04 -1.3,-23.44 -356.75,121.08 -380.18,-192.7 0,0 -11.72,-191.38 -10.42,-230.45 0,0 -83.32,-14.32 -57.28,-54.68 26.04,-40.36 144.5,-109.36 161.42,-210.92 0,0 -239.56,-48.18 -131.5,-251.29 108.06,-203.11 332.01,-111.97 338.52,-96.35 6.51,15.63 604.12,315.05 604.12,315.05 0,0 5.17,369.77 -285.17,553.35 0,0 -44.3,78.1 40.33,157.52 84.63,79.43 -303.27,299.51 -303.27,299.51z"/>
    <g clip-path="url(#id19)">
     <g>
      <path id="1" fill="#FA7346" d="M14295.79 6033.99c0,0 167.95,-110.67 221.34,-239.57 0,0 40.36,140.62 -221.34,239.57z"/>
      <path fill="#FA7346" d="M14561.38 5623.87c0,0 -7.81,59.89 -28.65,82.02 -20.83,22.14 134.11,-45.56 28.65,-82.02z"/>
      <path fill="#FEFEFE" d="M13927.33 5760.57c0,0 199.21,13.02 317.69,-31.24 118.48,-44.27 -109.36,165.35 -134.11,165.35 -24.74,0 -253.88,28.64 -183.58,-134.11z"/>
      <path fill="#BC0E25" d="M13832.26 5342.63l233.15 -22.07c0,0 269.42,-19.59 373.57,27.28 104.16,46.87 145.82,135.41 132.8,171.86 -13.02,36.45 0.01,20.82 49.48,67.7 49.47,46.87 33.85,158.84 -59.89,184.88 0,0 -24.56,30.33 26.13,77.66 50.68,47.34 417.84,-197.44 417.84,-197.44l62.5 -552.04c0,0 -1055.94,-333.31 -1071.55,-335.91 -15.62,-2.61 -148.43,59.89 -164.03,578.08z"/>
     </g>
    </g>
    <path fill="none" d="M14328.44 6298.35c0,0 24.73,-265.61 23.43,-289.04 -1.3,-23.44 -356.75,121.08 -380.18,-192.7 0,0 -11.72,-191.38 -10.42,-230.45 0,0 -83.32,-14.32 -57.28,-54.68 26.04,-40.36 144.5,-109.36 161.42,-210.92 0,0 -239.56,-48.18 -131.5,-251.29 108.06,-203.11 332.01,-111.97 338.52,-96.35 6.51,15.63 604.12,315.05 604.12,315.05 0,0 5.17,369.77 -285.17,553.35 0,0 -44.3,78.1 40.33,157.52 84.63,79.43 -303.27,299.51 -303.27,299.51z"/>
    <path fill="#FEFEFE" d="M14272.43 4972.92c0,0 197.27,370.3 552.77,574.33 0,0 238.33,-210 256.56,-272.49 0,0 434.86,385.38 520.79,-20.84 85.93,-406.21 -341.12,-372.36 -341.12,-372.36 0,0 114.58,-132.8 15.63,-226.55 -98.95,-93.74 -203.11,-2.6 -203.11,-2.6 0,0 62.49,-294.25 -226.54,-356.75 -289.04,-62.49 -247.38,429.66 -216.13,442.68 31.25,13.02 -358.85,234.58 -358.85,234.58z"/>
   </g>
  </g>
 </g>
</svg>
