[
  {
    "nrocont": "001101309600000001",
    "fesoli": "2017-02-17",
    "fedesem": "2017-06-17",
    "moneda": "PEN",
    "cuoini": "2000.50",
    "impfina": "400.00",
    "tarifa": "BBVA001",
    "codseg": "0250",
    "descseg": "Desgravamen individual",
    "tasaseg": "0.12",
    "tipenvi": "D",
    "desenv": "Digital",
    "mailcon": "macgyver@entelgy.com",
    "codbien": "919223459",
    "impbien": "3500.55",
    "nombr": "Euler",
    "apepat": "Alvarado",
    "apemat": "Pachas",
    "idtoken": "1123256778",
    "indesta": "8",
    "desesta": "Pendiente de firma"
  },
  {
    "nrocont": "001101309600000001",
    "fesoli": "2017-02-17",
    "fedesem": "2017-06-17",
    "moneda": "PEN",
    "cuoini": "2000.50",
    "impfina": "400.00",
    "tarifa": "BBVA001",
    "codseg": "0250",
    "descseg": "Desgravamen individual",
    "tasaseg": "0.12",
    "tipenvi": "D",
    "desenv": "Digital",
    "mailcon": "macgyver@entelgy.com",
    "codbien": "919223459",
    "impbien": "3500.55",
    "nombr": "Euler",
    "apepat": "Alvarado",
    "apemat": "Pachas",
    "idtoken": "1123256778",
    "indesta": "8",
    "desesta": "Pendiente de firma"
  },
  {
    "nrocont": "001101309600000001",
    "fesoli": "2017-02-17",
    "fedesem": "2017-06-17",
    "moneda": "PEN",
    "cuoini": "2000.50",
    "impfina": "400.00",
    "tarifa": "BBVA001",
    "codseg": "0250",
    "descseg": "Desgravamen individual",
    "tasaseg": "0.12",
    "tipenvi": "D",
    "desenv": "Digital",
    "mailcon": "macgyver@entelgy.com",
    "codbien": "919223459",
    "impbien": "3500.55",
    "nombr": "Euler",
    "apepat": "Alvarado",
    "apemat": "Pachas",
    "idtoken": "1123256778",
    "indesta": "8",
    "desesta": "Pendiente de firma"
  }
]	