{
  "listaOfertas": [
    {
      "campanha": "201703",
      "codConfigProducto": "208",
      "codFlujoOpe": "F",
      "codInterno": "442",
      "codPlazo": "36",
      "codProducto": "TC",
      "codSubProducto": "F7",
      "codigoCentral": "",
      "desConfigProducto": "BAJO",
      "desProducto": "Tarjetas de Crédito",
      "desSubProducto": " Visa Continental Zero",
      "divisa": "PEN",
      "familiaProducto": "50",
      "flujoOperativo": "FAST N",
      "idPropuesta": "00001",
      "rangoMax": "100000",
      "rangoMin": "500",
      "stRiesgo": "CQ",
      "tasaMax": "0",
      "tasaMin": "0",
      "tipplazo": "M",
      "valBin": "404293",
      "valCuotaAjust": "559.56832",
      "valCuotaContrato": "559.56832",
      "valCuotaReal": "564.42",
      "valLimiteAjust": "8700.00",
      "valLimiteContrato": "8700.00",
      "valLimiteReal": "8775.00",
      "valTasa": "89.99",
      "vdomiciliaria": "NO",
      "vlaboral": "NO"
    },
    {
      "campanha": "201612",
      "codConfigProducto": "208",
      "codPlazo": "36",
      "codSubProducto": "",
      "codigoCentral": "90011271",
      "desConfigProducto": "BAJO",
      "desProducto": "Tarjetas de Crédito",
      "desSubProducto": " Visa Continental Zero",
      "divisa": "PEN",
      "flujoOperativo": "FAST                                                  N",
      "idPropuesta": "00001",
      "rangoMax": "100000",
      "rangoMin": "500",
      "tasaMax": "0",
      "tasaMin": "0",
      "valBin": "404293",
      "valCuotaAjust": "405.20465",
      "valCuotaContrato": "405.20465",
      "valCuotaReal": "411.58",
      "valLimiteAjust": "6300.00",
      "valLimiteContrato": "6300.00",
      "valLimiteReal": "6399.00",
      "valTasa": "89.99",
      "vdomiciliaria": "NO",
      "vlaboral": "SI"
    },
    {
    }
  ],
  "idPagin": "qwe",
  "tampagi": "100"
}