{
  "data": [
    {
      "id": "123",
      "business": {
        "id": "00023456",
        "businessDocuments": [
          {
            "businessDocumentType": {
              "id": "R",
              "name": "Registro unico de contribuyente"
            },
            "documentNumber": "1578541236"
          }
        ],
        "legalName": "PEPITO SAC"
      },
      "status": {
        "id": "4",
        "name": "Aprobado",
        "reason": "1"
      },
      "branch": {
        "id": "123",
        "name": "Of. San Isidro"
      },
      "unitManagement": "1234",
      "openingDate": "2015-12-02",
      "participants": [
        {
          "code": "123",
          "firstName": "aaaa",
          "middleName": "bbbb",
          "lastName": "cccc",
          "motherLastName": "dddd",
          "participantType": {
            "id": "E",
            "name": "Ejecutivo"
          }
        }
      ]
    },
    {
      "id": "124",
      "business": {
        "id": "00023456",
        "businessDocuments": [
          {
            "businessDocumentType": {
              "id": "R",
              "name": "Registro unico de contribuyente"
            },
            "documentNumber": "1578541236"
          }
        ]
      },
      "openingDate": "2015-12-02",
      "participants": [
        {
          "code": "124",
          "firstName": "aaab",
          "middleName": "bbbc",
          "lastName": "cccd",
          "motherLastName": "ddde",
          "participantType": {
            "id": "E",
            "name": "Ejecutivo"
          }
        }
      ]
    }
  ],
  "pagination": {
    "paginationKey": "1",
    "pageSize": 10,
    "previous": "0",
    "page": 1,
    "totalElements": 2,
    "totalPages": 3
  }
}
