{
    "_default": {
        "1": {
            "titulo": "teste de titulo update",
            "paragrafo": "teste paragrafo",
            "link": "teste link",
            "tag": "teste tag",
            "data": "teste data",
            "autor": "teste autor"
        },
        "2": {
            "titulo": "teste de titulo update",
            "paragrafo": "teste paragrafo",
            "link": "teste link",
            "tag": "teste tag",
            "data": "teste data",
            "autor": "teste autor"
        },
        "3": {
            "titulo": "teste de titulo update",
            "paragrafo": "teste paragrafo",
            "link": "teste link",
            "tag": "teste tag",
            "data": "teste data",
            "autor": "teste autor"
        },
        "4": {
            "titulo": "teste de titulo update",
            "paragrafo": "teste paragrafo",
            "link": "teste link",
            "tag": "teste tag",
            "data": "teste data",
            "autor": "teste autor"
        },
        "5": {
            "titulo": "teste de titulo update",
            "paragrafo": "teste paragrafo",
            "link": "teste link",
            "tag": "teste tag",
            "data": "teste data"
        },
        "6": {
            "titulo": "teste de titulo update",
            "paragrafo": "teste paragrafo",
            "link": "teste link",
            "tag": "teste tag",
            "data": "teste data"
        },
        "7": {
            "titulo": "teste de titulo update",
            "paragrafo": "teste paragrafo",
            "link": "teste link",
            "tag": "teste tag",
            "data": "teste data"
        }
    }
}