{
    "Collections": [
        {
            "sheetName": "Tabelle1",
            "startColumn": "A",
            "endColumn": "AP",
            "startRow": "2",
            "endRow": "85",
            "comment": "",
            "rule": "Individual: @B*\nTypes: @C* \nFacts: \taddsOverHead @D*(xsd:integer),\n\taverageLatency @E*(xsd:float),\n\tdampeningOfSignalPerMeter @F*(xsd:float),\n\teavesdroppingPotential @G*(xsd:string),\n\tguaranteedLatency @H*(xsd:float),\n\thandlesPacketLoss @I*(xsd:boolean),\n\thasAllowanceForRegulatoryDomain @J*(xsd:boolean),\n\tmaxDataBandwidth @K*(xsd:float),\n\tmaxEnergyConsumption @L*(xsd:float),\n\tmaxLinkRange @M*(xsd:float),\n\tmaxNumberOfStations @N*(xsd:integer),\n\tmaxTypicalLinkRange @O*,\n\tmaxUserDataLength @P*(xsd:float),\n\tminCommunicationCycle @Q*(xsd:float),\n\tminLatency @R*(xsd:float),\n\tminTransferInterval @S*(xsd:float),\n\trequiredTimeToStartCommunicating @T*(xsd:float),\n\tsupportsSeamlessStationHandover @U*(xsd:boolean),\n\ttypicalDataBandwidth @V*(xsd:float),\n\ttypicalEnergyConsumption @W*(xsd:float),\n\ttypicalNumberOfStation @X*(xsd:integer),\n\thasLowerLimit2_4GHz @Y*(xsd:boolean),\n\thasLowerLimit5GHz @Z*(xsd:boolean),\n\thasLowerLimit6GHz @AA*(xsd:boolean),\n\thasUpperLimit2_4GHz @AB*(xsd:boolean),\n\thasUpperLimit5GHz @AC*(xsd:boolean),\n\thasUpperLimit6GHz @AD*(xsd:boolean),\n\thasDFS @AE*(xsd:boolean),\n\tmaxAllowedTxPower @AF*(xsd:float),\n\tsignalModulationScheme @AG*(xsd:string)\n\nAnnotations:\tdc:source @AH*,\n\tdc:source @AI*,\n\trdfs:comment @AJ*,\n\trdfs:comment @AK*,\n\trdfs:comment @AL*,\n\trdfs:comment @AM*,\n\trdfs:comment @AN*,\n\trdfs:comment @AO*,\n\trdfs:comment @AP*",
            "active": true
        }
    ]
}