{
	"id": "41a6d8f4-bcdc-4bd2-aeb0-081a1d8ae780",
	"name": "Users Repro - Local",
	"values": [
		{
			"key": "server",
			"value": "localhost:8080",
			"type": "default",
			"enabled": true
		},
		{
			"key": "userId1",
			"value": "123789",
			"type": "default",
			"enabled": true
		},
		{
			"key": "userId2",
			"value": "000333",
			"type": "default",
			"enabled": true
		}
	],
	"_postman_variable_scope": "environment",
	"_postman_exported_at": "2024-02-21T15:42:04.180Z",
	"_postman_exported_using": "Postman/10.22.13"
}