{
	"info": {
		"_postman_id": "0aec30bd-3eb2-49f8-b74a-7c0bbce9b9f3",
		"name": "Users - Repro",
		"schema": "https://schema.getpostman.com/json/collection/v2.1.0/collection.json",
		"_exporter_id": "846811"
	},
	"item": [
		{
			"name": "Save User - Repro",
			"request": {
				"method": "PUT",
				"header": [],
				"body": {
					"mode": "raw",
					"raw": "{\n\"name\" : \"bob\",\n\"avatartype\" : 1,\n\"usertype\" : 4\n}"
				},
				"url": {
					"raw": "{{server}}/API/users/{{userId1}}",
					"host": [
						"{{server}}"
					],
					"path": [
						"API",
						"users",
						"{{userId1}}"
					]
				}
			},
			"response": []
		},
		{
			"name": "Get Users - Repro",
			"request": {
				"method": "GET",
				"header": [],
				"url": {
					"raw": "{{server}}/API/users",
					"host": [
						"{{server}}"
					],
					"path": [
						"API",
						"users"
					]
				}
			},
			"response": []
		},
		{
			"name": "Get User - Repro",
			"request": {
				"method": "GET",
				"header": [],
				"url": {
					"raw": "{{server}}/API/users/{{userId1}}",
					"host": [
						"{{server}}"
					],
					"path": [
						"API",
						"users",
						"{{userId1}}"
					]
				}
			},
			"response": []
		},
		{
			"name": "Get Users Without Projection- Repro",
			"request": {
				"method": "GET",
				"header": [],
				"url": {
					"raw": "{{server}}/API/usersWithoutProjection",
					"host": [
						"{{server}}"
					],
					"path": [
						"API",
						"usersWithoutProjection"
					]
				}
			},
			"response": []
		}
	]
}