<svg width="98" height="48" viewBox="0 0 98 48" fill="none" xmlns="http://www.w3.org/2000/svg">
<path d="M31.6842 6.19849C31.6596 6.5673 31.6596 6.96068 31.635 7.32948C31.0941 7.50159 31.1187 7.84581 31.5121 8.09167C31.8563 8.28837 31.9792 8.48506 31.9792 8.87845C31.9546 11.4846 31.9546 14.0908 31.9792 16.697C31.9792 17.0167 31.9546 17.3117 31.6596 17.5084C31.3892 17.4838 31.0695 17.41 31.0695 17.828C31.0695 18.246 31.3892 18.1968 31.6596 18.1968C34.4625 18.1968 37.2654 18.1722 40.0683 18.2214C40.8059 18.2214 40.7321 17.8034 40.6829 17.3363C40.3141 16.82 39.6749 16.7954 39.1831 17.3117C38.7898 17.6067 38.3472 17.6805 37.8555 17.6559C36.6015 17.6313 35.3476 17.6559 34.0937 17.6559C33.8724 14.6317 34.0691 11.6076 33.9953 8.58341C33.9953 8.14085 34.2658 8.09167 34.5854 8.11626C35.2493 8.16543 35.9131 8.23919 36.577 8.28837C36.9458 8.31295 37.1424 8.14085 37.167 7.74746C37.1916 7.3049 36.8966 7.35407 36.6261 7.35407C36.2573 7.35407 35.8885 7.35407 35.5197 7.35407C33.8724 7.35407 33.8724 7.35407 34.0445 5.70676C35.0772 5.78052 36.159 5.51007 37.167 5.90345C37.4867 6.46895 37.8063 6.46895 38.1259 5.90345C38.4701 5.28878 38.3718 4.96916 37.5604 4.96916C35.8885 4.99374 34.192 4.96916 32.5201 4.99374C32.053 4.99374 31.4629 4.74788 31.1433 5.16585C30.6761 5.75593 31.7825 5.68217 31.6842 6.19849Z" fill="#57557B"/>
<path d="M72.1787 36.8339C72.1787 38.4074 72.1787 39.981 72.1787 41.5791C71.8836 41.407 71.7361 41.2595 71.6132 41.0136C70.8264 39.5384 69.9659 38.0878 69.2283 36.588C68.8595 35.8504 68.3431 35.58 67.581 35.7029C67.4089 35.7275 67.1876 35.6537 67.0892 35.8258C66.9909 36.0225 67.1384 36.2438 67.2367 36.3176C67.6301 36.5142 67.581 36.8585 67.581 37.1781C67.581 38.6287 67.581 40.0547 67.581 41.5054C67.581 41.702 67.581 41.9479 67.5072 42.12C67.4089 42.3167 66.9417 42.3167 67.0892 42.6118C67.2367 42.9314 67.6301 42.7839 67.9252 42.8085C68.171 42.833 68.4169 42.7839 68.6628 42.7839C68.8841 42.7839 69.1299 42.8085 69.1545 42.5134C69.1791 42.1938 68.7857 42.3413 68.6874 42.1692C68.6874 40.5711 68.712 38.9975 68.712 37.3994C69.1299 37.8419 69.5233 38.3337 69.7692 38.8992C70.2609 40.0547 70.9739 41.112 71.564 42.243C71.7607 42.6363 72.0066 42.8085 72.4246 42.7593C72.8917 42.6855 72.7196 42.2921 72.7196 42.0217C72.7442 40.9153 72.6704 39.8089 72.7442 38.7025C72.7933 37.6944 72.2524 36.5142 73.6047 35.8258C72.1787 35.58 72.1787 35.5799 72.1787 36.8339Z" fill="#57557B"/>
<path d="M94.1837 42.4394C93.5444 42.4148 93.3477 42.2181 93.3723 41.5789C93.4215 39.8332 93.3723 38.0875 93.3969 36.3173C93.3969 35.8993 93.2986 35.7026 92.8314 35.678C92.3397 35.6534 92.2905 35.9239 92.2905 36.3173C92.2905 36.9565 92.3397 37.6204 92.2905 38.2596C92.143 39.6857 92.6839 41.1609 91.9709 42.5377C91.8479 42.759 92.1184 42.8328 92.2905 42.8328C93.7903 42.8328 95.2655 42.8328 96.7653 42.8328C95.9539 42.1443 95.0442 42.464 94.1837 42.4394Z" fill="#57557B"/>
<path d="M78.2024 35.7272C77.8582 35.7272 77.5386 35.7518 77.1944 35.7518C76.9485 35.7272 76.801 35.8255 76.8256 36.1206C76.8747 36.5385 77.219 36.4894 77.514 36.4894C77.7353 38.0383 77.5878 39.6119 77.5878 41.1608C77.5878 41.6034 77.8582 42.1197 77.219 42.4394C76.9977 42.5377 77.1698 42.8327 77.4402 42.8327C77.7107 42.8573 77.9811 42.8327 78.2762 42.8327C79.0875 42.8327 78.8663 42.8573 78.7679 42.1197C78.5466 40.2757 78.4975 38.3825 78.7679 36.5385C78.9154 35.678 79.1859 35.7272 78.2024 35.7272Z" fill="#57557B"/>
<path d="M37.6343 31.8426C36.9212 31.6951 36.5033 32.3343 35.8148 32.3097C34.4134 32.236 32.9874 32.2606 31.5859 32.3097C30.9221 32.3343 30.7746 32.0639 30.9221 31.4984C31.6105 30.2444 32.3973 28.9905 32.9874 27.6874C33.4053 26.8023 33.7004 26.0155 34.9051 26.2614C35.1264 26.3106 35.4706 26.3597 35.4706 25.9909C35.4706 25.5975 35.1264 25.7697 34.9297 25.7451C34.1184 25.6713 33.9708 25.4009 34.438 24.7616C35.151 23.7781 35.569 22.6471 36.0853 21.5653C36.2082 21.2457 36.5279 21.1228 36.6754 20.8031C37.1179 19.8688 37.1425 19.8688 36.0607 19.8688C34.0938 19.8688 32.1268 19.8934 30.1599 19.8442C29.4469 19.8197 29.1272 20.0655 29.2748 20.7785C29.6682 21.3932 30.1107 21.4424 30.5533 20.8277C30.8483 20.7785 30.9467 20.3852 31.3155 20.4097C32.2989 20.4343 33.2824 20.4343 34.2659 20.4343C34.5363 20.4343 34.6593 20.5819 34.6593 20.8277C33.9217 21.762 33.4299 22.8438 32.9874 23.9256C32.3235 25.5975 32.2252 25.7205 30.4795 25.7451C30.4549 25.7451 30.4058 25.7451 30.3812 25.7451C30.1107 25.8188 29.7173 25.5975 29.619 26.0401C29.5698 26.2368 29.5206 26.5073 29.7173 26.6302C29.9878 26.8023 30.3074 26.7531 30.6024 26.6548C30.7746 26.6056 30.9221 26.4089 31.0942 26.3106C31.1925 26.2614 31.3401 26.3106 31.4384 26.3597C31.5613 26.4335 31.5613 26.581 31.4876 26.6794C30.7746 27.5891 30.6024 28.7201 30.0124 29.7035C29.5944 30.392 29.1027 31.0558 29.0289 31.8918C28.6109 31.9901 28.5372 32.3589 28.5863 32.6785C28.6109 32.949 28.9306 32.8506 29.1272 32.8506C31.9547 32.8506 34.7822 32.8506 37.6097 32.8506C37.9047 32.8506 38.2735 32.8998 38.2489 32.4327C38.2735 31.9655 38.0276 31.9163 37.6343 31.8426ZM30.3566 32.531C30.4058 32.4818 30.4303 32.4572 30.4795 32.4081C30.4549 32.4572 30.4058 32.5064 30.3566 32.531Z" fill="#57557B"/>
<path d="M34.4379 35.8502C33.2332 35.1864 30.9958 35.8256 30.1844 37.0304C28.4388 38.3827 28.6355 41.5544 30.5532 42.7345C31.4875 43.1033 32.4464 43.0541 33.3315 42.7099C33.8233 42.5132 34.4625 42.292 34.733 41.6527C34.8313 41.4314 34.733 41.3085 34.5855 41.1856C34.4379 41.0626 34.2904 41.0872 34.2167 41.2593C33.7003 42.4149 32.6677 42.3657 31.6596 42.3903C30.5778 42.1444 30.3811 41.1856 29.9877 40.3496C30.3565 39.8333 30.1353 39.2432 30.1598 38.6777C30.1107 38.0876 30.7499 37.6942 30.6024 37.055C31.0696 36.8583 31.4384 36.4157 31.9793 36.4403C32.471 36.4649 32.9627 36.4649 33.4791 36.4895C33.5282 36.5632 33.6266 36.6124 33.6512 36.6862C33.7003 37.0058 34.0446 37.3008 34.1921 37.2271C34.5117 37.055 34.7822 36.7354 34.9297 36.4157C35.0772 36.0715 34.61 35.9486 34.4379 35.8502Z" fill="#57557B"/>
<path d="M53.1977 42.1939C52.1897 42.5381 51.157 42.2431 50.1244 42.3414C50.0998 40.3499 50.0752 38.3584 50.0506 36.3914C50.0506 36.0472 50.0998 35.7276 49.5589 35.7276C49.0425 35.7276 48.9688 35.9734 48.9688 36.416C48.9934 37.965 48.9934 39.5385 48.9688 41.0875C48.9688 41.53 49.1409 41.9972 48.8213 42.4152C48.6246 42.3906 48.4279 42.4152 48.4525 42.6856C48.4525 42.9315 48.6737 42.9561 48.8459 42.9561C50.3211 42.9561 51.7963 42.9561 53.2715 42.9561C53.5419 42.9561 53.7878 42.8577 53.7386 42.5381C53.714 42.1693 53.3944 42.1201 53.1977 42.1939Z" fill="#57557B"/>
<path d="M68.6873 32.8016C69.2528 32.5065 70.015 32.5557 70.3592 31.8427C71.5639 30.9576 71.9819 29.6545 72.0557 28.253C72.1294 26.3598 72.0802 24.4421 72.1048 22.5489C72.1048 22.1555 71.9573 21.6392 72.572 21.5163C72.867 21.5408 73.1129 21.5163 73.1375 21.1229C73.1375 20.8524 73.0391 20.7295 72.7687 20.8032C71.441 20.7541 71.441 20.7541 71.441 22.0572C71.441 23.7291 71.441 25.401 71.441 27.0974C71.441 27.4908 71.3426 27.8842 71.2935 28.2284C71.1705 29.4086 70.7771 30.4658 70.1379 31.4493C70.0395 31.4493 69.9166 31.4739 69.8183 31.4739C69.1544 31.4739 68.466 31.4739 67.8022 31.4985C66.7203 30.81 65.8598 29.9249 65.7123 28.5972C65.491 26.4336 65.6385 24.2454 65.6385 22.0818C65.6385 21.7375 65.8106 21.5163 66.204 21.4917C66.4991 21.4671 66.5482 21.2458 66.5482 21.0245C66.5482 20.7049 66.2532 20.7787 66.0565 20.7787C65.0484 20.7787 64.0404 20.8032 63.0323 20.8032C62.7127 20.7787 62.6143 20.9754 62.6635 21.2458C62.7127 21.5654 62.9586 21.5408 63.2044 21.5163C63.8437 21.6146 63.6962 22.1063 63.6962 22.4997C63.7208 24.4667 63.6962 26.409 63.7208 28.376C63.7453 30.1216 65.5648 32.8753 67.2367 32.8016C67.7038 33.3671 68.1955 33.3671 68.6873 32.8016Z" fill="#57557B"/>
<path d="M46.7315 18.1231C48.9197 18.1477 51.1325 18.1477 53.3207 18.1723C53.6895 18.1723 53.9108 18.0739 53.8862 17.656C53.8616 17.2872 53.7879 16.9675 53.3207 16.9921C53.124 16.9921 52.8782 16.9184 52.7061 17.0905C52.0422 17.7051 51.2063 17.6314 50.3949 17.6314C49.3869 17.6314 48.3788 17.6314 47.3707 17.6314C47.3462 17.2134 47.3216 16.7709 47.3216 16.3529C47.3216 12.8616 47.3216 9.37024 47.3216 5.87892C47.3216 5.58388 47.4445 5.11674 47.1495 5.04298C46.6331 4.92004 46.0431 4.92004 45.5267 5.04298C45.1825 5.14132 45.33 5.63306 45.33 5.95268C45.33 9.46859 45.3055 13.0091 45.33 16.525C45.33 17.0167 45.1825 17.2872 44.7645 17.4593C44.322 17.4593 44.3466 17.7297 44.4695 18.0248C45.1825 18.3198 45.9447 18.1723 46.7315 18.1231Z" fill="#57557B"/>
<path d="M57.4512 32.8015C57.9921 32.6048 58.533 32.4081 59.0739 32.2114C59.4919 32.2606 59.4673 32.5802 59.4673 32.8998C59.4673 33.2686 59.4673 33.6374 59.4673 33.9817C59.4673 34.2767 59.6394 34.498 59.9099 34.4242C60.2541 34.3013 60.8442 34.8422 60.9671 34.08C61.5572 34.08 61.5326 33.6374 61.5326 33.2441C61.5326 31.4246 61.5326 29.6298 61.5326 27.8104C61.5326 25.6959 61.5326 25.6959 59.4427 25.9418C59.4181 25.9418 59.3935 25.9418 59.3444 25.9418C59.0985 25.9418 58.9264 26.0155 58.9264 26.286C58.9264 26.5319 58.8772 26.8269 59.246 26.8269C59.8361 26.8269 59.8361 27.1957 59.8361 27.6383C59.8115 28.1792 59.7623 28.7447 59.8361 29.2856C59.959 30.1707 59.5902 30.7362 58.9018 31.2525C57.4758 32.3098 55.8039 32.5556 54.55 31.6705C51.5258 29.4823 51.8454 25.9664 53.6648 23.311C54.2303 22.4996 55.1892 22.2784 55.8039 21.5653C55.976 21.5408 56.1727 21.5408 56.3448 21.5162C56.8857 21.5408 57.4512 21.5408 57.9921 21.5653C58.2626 22.0079 59.0985 21.6391 59.1231 22.4013C59.1231 22.8439 59.2214 23.1143 59.7378 23.2372C60.6721 23.4585 60.4016 22.3767 60.9671 22.1554C61.1638 22.0571 61.2376 21.6145 61.0409 21.3195C60.9917 21.2457 60.9179 21.1965 60.8442 21.172C59.1723 20.6556 57.525 20.0656 55.8039 20.9507C55.0417 21.1965 54.2795 21.3441 53.5911 21.885C51.1078 23.8027 50.2965 26.3106 50.7144 29.3102C50.8865 30.5641 51.575 31.5476 52.6322 32.2606C53.8124 33.0719 55.1155 33.2932 56.5169 33.1211C56.8611 33.1457 57.2791 33.3424 57.4512 32.8015Z" fill="#57557B"/>
<path d="M97.0851 20.8031C96.913 20.8031 96.7163 20.8031 96.5442 20.7785C95.6099 20.6064 95.364 20.9998 95.3886 21.9095C95.4624 24.6632 95.4132 27.4415 95.4132 30.1953C95.4132 30.4657 95.5607 30.8099 95.1427 31.105C94.5281 29.6052 93.4463 28.425 92.7086 27.0236C91.8481 25.4254 90.7171 23.9994 89.9795 22.3275C89.7828 21.8849 89.5861 21.4178 89.1682 21.0982C88.2585 20.4343 87.2258 20.9261 86.2669 20.8277C86.144 20.8031 86.0702 20.9506 86.0702 21.0982C86.0702 21.2211 86.0948 21.344 86.2669 21.3686C87.1275 21.4916 87.0537 22.1554 87.0537 22.7701C87.0537 25.45 87.0537 28.1054 87.0537 30.7853C87.0537 31.3508 87.1029 31.8917 86.3653 32.0884C86.1686 32.1376 86.0211 32.3589 86.0702 32.6048C86.144 32.8998 86.3899 32.826 86.5866 32.826C87.4963 32.826 88.4306 32.826 89.3403 32.826C89.537 32.826 89.8074 32.8998 89.8812 32.6048C89.9549 32.3097 89.7828 32.1376 89.5124 32.0638C89.0206 31.8917 88.9469 31.5229 88.9469 31.0558C88.9715 28.6709 88.9469 26.2614 88.9715 23.8765C88.9715 23.6552 88.8485 23.3601 89.2911 23.2372C90.7909 26.6302 93.0037 29.6298 94.8969 32.826C95.364 33.3669 95.9787 33.3424 96.3229 32.7769C96.3229 29.4577 96.3229 26.163 96.3229 22.8438C96.3229 22.3521 96.2246 21.7866 96.8884 21.5653C97.1834 21.5899 97.4293 21.5653 97.4539 21.1965C97.4539 20.8769 97.3555 20.7539 97.0851 20.8031Z" fill="#57557B"/>
<path d="M88.4305 41.4806C88.2092 40.7922 88.2338 40.0054 87.6683 39.4399C87.3486 38.3827 87.0536 37.3009 86.5373 36.3174C86.5865 35.8502 86.2914 35.7519 85.9226 35.7519C85.6767 35.7519 85.4801 35.7765 85.3817 36.0961C84.9146 37.4238 84.4228 38.7269 83.9311 40.03C83.6606 40.7676 83.4148 41.4806 83.0951 42.1936C83.0214 42.3411 82.5788 42.3411 82.7263 42.6854C82.8493 42.9558 83.1689 42.8083 83.3902 42.8575C84.054 42.9558 84.472 42.587 84.7916 42.0953C84.9391 41.874 85.0129 41.6035 85.2834 41.4806C85.9472 41.161 86.5865 40.6938 87.3978 40.7184C87.8404 41.0135 87.9141 41.5052 88.0371 41.9969C88.2584 42.9066 88.578 43.0542 89.3156 42.5378C88.7009 42.3657 88.578 41.9478 88.4305 41.4806ZM87.2503 39.9562C86.9798 40.325 86.2422 40.3742 85.7259 40.5955C85.4801 40.6938 85.2834 40.8905 85.0621 41.0626C84.6687 40.1775 85.4309 39.5628 85.5538 38.7761C85.6522 38.2106 85.9964 37.6697 86.0455 37.0796C86.6602 37.2517 86.7586 37.7926 86.8077 38.2843C86.8815 38.8744 87.6191 39.4153 87.2503 39.9562Z" fill="#57557B"/>
<path d="M43.0678 35.7276C42.4531 35.7276 41.8384 35.7522 41.2238 35.7767C40.7812 35.8505 40.437 36.0472 40.2403 36.4406C39.1831 36.9323 38.8143 37.965 38.3717 38.9238C37.7079 40.3991 38.6668 42.3906 40.2157 42.784C41.6909 43.1282 43.0678 43.0298 44.1742 41.8251C45.4035 40.7187 45.6494 39.3172 45.4281 37.7929C45.2806 36.4898 44.3955 35.7276 43.0678 35.7276ZM43.8546 41.1612C43.8054 41.235 43.8054 41.3333 43.8054 41.4317C43.1415 42.2922 42.2318 42.4643 41.2484 42.366C41.2484 42.3906 41.2484 42.4152 41.2238 42.4152C41.1992 42.3906 41.1746 42.366 41.15 42.3414C40.0682 42.0464 39.6748 41.2104 39.5519 40.1778C39.3306 39.6614 39.3306 39.1697 39.5519 38.6534C39.6011 37.7929 40.0436 37.1536 40.6829 36.6373C41.3467 36.3668 42.0351 36.4898 42.7236 36.4406C44.3709 37.1782 44.9855 39.7352 43.8546 41.1612Z" fill="#57557B"/>
<path d="M49.8294 32.7524C50.0261 32.7032 50.0261 32.4082 49.8048 32.2115C48.9443 31.4001 48.7722 30.2691 48.3788 29.2365C48.1821 28.7202 48.2313 28.376 48.8705 28.2039C48.0592 28.253 47.592 27.958 47.4937 27.1712C47.3462 26.114 46.8544 25.1551 46.5102 24.147C46.2152 23.2619 45.8218 22.3768 45.4776 21.4917C45.3792 21.2704 45.6988 20.8033 45.2563 20.8278C44.74 20.8524 44.1007 20.4099 43.7319 21.1229C43.486 21.0737 43.4369 21.2458 43.3877 21.4425C43.1418 22.1801 42.896 22.9423 42.6255 23.6799C41.8141 25.8435 41.0274 28.0318 40.1914 30.1954C39.9701 30.7609 39.8718 31.4493 39.2817 31.7935C38.9621 31.9902 38.4212 32.0394 38.6179 32.5803C38.79 33.0229 39.2571 32.7524 39.6013 32.8016C39.798 32.8262 40.0193 32.8016 40.2406 32.8016C40.9536 32.8508 41.6175 32.8508 41.8879 31.941C42.0108 31.5477 42.4042 31.2526 42.6993 30.933C43.8794 29.9495 44.9612 28.8431 46.6331 28.7202C47.1249 28.6956 47.3462 28.7202 47.5183 29.2857C47.8625 30.3921 48.1575 31.5231 48.7722 32.5311C49.0918 33.0229 49.5098 32.8508 49.8294 32.7524ZM45.748 27.7859C44.4941 27.8842 43.4369 28.4989 42.3551 29.089C42.06 29.089 42.1092 28.9169 42.1829 28.7202C42.6009 26.7778 43.5598 25.0322 44.1991 23.139C44.2974 22.844 44.3466 22.5489 44.4449 22.2539C44.5433 22.2785 44.74 22.303 44.7646 22.3522C45.33 23.8274 45.871 25.3026 46.4119 26.7778C46.584 27.4171 46.3873 27.7367 45.748 27.7859Z" fill="#57557B"/>
<path d="M84.3491 32.8259C84.7424 33.2931 85.1112 33.4406 85.4309 32.7521C85.4309 32.6046 85.4801 32.3833 85.3817 32.3096C84.4966 31.4245 84.1769 30.2935 83.8081 29.1625C83.6115 28.597 83.6606 28.3511 84.2999 28.179C83.7098 28.2528 83.2672 28.0807 83.1443 27.5643C82.6772 25.622 81.792 23.8026 81.202 21.9094C81.0299 21.5652 81.6199 20.9505 80.8332 20.803C79.1858 20.7784 79.235 20.7784 78.6204 22.2782C78.3253 22.9912 78.1778 23.7288 77.9319 24.4172C77.3664 25.9416 76.678 27.4168 76.1617 28.9658C75.7683 30.146 75.5224 31.3753 74.2685 32.0391C73.9243 32.2358 73.9489 32.5555 74.2439 32.7521C74.8832 33.1701 77.1451 32.6784 77.4648 31.99C77.7352 31.4245 78.1778 31.0557 78.4728 30.5639C79.2104 30.0968 79.9726 29.6296 80.7102 29.1871C82.3084 28.2282 82.7755 28.4249 83.3656 30.1214C83.6606 31.0557 83.8327 31.99 84.3491 32.8259ZM80.9807 28.4495C80.1447 28.6462 79.3579 29.0395 78.5466 29.3346C78.1286 29.5313 77.9073 29.4575 78.0303 28.9412C78.7187 26.9743 79.4071 25.0319 80.1201 23.065C80.1693 22.942 80.3168 22.8437 80.4152 22.7453C80.5627 23.1387 80.7102 23.5321 80.8332 23.9255C80.9069 24.1468 81.0053 24.3435 81.079 24.5648C81.2757 25.1303 81.497 25.6958 81.7183 26.2612C81.792 26.4334 81.8904 26.6301 81.9641 26.8267C81.9887 26.8759 81.9887 26.9005 82.0133 26.9497C82.1117 27.171 82.1608 27.3431 82.1608 27.4906C82.3084 28.179 82.0871 28.2036 80.9807 28.4495Z" fill="#57557B"/>
<path d="M61.6555 35.7765C60.4508 35.6535 59.1477 35.4568 58.0658 36.4403C57.6479 36.8091 57.402 37.2762 57.0824 37.6942C56.3694 38.6039 56.0251 40.6938 56.6398 41.6281C57.0086 42.1936 57.4512 42.8574 58.3117 42.8083C59.1477 43.1279 60.0082 43.0787 60.7704 42.7591C61.213 42.5624 61.926 42.5624 62.0735 41.874C63.2782 40.9888 63.8683 38.9481 63.4503 37.7188C63.1799 36.7845 62.6636 35.8748 61.6555 35.7765ZM62.4177 40.2267C62.3194 40.6938 62.0981 41.1118 61.926 41.5789C61.1638 42.3165 60.2541 42.6607 59.1723 42.5378C57.4758 42.0707 57.0086 39.4153 57.697 38.186C58.0904 37.4975 58.3609 36.7599 59.3198 36.5878C61.9506 36.0961 62.7619 38.5302 62.4177 40.2267Z" fill="#57557B"/>
<path d="M22.9806 31.0559C24.7016 30.392 24.9721 29.0889 24.8492 27.4908C24.7262 25.991 23.6198 24.983 22.12 25.2534C21.3824 25.3763 21.407 25.0567 21.4562 24.5896C21.53 23.6799 21.6775 22.7702 21.2841 21.885C21.0874 21.4179 21.4808 21.3195 21.8004 21.2212C22.2676 21.0737 22.7839 21.0983 23.2019 20.7786C24.9967 19.3772 24.9721 17.8036 23.374 16.0088C23.0543 15.6646 22.9314 15.5416 23.3002 15.1728C24.3574 14.091 24.5541 12.7879 24.1853 11.3619C23.9149 10.2555 22.4397 9.3212 21.3333 9.59166C20.694 9.73918 20.2023 10.108 20.2023 10.821C20.2023 11.5586 20.7432 11.6815 21.3578 11.7061C21.6283 11.7061 21.9233 11.7061 21.9971 12.0749C22.0709 12.4437 21.8742 12.6404 21.5545 12.7879C20.694 13.2059 19.8826 13.3043 18.9238 12.96C16.8585 12.1979 14.9899 11.2636 14.2769 8.97699C14.2523 8.87864 14.1539 8.7803 14.0556 8.70653C13.3672 8.14104 13.4901 7.40344 13.5147 6.66584C13.5147 6.49373 13.613 6.24786 13.736 6.19869C13.9818 6.07575 14.1048 6.37079 14.2031 6.51831C14.4244 6.83794 14.5473 7.20674 15.0391 7.2805C15.7521 7.37885 16.588 6.9117 16.8831 6.19869C17.2273 5.4365 17.006 4.6989 16.3422 4.20716C15.8504 3.83836 15.4079 3.44497 15.5062 2.70737C15.6046 1.79766 15.3833 1.62555 14.4736 1.77307C13.7605 1.89601 13.1951 1.89601 12.7279 1.15841C12.4329 0.691257 11.769 0.59291 11.4986 1.13382C11.0806 1.99435 10.4659 1.94518 9.72832 1.79766C9.06448 1.67473 8.67109 1.96977 8.8432 2.6582C8.99072 3.27287 8.86778 3.74001 8.4744 4.25633C7.88432 5.01852 8.15477 6.64125 8.8432 7.1084C9.5808 7.60013 10.3922 7.2805 11.0806 6.22327C11.1052 6.19869 11.1789 6.19869 11.3019 6.19869C11.8674 7.69848 11.0806 9.05075 10.3676 10.0834C9.212 11.6815 7.51551 12.8125 5.47481 13.1813C4.71263 13.3288 3.60622 12.8863 3.26201 12.2224C3.16366 12.0503 2.94238 11.8782 3.13907 11.6569C3.28659 11.4848 3.48329 11.6078 3.6554 11.6324C4.24548 11.7061 4.81097 11.6569 4.90932 10.9439C5.00767 10.2555 4.58969 9.83752 3.99961 9.64083C3.16366 9.37038 1.76222 9.96046 1.2459 10.6981C0.409946 11.952 0.582053 13.2305 1.39342 14.3123C2.18019 15.3695 1.95891 16.0334 1.22131 16.9923C-0.057202 18.615 1.0492 20.9016 3.11449 21.0737C3.8275 21.1228 4.04878 21.4425 3.85209 22.0817C3.63081 22.7947 3.43412 23.4586 3.77833 24.1962C3.87668 24.3929 3.8275 24.6879 3.8275 24.9092C3.80292 25.2534 3.75374 25.4255 3.26201 25.3272C1.73763 25.0075 1.54094 25.1551 0.53288 26.5565C-0.253896 27.6383 -0.106376 28.6464 0.704987 29.6544C1.14755 30.2199 1.63928 30.7117 2.25395 31.0559C2.84403 31.4001 2.96697 31.7197 2.3523 32.2115C1.2459 33.0966 0.75416 34.2276 0.827921 35.6536C0.926268 37.596 2.1556 38.6532 4.04878 38.2598C4.90932 38.0877 5.17977 37.5468 4.73721 36.7846C4.49135 36.3912 4.27006 36.0224 3.72916 35.9241C3.0899 35.8257 3.31118 35.4569 3.55705 35.1373C3.85209 34.7685 4.27006 34.6455 4.71263 34.6455C5.89279 34.621 7.02378 34.8422 7.95807 35.629C8.62192 36.1945 9.38411 36.7108 9.9496 37.3501C10.4905 37.9648 11.5969 38.4811 10.8101 39.6367C10.7118 39.7842 10.8347 39.9809 11.0068 40.1038C11.5232 40.5709 11.4002 41.0873 11.2527 41.6528C10.9577 41.579 10.9331 41.3823 10.8593 41.2348C10.4659 40.5464 9.85125 40.448 9.18741 40.6201C8.54816 40.7922 8.25312 41.284 8.22853 41.9232C8.20394 42.6608 8.17936 43.3738 8.79402 43.9639C8.99072 44.136 9.13824 44.4311 9.0153 44.7999C8.69568 45.8817 8.89237 46.0784 9.9496 45.9554C10.5889 45.8817 11.1298 45.8817 11.4494 46.6439C11.6953 47.2585 12.3591 47.1848 12.6541 46.7422C13.1951 45.8817 13.9081 45.9063 14.7194 46.0784C15.0882 46.1521 15.6291 46.0784 15.5308 45.6112C15.3095 44.6032 15.9488 44.1852 16.5388 43.6443C17.2273 43.005 17.1043 41.6282 16.3176 40.9397C15.58 40.3005 14.8424 40.448 14.1539 41.3085C14.0556 41.4315 13.9818 41.6528 13.6868 41.6528C13.5884 41.0381 13.318 40.448 14.0802 40.0055C14.3506 39.8333 14.3998 39.5137 14.1048 39.317C13.5147 38.9482 13.9327 38.6532 14.1293 38.3581C15.2358 36.6862 16.8831 35.7028 18.6287 34.8914C19.4893 34.4734 21.2349 34.6947 21.6775 35.1865C21.825 35.3586 22.0955 35.5553 21.9725 35.8011C21.8496 36.0716 21.6037 35.8503 21.407 35.8503C20.6694 35.8011 20.3252 36.2437 20.2023 36.8584C20.1039 37.473 20.399 37.9893 20.9645 38.1614C21.6775 38.3581 22.3905 38.309 23.1035 37.9402C24.9475 37.0305 24.4804 33.3179 23.0052 32.359C22.0709 31.8181 22.0463 31.4247 22.9806 31.0559ZM5.40105 27.958C5.15519 28.4989 4.41758 28.3022 3.97502 28.4005C3.36036 28.3513 2.77027 28.4497 2.47523 27.8104C2.37689 27.5892 2.27854 27.2695 2.74569 27.417C3.26201 27.5892 3.60622 27.3433 3.77833 26.9253C3.99961 26.3598 4.22089 26.3844 4.61428 26.7778C4.93391 27.1466 5.67151 27.3679 5.40105 27.958ZM19.4647 33.2933C17.3256 33.3179 15.162 33.2933 13.0229 33.2933C10.8347 33.2933 8.67109 33.2687 6.48287 33.2933C5.67151 33.2933 5.54857 33.0228 5.96655 32.4081C7.56469 29.9249 8.59733 27.122 10.1709 24.6142C10.343 24.3437 10.6134 24.0241 10.2692 23.7044C9.97419 23.4586 9.62997 23.5323 9.33493 23.7536C8.8432 24.0978 8.32688 24.147 7.76138 24.1224C7.34341 24.0978 7.1713 23.852 7.19589 23.4586C7.19589 23.0898 7.41717 22.8931 7.76138 22.8931C8.62192 22.8931 9.48245 22.8685 10.343 22.8931C10.9085 22.8931 11.2527 22.6718 11.5723 22.1555C12.6787 20.3606 13.4409 18.3691 14.744 16.6972C14.7686 16.6726 14.7686 16.6481 14.7932 16.6235C15.5554 15.2958 15.4324 15.0991 13.9327 15.0991C12.9 15.0991 11.8428 15.0991 10.8101 15.0991C10.0234 15.0991 9.23659 14.9762 8.57274 15.6646C8.30229 15.9596 7.81055 15.8613 7.41717 15.8121C7.12213 15.7875 6.99919 15.5908 6.97461 15.3204C6.95002 15.0253 6.99919 14.7549 7.34341 14.6565C7.5401 14.6074 7.76138 14.5828 7.98266 14.5828C11.1789 14.5828 14.3506 14.5828 17.5469 14.5582C18.2599 14.5582 18.4566 14.6811 18.1124 15.4187C17.5223 16.7464 16.6126 17.8528 15.9488 19.1313C15.4324 20.1148 14.9407 21.0737 14.449 22.0571C14.2031 22.5489 14.2277 22.8439 14.9161 22.8685C15.2849 22.8931 15.9979 22.6226 15.9734 23.1881C15.9488 23.7782 15.2112 23.5569 14.8178 23.5078C13.8097 23.434 13.2688 23.9257 12.8017 24.7371C11.474 27.0237 10.4659 29.4823 8.96613 31.6951C8.67109 32.1377 8.72026 32.5557 9.38411 32.5557C12.0886 32.5557 14.7932 32.5803 17.4731 32.5311C18.137 32.5311 18.6533 31.8427 19.3909 31.9902C19.8335 32.0639 20.4727 31.7935 20.4973 32.5803C20.5465 33.4654 19.9072 33.2933 19.4647 33.2933ZM21.0874 28.3759C20.6202 28.3022 19.9318 28.4743 19.7351 27.958C19.5384 27.4908 20.2023 27.1958 20.4727 26.8024C20.9399 26.1631 21.3087 25.9418 21.53 26.9745C21.6037 27.3187 21.8742 27.4416 22.2184 27.4416C22.3905 27.4416 22.6609 27.1712 22.7101 27.5646C22.7347 27.7858 22.6118 27.9825 22.4397 28.1055C22.0463 28.4251 21.5545 28.3513 21.0874 28.3759Z" fill="#57557B"/>
</svg>
