<svg width="113" height="67" viewBox="0 0 113 67" fill="none" xmlns="http://www.w3.org/2000/svg">
<path d="M111.976 50.1608C111.815 49.8379 111.562 49.7879 111.211 50.0158C110.863 50.2419 110.396 50.2799 109.809 50.1366C109.224 49.995 108.94 49.7102 108.957 49.2873C108.976 48.8678 108.854 48.4552 108.59 48.0599C108.327 47.6594 107.903 47.4972 107.32 47.5645C106.801 47.7457 106.448 47.927 106.256 48.1117C106.069 48.2947 106.001 48.5381 106.055 48.8419C106.108 49.1457 106.292 49.3546 106.607 49.4582C106.924 49.5617 107.135 49.7827 107.246 50.1193C107.358 50.4628 107.287 50.796 107.029 51.1309C106.773 51.4554 106.503 51.7558 106.202 52.0199C105.904 52.2823 105.655 52.543 105.456 52.7933C105.255 53.0487 105.013 53.2162 104.72 53.2921C104.433 53.3733 104.14 53.2991 103.853 53.0729C103.564 52.8451 103.571 52.5119 103.877 52.07C104.185 51.6298 104.502 51.3122 104.826 51.1171C105.155 50.9238 105.413 50.7701 105.594 50.6562C105.781 50.544 105.901 50.3972 105.958 50.2194C106.015 50.0399 105.975 49.8431 105.844 49.6222C105.714 49.4064 105.532 49.2424 105.304 49.1354C105.073 49.0283 104.767 49.1078 104.39 49.3701C104.012 49.6325 103.663 49.9674 103.346 50.3748C103.027 50.777 102.716 51.2552 102.403 51.8007C102.283 52.0113 102.191 52.2063 102.124 52.3893C102.055 52.4273 101.982 52.467 101.902 52.5084C101.551 52.6914 101.144 52.8399 100.675 52.9469C100.211 53.0557 99.7267 53.1454 99.2317 53.2248C98.7297 53.2991 98.2952 53.3319 97.9248 53.318C97.5544 53.3077 97.319 53.1748 97.2152 52.9296C97.1131 52.6776 97.1546 52.3738 97.3398 52.0096C97.525 51.6453 97.795 51.2897 98.1429 50.9393C98.496 50.5871 98.8976 50.323 99.3424 50.1452C99.7924 49.9691 100.31 49.7499 100.907 49.4944C101.501 49.2389 102.069 48.8782 102.614 48.4155C103.156 47.9494 103.725 47.4592 104.322 46.9413C104.918 46.4286 105.444 45.8434 105.904 45.2013C106.361 44.5557 106.64 44.0706 106.728 43.7391L106.648 43.3352C106.536 43.1695 106.38 43.0417 106.181 42.9416C105.984 42.8519 105.724 42.7759 105.404 42.7241L105.042 42.7621C104.454 43.2955 103.884 43.7305 103.334 44.0602C102.783 44.3899 102.164 44.875 101.475 45.5034C100.786 46.1369 100.073 46.8947 99.3442 47.782C98.6155 48.6641 98.0356 49.3166 97.5994 49.724C97.1667 50.1314 96.708 50.6113 96.2286 51.1671C95.7509 51.7213 95.4912 52.1856 95.4514 52.5533C95.4912 52.8364 95.5639 53.0867 95.6643 53.3077C95.7647 53.5355 95.917 53.7341 96.1247 53.9084C96.3272 54.0897 96.7876 54.214 97.5025 54.2744H98.8249C100.322 54.031 101.362 53.7859 101.942 53.5304C102.003 53.5027 102.06 53.4751 102.117 53.4475C102.278 53.8117 102.508 54.1242 102.811 54.3831C103.185 54.7128 103.697 54.8803 104.343 54.8855C104.976 54.6783 105.506 54.4056 105.941 54.0655C106.373 53.7254 106.794 53.3146 107.206 52.8416C107.618 52.3686 107.917 51.9923 108.108 51.7126C108.3 51.4399 108.746 51.3674 109.446 51.4917C110.147 51.6177 110.7 51.5849 111.102 51.3881C111.512 51.1879 111.772 51.0308 111.888 50.9099C112.006 50.7943 112.033 50.5423 111.976 50.1608ZM100.09 48.2308C100.384 47.9512 100.77 47.549 101.25 47.0259C101.731 46.508 102.186 46.0937 102.624 45.7916C103.057 45.4947 103.403 45.3187 103.668 45.2686C103.929 45.2185 104.073 45.2997 104.097 45.5172C104.123 45.733 103.993 46.023 103.702 46.3889C103.413 46.7497 103.003 47.1554 102.468 47.6007C101.932 48.0478 101.416 48.4086 100.926 48.69C100.431 48.9731 99.9171 49.1371 99.3805 49.1872C99.5588 48.8333 99.7976 48.5122 100.09 48.2308Z" fill="#2F2D5C"/>
<path d="M21.6589 47.0825C22.713 46.0744 23.5473 45.2044 24.1618 44.4707C24.7745 43.7405 25.1916 43.1346 25.4097 42.6547C25.6261 42.1766 25.742 41.7744 25.7542 41.4412V41.386C25.7542 41.0804 25.6849 40.7801 25.543 40.4866C25.3768 40.1793 25.1068 39.9187 24.7364 39.7012C24.3677 39.4871 23.9835 39.3214 23.5854 39.204C23.189 39.0918 22.7269 39.0417 22.1955 39.0642C21.6641 39.0814 21.2799 39.021 21.0445 38.8829C20.8056 38.7431 20.6204 38.5687 20.4888 38.3685C20.3556 38.1631 20.224 37.9974 20.0959 37.8782C19.9661 37.7574 19.7376 37.6659 19.4053 37.6021C19.1388 37.6659 18.9311 37.7402 18.7909 37.8351C18.6507 37.9231 18.4499 38.0958 18.1885 38.3581C17.9271 38.6205 17.6848 38.8208 17.4598 38.9606C17.2348 39.1022 16.9544 39.292 16.6151 39.5354C16.2776 39.7754 15.9038 40.1155 15.4935 40.5574C15.085 40.9976 14.6402 41.3255 14.1625 41.5413C13.6813 41.7588 13.0097 42.1541 12.1478 42.7255C11.2858 43.3004 10.5363 43.8113 9.89588 44.255C9.25719 44.7021 8.69292 45.1284 8.20135 45.5376C7.70806 45.945 7.12821 46.4715 6.46529 47.1171C5.80063 47.761 5.17232 48.3582 4.57863 48.9141C3.98148 49.4699 3.47606 49.9895 3.052 50.4642C2.63313 50.9407 2.16406 51.519 1.6448 52.2043C1.129 52.8862 0.808785 53.366 0.696278 53.6371C0.580309 53.9098 0.476457 54.1912 0.389913 54.4795C0.296446 54.7608 0.253174 55.0698 0.253174 55.3996C0.26529 55.7949 0.334525 56.0659 0.453955 56.2143C0.575117 56.3593 0.865904 56.4526 1.32632 56.4923C1.81096 56.4405 2.34753 56.2627 2.93776 55.9571C3.52626 55.6516 4.18745 55.2649 4.92135 54.7988C5.65697 54.3345 6.44278 53.8304 7.28053 53.2901C8.11827 52.7498 8.86428 52.2043 9.51509 51.664C10.1676 51.1219 10.7786 50.6196 11.355 50.1535C11.9314 49.6892 12.5199 49.1696 13.1188 48.6016C13.7211 48.0372 14.2265 47.5417 14.6333 47.1136C15.0452 46.6855 15.4468 46.2557 15.8518 45.8224C16.2569 45.3891 16.6584 44.9662 17.06 44.5588C17.4615 44.1514 17.8666 43.7388 18.2768 43.3159C18.6853 42.8999 19.0834 42.4424 19.4676 41.9504C19.8501 41.4585 20.1859 41.1426 20.4733 41.0027C20.7606 40.8646 21.0133 40.7386 21.2297 40.6299C21.4477 40.5246 21.6451 40.4987 21.8233 40.5556C22.0034 40.6109 22.3097 40.6661 22.7459 40.7179C23.1804 40.7662 23.4729 40.8836 23.6269 41.0632C23.781 41.2392 23.781 41.5689 23.6269 42.0454C23.4746 42.5236 23.2894 42.962 23.0713 43.3556C22.8567 43.7509 22.4586 44.2843 21.8839 44.9541C21.3075 45.6221 20.6931 46.2885 20.044 46.9514C19.3897 47.6125 18.8047 48.1321 18.2889 48.5015C17.7714 48.8727 17.349 49.0574 17.0236 49.0574C16.6965 49.0574 16.3797 48.8951 16.0734 48.5757C15.767 48.2598 15.4866 48.1062 15.2287 48.1183C14.976 48.1321 14.7493 48.2184 14.5502 48.3772C14.3512 48.536 14.2092 48.7294 14.1175 48.959C14.0275 49.1868 13.979 49.4423 13.9634 49.7168C13.9513 49.9895 13.9946 50.2623 14.0967 50.5402C14.2006 50.8147 14.384 51.0425 14.6454 51.2307C14.9068 51.4137 15.246 51.5276 15.6597 51.5742C16.0768 51.6174 16.5286 51.4896 17.0115 51.1893C17.4979 50.8906 18.1297 50.3848 18.9103 49.6702C19.6874 48.9503 20.6048 48.0872 21.6589 47.0825ZM16.5026 42.8481C16.1911 43.1467 15.7878 43.5817 15.2945 44.1479C14.8029 44.7141 14.384 45.2044 14.0396 45.6187C13.6934 46.0347 13.0218 46.7235 12.0249 47.685C11.0261 48.6482 10.0084 49.5252 8.97506 50.3175C7.93826 51.1099 6.95339 51.8193 6.01353 52.4477C5.07366 53.0795 4.28785 53.6319 3.65608 54.0997C3.02257 54.5727 2.53274 54.8523 2.17964 54.9335C1.83 55.0163 1.61191 54.9559 1.52883 54.7522C1.44575 54.5468 1.61537 54.2205 2.03598 53.7683C2.45831 53.316 2.83045 52.912 3.15758 52.5616C3.48299 52.2112 4.1788 51.4499 5.24675 50.2744C6.3147 49.1022 7.13687 48.265 7.71152 47.7592C8.28617 47.2586 8.71716 46.9255 9.00448 46.758C9.29181 46.5906 9.58259 46.4611 9.87684 46.3679C10.1711 46.2695 10.313 46.3403 10.2992 46.575C10.2853 46.8115 9.7903 47.3726 8.82274 48.2564C7.84999 49.1454 7.09359 49.7599 6.55183 50.1069C6.0066 50.4504 5.74524 50.7491 5.76601 51.0011C5.78505 51.26 5.86121 51.4361 5.99449 51.5311C6.1295 51.626 6.26797 51.5552 6.41682 51.3205C6.56395 51.0822 6.96897 50.7145 7.6319 50.2174C8.29828 49.7202 9.02871 49.085 9.82838 48.3082C10.6263 47.5314 11.3152 46.8322 11.8881 46.2125C12.461 45.5945 13.0772 44.9645 13.7298 44.3102C14.3806 43.6629 14.912 43.1951 15.3204 42.9223C15.7289 42.653 16.0872 42.4217 16.3936 42.237C16.7034 42.0506 16.8748 42.0298 16.9129 42.1783C16.9509 42.3233 16.8159 42.546 16.5026 42.8481Z" fill="#2F2D5C"/>
<path d="M79.1707 46.1382C79.4529 46.0174 79.7298 45.85 79.9964 45.6307C80.2646 45.4184 80.545 45.0921 80.841 44.6675C81.1335 44.2411 81.3118 43.8562 81.3776 43.5092C81.2374 43.0017 80.9968 42.6754 80.6489 42.5339C80.3027 42.394 79.8215 42.382 79.2123 42.4976C78.5961 42.6115 78.0405 42.7565 77.5437 42.9361C77.0452 43.1173 76.5034 43.3366 75.9253 43.5972C75.3438 43.8544 74.6306 44.2049 73.7842 44.6364C74.0162 44.2566 74.1927 43.9735 74.3122 43.7854C74.4333 43.6007 74.7068 43.3176 75.1257 42.9361C75.5515 42.5546 76.0292 42.1247 76.5744 41.6466C77.1196 41.1684 77.5835 40.6954 77.966 40.2328C78.3503 39.765 78.6047 39.3852 78.7224 39.0848C78.8471 38.7845 78.854 38.5117 78.7553 38.2718C78.6497 38.0267 78.5095 37.7798 78.3313 37.5174C78.1512 37.255 77.8137 37.0997 77.3152 37.0444C77.085 37.0582 76.7406 37.1981 76.2819 37.457C75.8198 37.7194 75.2174 38.113 74.4697 38.636C73.7202 39.1591 72.9638 39.708 72.197 40.2898C71.4285 40.868 70.6323 41.4619 69.8101 42.0661C68.9862 42.672 68.1589 43.3228 67.3263 44.0253C66.7828 44.4845 66.1995 44.9972 65.5799 45.5617C65.1506 45.3286 64.6383 45.1802 64.0394 45.1232C63.1757 45.0438 62.0576 44.9851 60.6832 44.9523C59.3089 44.923 57.9848 44.9178 56.7143 44.9454C55.4421 44.9696 54.144 45.0265 52.8216 45.1146C51.4975 45.2044 50.1855 45.3097 48.8821 45.4305C47.577 45.5513 46.3031 45.6877 45.0569 45.8241C43.8089 45.9622 42.8743 46.0727 42.2494 46.1486C42.7323 45.6238 43.1633 45.175 43.5406 44.8004C43.9162 44.4258 44.3109 44.0322 44.7194 43.6248C45.1261 43.2175 45.68 42.703 46.3775 42.0885C47.0768 41.4688 47.3018 41.001 47.0612 40.6816C46.6493 40.692 46.1664 40.8888 45.6108 41.2668C45.0552 41.6414 44.4684 42.1092 43.847 42.672C43.2274 43.2313 42.644 43.7526 42.1006 44.2411C41.5588 44.7227 40.8595 45.3666 40.0027 46.1745C39.5181 46.2608 39.0507 46.3316 38.6025 46.392C38.1542 46.449 37.8547 46.5353 37.7007 46.6492C37.5466 46.7631 37.4912 46.9409 37.5276 47.1861C37.5657 47.426 37.6851 47.5451 37.8824 47.5365C38.0815 47.533 38.4761 47.4916 39.0629 47.4139C38.6786 47.987 38.0849 48.6378 37.2801 49.3646C36.4735 50.0913 35.9594 50.6472 35.7361 51.0287C35.5786 51.3014 35.4436 51.5638 35.3328 51.8158C34.9953 51.966 34.6716 52.0955 34.367 52.206C33.9966 52.3406 33.4237 52.4856 32.6482 52.6444C31.8763 52.805 31.4314 52.786 31.3172 52.5857C31.203 52.3889 31.2116 52.1904 31.3466 51.985C31.4834 51.7813 31.7205 51.5552 32.0771 51.3083C32.4284 51.0597 32.7296 50.7525 32.9875 50.3917C33.2419 50.0257 33.396 49.7167 33.4479 49.4647C33.4981 49.2058 33.505 48.9727 33.4687 48.7656C33.4306 48.555 33.3285 48.4048 33.1606 48.3168C32.9927 48.227 32.7988 48.1752 32.5686 48.1614C31.9663 48.1614 30.7616 48.2563 30.2631 48.4393C29.7629 48.624 28.5911 49.0573 27.691 50.0206C27.3431 50.2467 26.8775 50.2847 26.289 50.1414C25.7057 49.9998 25.4201 49.715 25.4374 49.2921C25.4547 48.8726 25.3301 48.46 25.067 48.0647C24.8056 47.6642 24.3816 47.502 23.7965 47.5693C23.279 47.7506 22.9242 47.9318 22.7372 48.1165C22.5468 48.2995 22.4776 48.5429 22.5295 48.8467C22.5832 49.1505 22.7649 49.3594 23.0817 49.463C23.3967 49.5666 23.6113 49.7875 23.7221 50.1241C23.8329 50.4677 23.7619 50.8008 23.5075 51.1357C23.2496 51.4602 22.9744 51.7606 22.6784 52.0247C22.379 52.2871 22.1314 52.5478 21.9341 52.7981C21.7333 53.0536 21.4876 53.221 21.1985 53.297C20.9112 53.3781 20.6187 53.3039 20.3279 53.0777C20.0405 52.8499 20.0492 52.5167 20.3556 52.0748C20.6619 51.6346 20.9804 51.317 21.3058 51.1219C21.6329 50.9286 21.8891 50.7749 22.0743 50.661C22.2578 50.5488 22.379 50.4021 22.4361 50.2242C22.4897 50.0447 22.4534 49.8479 22.3236 49.627C22.1886 49.4112 22.0103 49.2472 21.7801 49.1402C21.5516 49.0331 21.247 49.1126 20.8696 49.3749C20.4888 49.6373 20.1409 49.9722 19.8224 50.3796C19.504 50.7818 19.1907 51.26 18.8774 51.8055C18.5658 52.3596 18.436 52.8136 18.4845 53.1727C18.6455 53.6577 18.9085 54.0651 19.2859 54.3879C19.6615 54.7176 20.1721 54.8851 20.8194 54.8903C21.4495 54.6831 21.9843 54.4104 22.417 54.0703C22.8515 53.7302 23.2704 53.3194 23.6806 52.8464C24.0943 52.3734 24.392 51.9971 24.5841 51.7174C24.7745 51.4447 25.2228 51.3722 25.9238 51.4965C26.1436 51.5362 26.3461 51.5586 26.5365 51.5655C26.0017 52.3941 25.5049 53.2814 25.1743 53.8718L25.8978 54.2982C26.765 53.1416 27.5872 51.9902 28.4959 51.0839C29.4028 50.1776 29.9775 49.6977 30.2216 49.6408C30.4621 49.5838 31.3033 49.6235 31.4314 49.7668C31.5595 49.9049 31.4972 50.1103 31.2497 50.3779C31.0004 50.6455 30.7045 50.8543 30.3583 51.0028C30.0121 51.1443 29.6867 51.3394 29.3803 51.5811C29.074 51.8262 28.8438 52.08 28.6915 52.3458C28.5357 52.6168 28.4889 52.8896 28.5461 53.1709C28.6049 53.4506 28.7503 53.6871 28.9892 53.877C29.2246 54.0703 29.4859 54.1894 29.7629 54.2326C30.0467 54.2757 30.4535 54.3016 30.9935 54.3016C31.7966 54.198 32.5652 53.9978 33.2921 53.6888C33.8149 53.4696 34.3912 53.2158 35.0213 52.931C35.0213 52.9413 35.0195 52.9534 35.0195 52.9621C35.0057 52.988 34.9988 53.0069 34.9988 53.0173C34.9988 53.2244 35.049 53.4523 35.1545 53.7078C35.2411 53.9892 35.4246 54.2153 35.6998 54.3862C35.9733 54.5588 36.354 54.6728 36.8404 54.7211C37.0204 54.7315 37.2056 54.7418 37.3943 54.7418C37.7024 54.7418 38.0295 54.7159 38.3757 54.6624C38.9105 54.5847 39.3952 54.4656 39.821 54.3016C40.2502 54.1359 40.6293 53.9581 40.9634 53.7648C41.1347 53.6664 41.3199 53.5438 41.5155 53.4005C41.6765 53.7872 41.9153 54.1186 42.2321 54.3897C42.606 54.7194 43.1166 54.8868 43.7639 54.892C44.3957 54.6848 44.9288 54.4121 45.3615 54.072C45.7977 53.732 46.2166 53.3211 46.6251 52.8481C47.0387 52.3751 47.3365 51.9988 47.5303 51.7192C47.7224 51.4464 48.1673 51.3739 48.8665 51.4982C49.5693 51.6242 50.1214 51.5914 50.5282 51.3946C50.9349 51.1944 51.1946 51.0373 51.3105 50.9165C51.4282 50.7974 51.4577 50.5471 51.3971 50.1656C51.2396 49.8428 50.9834 49.7927 50.6338 50.0206C50.2859 50.2467 49.8168 50.2847 49.2318 50.1414C48.6467 49.9998 48.3629 49.715 48.3802 49.2921C48.3992 48.8726 48.2763 48.46 48.0115 48.0647C47.7501 47.6642 47.3243 47.502 46.741 47.5693C46.2235 47.7506 45.8669 47.9318 45.6783 48.1165C45.4913 48.2995 45.4204 48.5429 45.474 48.8467C45.5277 49.1505 45.7129 49.3594 46.0279 49.463C46.3429 49.5666 46.5576 49.7875 46.6666 50.1241C46.7808 50.4677 46.7047 50.8008 46.4502 51.1357C46.1941 51.4602 45.9223 51.7606 45.6229 52.0247C45.3269 52.2871 45.0777 52.5478 44.8786 52.7981C44.6796 53.0536 44.4338 53.221 44.143 53.297C43.8557 53.3781 43.5649 53.3039 43.2776 53.0777C42.9868 52.8499 42.9954 52.5167 43.3018 52.0748C43.6081 51.6346 43.9266 51.317 44.252 51.1219C44.5774 50.9286 44.8336 50.7749 45.0171 50.661C45.2057 50.5488 45.3234 50.4021 45.3788 50.2242C45.4359 50.0447 45.3961 49.8479 45.2663 49.627C45.1365 49.4112 44.9548 49.2472 44.7263 49.1402C44.4944 49.0331 44.1932 49.1126 43.8159 49.3749C43.4351 49.6373 43.0889 49.9722 42.7704 50.3796C42.4519 50.7818 42.1386 51.26 41.8253 51.8055C41.7232 51.9867 41.6436 52.1542 41.5796 52.313C41.4722 52.3734 41.3597 52.4407 41.2334 52.5201C40.8491 52.7618 40.2035 53.038 39.2965 53.3522C38.3896 53.6646 37.7786 53.7924 37.4566 53.732C37.1364 53.6767 36.9183 53.5196 36.8058 53.2538C36.6881 52.9914 36.7089 52.6928 36.8629 52.3527C37.0152 52.0178 37.2679 51.6518 37.6176 51.2652C37.9707 50.875 38.3705 50.4107 38.8257 49.8686C39.281 49.3266 39.6756 48.8864 40.0062 48.5498C40.3368 48.2115 40.6172 47.9473 40.8387 47.7557C41.0603 47.5641 41.2749 47.4208 41.4722 47.3242C41.6696 47.2292 41.9205 47.1636 42.2304 47.1239C42.535 47.0877 42.9262 47.0497 43.4004 47.0186C43.8712 46.9858 44.6709 46.9271 45.7977 46.8374C46.921 46.7476 48.0046 46.6458 49.0483 46.5405C50.0903 46.4317 51.1877 46.3281 52.3456 46.2332C53.5018 46.1382 54.6425 46.083 55.7658 46.0727C56.8926 46.0588 57.9485 46.0381 58.9385 46.0053C59.932 45.9725 60.775 45.9466 61.4708 45.9276C62.1666 45.9121 62.7638 45.9156 63.264 45.9466C63.7625 45.9794 64.2315 46.0243 64.6643 46.0813C64.7716 46.0951 64.8823 46.1037 64.9966 46.1037C64.8581 46.2315 64.7196 46.3609 64.5794 46.4939C63.5755 47.4364 62.7984 48.2425 62.2514 48.9089C61.6993 49.5821 61.1713 50.0534 60.6677 50.3296C60.164 50.604 59.6136 50.9234 59.0095 51.2911L58.897 52.0782C59.3158 52.3441 59.7036 52.3924 60.0549 52.2215C60.4063 52.0472 60.7957 51.8107 61.2233 51.5034C61.6543 51.1978 62.0264 50.8837 62.3466 50.5591C62.6668 50.2346 63.0476 49.7858 63.4873 49.2092C63.9286 48.6361 64.5639 47.9732 65.3947 47.231C66.2272 46.4869 67.0442 45.7585 67.8491 45.0524C68.6557 44.3464 69.4311 43.7112 70.1788 43.1501C70.9266 42.5908 71.8855 41.8917 73.0555 41.0441C74.2256 40.2034 75.1291 39.5716 75.7713 39.1435C76.4082 38.7137 76.7873 38.5601 76.9102 38.6861C77.0331 38.8069 77.021 39.0572 76.8842 39.4387C76.7423 39.8237 76.4186 40.2829 75.9132 40.8283C75.4095 41.3687 74.8574 41.9418 74.2533 42.5459C73.6562 43.1519 73.0729 43.8044 72.512 44.507C71.9478 45.2078 71.496 45.6704 71.1498 45.8948C70.8019 46.1175 70.2567 46.48 69.509 46.9806C68.7612 47.4882 67.8837 48.0699 66.8763 48.7311C65.8655 49.3957 64.9897 50.0206 64.2471 50.6075C63.5046 51.1944 62.8815 51.7485 62.3778 52.2716C61.8724 52.7963 61.63 53.1882 61.6491 53.4489C61.6698 53.7061 61.791 53.896 62.0125 54.0133C62.2393 54.1273 62.4712 54.1963 62.7118 54.2239C62.9559 54.2516 63.2692 54.0703 63.6534 53.6871C64.0377 53.3039 64.46 52.9724 64.9204 52.6945C65.3791 52.4114 65.7841 52.1007 66.1268 51.7571C66.473 51.4136 67.1481 50.7887 68.152 49.8859C69.1524 48.9796 70.0404 48.2443 70.8054 47.6832C71.5704 47.1239 72.2005 46.7148 72.6851 46.4507C73.1698 46.1883 73.7669 45.8759 74.4697 45.5099C75.1707 45.1508 75.8994 44.7849 76.6454 44.4224C77.3931 44.0616 77.9816 43.8372 78.4091 43.7612C78.8384 43.687 79.0582 43.8303 79.0721 44.1928C79.0842 44.5553 78.8921 44.9178 78.4974 45.2734C78.101 45.629 77.7289 45.831 77.3827 45.8759C77.04 45.919 76.7458 46.0623 76.5017 46.3057C76.2594 46.5474 76.249 46.7269 76.4654 46.8426C76.6817 46.9582 76.9639 47.0307 77.3083 47.0704C77.6545 47.1084 77.9557 47.3414 78.2187 47.7678C78.4801 48.1942 78.5926 48.6913 78.5528 49.2524C78.5147 49.8134 78.3468 50.295 78.0474 50.6955C77.7462 51.0943 77.3879 51.4775 76.9725 51.8331C76.5554 52.1904 76.0603 52.5495 75.4874 52.9137C74.9093 53.2762 74.4108 53.5162 73.9798 53.6301C73.554 53.7458 73.2875 53.6508 73.1854 53.3539C73.085 53.0536 73.1559 52.7377 73.4086 52.4062C73.6562 52.0731 73.6492 51.7865 73.3879 51.5465C73.1248 51.2997 72.7907 51.2324 72.3874 51.3342C71.9859 51.4361 71.7055 51.6985 71.5445 52.1179C71.3852 52.5374 71.3922 53.1882 71.5635 54.0772C71.7366 54.9628 72.1122 55.4634 72.6851 55.5773C73.1196 55.5393 73.7427 55.3184 74.5562 54.9196C75.3663 54.5157 76.0984 54.0824 76.7406 53.6163C77.3862 53.1519 78.011 52.5875 78.6186 51.9229C79.2261 51.2617 79.6502 50.6178 79.8856 49.9947C80.1244 49.3698 80.1867 48.7828 80.0777 48.2304C79.9687 47.6832 79.7246 47.2275 79.3421 46.865C78.9422 46.5025 78.8903 46.2591 79.1707 46.1382Z" fill="#2F2D5C"/>
<path d="M95.0291 52.0576C94.8629 52.1767 94.6033 52.3235 94.2519 52.5099C93.9023 52.6929 93.492 52.8413 93.0264 52.9484C92.5574 53.0571 92.0762 53.1469 91.5742 53.2263C91.0792 53.3005 90.6413 53.3333 90.2726 53.3195C89.9022 53.3091 89.6651 53.1762 89.5647 52.9311C89.4626 52.6791 89.5024 52.3753 89.6893 52.011C89.8745 51.6468 90.1411 51.2912 90.4924 50.9407C90.8438 50.5886 91.2436 50.3245 91.6919 50.1467C92.1368 49.9706 92.6595 49.7514 93.2549 49.4959C93.8486 49.2404 94.4163 48.8796 94.9598 48.417C95.5016 47.9509 96.0711 47.4607 96.6665 46.9428C97.2602 46.4301 97.7881 45.8449 98.2468 45.2027C98.7089 44.5571 98.9841 44.0721 99.0741 43.7406L98.9997 43.3367C98.8837 43.171 98.7262 43.0432 98.5289 42.9431C98.3316 42.8533 98.0719 42.7774 97.7535 42.7256L97.3865 42.7636C96.7998 43.297 96.232 43.732 95.6799 44.0617C95.1329 44.3914 94.5133 44.8765 93.8209 45.5048C93.1303 46.1384 92.4206 46.8962 91.6937 47.7835C90.965 48.6656 90.3817 49.3181 89.9489 49.7255C89.5128 50.1329 89.0575 50.6128 88.5746 51.1686C88.2509 51.5432 88.0311 51.8764 87.9082 52.1681C87.7646 52.2233 87.5984 52.2924 87.4046 52.3822C87.0809 52.5375 86.6551 52.6791 86.1324 52.8154C85.6062 52.9484 84.9329 52.9915 84.1072 52.9484C83.2833 52.9035 82.752 52.8016 82.5131 52.6411C82.2812 52.4823 82.1808 52.3373 82.2275 52.2026C82.2708 52.0697 82.5875 51.9195 83.1743 51.7521C83.7611 51.5881 84.289 51.3153 84.7563 50.9407C85.2219 50.5644 85.4798 50.1173 85.5231 49.5995C85.5698 49.085 85.4452 48.726 85.1492 48.5206C84.855 48.3134 84.5105 48.2098 84.1142 48.1926L83.6762 48.215C83.2781 48.3151 82.8922 48.5068 82.5114 48.7864C82.1358 49.0695 81.7584 49.4009 81.3828 49.7842C81.0055 50.1657 80.732 50.5351 80.5659 50.8924C80.4014 51.2463 80.3201 51.7573 80.3201 52.4219C80.3928 52.8569 80.5226 53.1797 80.7026 53.3955C80.8791 53.6147 81.1319 53.7994 81.4607 53.9599C81.7827 54.1205 82.4162 54.2482 83.3474 54.3345H83.8649C84.72 54.2966 85.4469 54.1861 86.0389 54.01C86.6378 53.8305 87.1328 53.6302 87.5274 53.4058C87.6659 53.3281 87.8009 53.2349 87.9325 53.1262C87.955 53.19 87.9792 53.2505 88.0069 53.3091C88.1107 53.537 88.2631 53.7355 88.4656 53.9099C88.6698 54.0911 89.132 54.2154 89.8486 54.2758H91.1692C92.6664 54.0324 93.7049 53.7873 94.2848 53.5318C94.8698 53.2746 95.2558 52.957 95.4445 52.5738C95.3354 52.1163 95.1935 51.9454 95.0291 52.0576ZM92.4397 48.2306C92.7357 47.9509 93.1182 47.5487 93.5976 47.0256C94.0805 46.5078 94.534 46.0935 94.9702 45.7914C95.4064 45.4945 95.7543 45.3184 96.0157 45.2683C96.277 45.2183 96.4207 45.2994 96.4484 45.5169C96.4726 45.7327 96.3428 46.0227 96.0537 46.3887C95.7647 46.7494 95.3545 47.1551 94.8162 47.6005C94.2813 48.0476 93.7655 48.4084 93.274 48.6897C92.7824 48.9728 92.2666 49.1368 91.73 49.1869C91.91 48.833 92.1454 48.5119 92.4397 48.2306ZM82.4404 50.4401C82.5892 50.233 82.8575 50.0241 83.2574 49.8204C83.6537 49.6185 83.8701 49.6115 83.9099 49.8032C83.9463 49.9948 83.8338 50.2019 83.5724 50.4332C83.311 50.6646 82.79 50.908 82.0077 51.1617C82.1496 50.8924 82.2933 50.6525 82.4404 50.4401Z" fill="#2F2D5C"/>
<path d="M80.8479 21.7641V21.424C77.8362 21.6674 70.4177 22.1732 60.9429 22.1732C53.6507 22.1732 45.14 21.8694 36.4925 20.9199V23.0173H35.1718C35.1718 23.0173 36.3038 25.2718 37.3493 27.1188C32.3661 26.5129 30.3289 24.9956 30.3289 24.9956C30.3289 24.9956 32.0822 36.3473 59.3279 29.539C77.7341 24.9403 84.7441 27.1844 84.7441 27.1844C84.7441 27.1844 82.5425 25.3132 77.7445 24.1929C78.8055 23.4696 79.9358 22.6254 80.8479 21.7641Z" fill="#2F2D5C"/>
<path d="M26.7581 3.59353L26.2493 4.00782L37.7994 18.2251C37.4878 19.2574 37.133 20.2051 36.8041 20.5072L36.7176 20.6142C56.5448 22.7703 75.5931 21.517 80.8463 21.0941V20.887C80.8463 20.887 80.5936 20.1309 78.835 20.0998C77.0747 20.0705 76.2283 20.0998 76.2283 20.0998C76.2283 20.0998 74.97 18.7551 72.1434 18.4409C69.3152 18.1267 66.4264 17.816 66.4264 17.816C66.4264 17.816 63.1896 14.2755 57.412 13.7438C57.412 13.7438 57.3497 13.654 57.1956 13.5263C56.0463 13.3727 53.7356 13.1862 50.9679 13.6558C48.922 14.0062 45.3997 14.4395 42.4468 14.7795C43.4801 14.821 44.5689 14.8935 45.6195 15.0212C49.0536 15.4355 54.2618 18.0767 55.4595 18.705C58.7932 18.7861 64.2333 18.957 66.776 19.2108C69.7046 19.4991 69.7687 19.758 69.7687 19.758L46.7757 19.4007C46.7757 19.4007 49.1522 18.56 54.0818 18.6739C54.2773 18.6774 54.4868 18.6826 54.7118 18.686C52.8944 17.7694 48.5516 15.7048 45.5814 15.3458C43.6255 15.1093 41.5312 15.0592 39.937 15.0661C39.4195 15.1231 38.9539 15.1766 38.5696 15.2146C38.5662 15.2215 38.5645 15.2335 38.5627 15.2422L26.7581 0.708984L26.2493 1.12156L38.3741 16.0518C38.2771 16.4626 38.1542 16.9529 38.0158 17.4587L26.7581 3.59353ZM54.492 17.4069L49.9744 15.3699C52.2678 14.6173 55.4665 15.1818 55.4665 15.1818L59.264 17.4086H54.492V17.4069ZM60.6141 17.4069L56.6919 15.18L61.6543 15.3993C62.9715 15.8084 65.1421 17.4052 65.1421 17.4052H60.6141V17.4069Z" fill="#2F2D5C"/>
<path d="M56.5517 13.124C55.6845 12.7028 54.0298 12.2574 51.0025 12.4611C51.0025 12.4611 49.8705 11.3909 49.6541 11.2648C49.4343 11.1406 48.8995 10.8298 47.8938 10.8298C46.8882 10.8298 42.1456 10.8298 42.1456 10.8298L43.6549 13.2725L41.0776 13.3967V14.6051C44.2261 14.253 48.555 13.7351 50.9142 13.3329C53.2457 12.9358 55.2622 13.0014 56.5517 13.124ZM48.7004 12.6579C48.0721 12.9531 46.4382 13.4951 46.4382 13.4951L44.1344 11.2821H48.1119C48.1119 11.2821 48.6156 11.4064 48.9099 11.6981C49.2024 11.9899 49.327 12.3662 48.7004 12.6579Z" fill="#2F2D5C"/>
<path d="M67.6173 7.13051C69.9695 4.69134 74.5234 3.82822 74.5234 3.82822C70.1236 2.35056 67.2953 5.75298 67.2953 5.75298C62.9768 2.90123 59.0217 5.7806 59.0217 5.7806C63.2779 4.83807 67.6173 7.13051 67.6173 7.13051Z" fill="#2F2D5C"/>
<path d="M70.8469 8.79987C73.3532 8.73082 75.5497 10.4968 75.5497 10.4968C77.1456 9.37643 79.8094 9.38334 79.8094 9.38334C77.6527 8.2751 75.6968 9.73377 75.6968 9.73377C73.869 7.5777 70.8469 8.79987 70.8469 8.79987Z" fill="#2F2D5C"/>
<path d="M63.9095 29.9098C52.5047 32.9014 41.6694 33.2414 41.6694 33.2414C41.6694 33.2414 53.9517 36.2641 66.7377 32.2609C79.2433 28.3493 85.7549 29.4679 85.7549 29.4679C85.7549 29.4679 78.9594 25.9584 63.9095 29.9098Z" fill="#2F2D5C"/>
<path d="M21.1726 64.5818C21.4911 64.587 21.7023 64.6163 21.8061 64.6664C21.9671 64.7475 22.0467 64.9184 22.0467 65.1808V66.0905C22.0467 66.2683 22.0104 66.3995 21.9377 66.4858C21.8113 66.6412 21.5621 66.7171 21.1934 66.7171C20.5114 66.7171 20.051 66.4358 19.8139 65.873C19.575 65.3102 19.4573 64.6681 19.4573 63.9482C19.4573 63.0713 19.5854 62.3912 19.8416 61.9078C20.0977 61.4245 20.5045 61.1828 21.0636 61.1828C21.5759 61.1828 22.0363 61.4159 22.4413 61.8819C22.6577 62.134 22.8706 62.4809 23.08 62.9194H23.2999V60.9032H23.0593C23.0229 61.0361 22.9762 61.1328 22.9191 61.1984C22.8619 61.2639 22.7875 61.295 22.6958 61.295C22.6092 61.295 22.3877 61.2277 22.0329 61.0948C21.678 60.9619 21.3215 60.8945 20.9632 60.8945C20.07 60.8945 19.3362 61.1966 18.7615 61.8008C18.2059 62.3877 17.929 63.111 17.929 63.9707C17.929 64.8217 18.1972 65.5295 18.7321 66.094C19.3067 66.6981 20.0752 67.0002 21.0359 67.0002C21.5655 67.0002 22.045 66.9415 22.4725 66.8224C22.9 66.705 23.2099 66.5859 23.402 66.4686V65.3689C23.402 65.072 23.4504 64.8683 23.5474 64.7596C23.6443 64.6508 23.8416 64.5921 24.1411 64.5801V64.3608H21.1743V64.5818H21.1726Z" fill="#2F2D5C"/>
<path d="M31.3345 66.4581L29.4963 64.0016C29.8062 63.9447 30.1004 63.8169 30.3773 63.6132C30.7408 63.3439 30.9226 62.9745 30.9226 62.505C30.9226 61.8697 30.5764 61.4295 29.8823 61.1861C29.524 61.0653 29.0567 61.0049 28.4786 61.0049H25.6936V61.2241C25.9896 61.25 26.18 61.2949 26.2648 61.3622C26.3911 61.4623 26.4552 61.6798 26.4552 62.0113V65.8297C26.4552 66.1508 26.4015 66.3579 26.2942 66.4529C26.1869 66.5478 25.9879 66.6031 25.6936 66.6169V66.8361H28.617V66.6169C28.3124 66.6065 28.1099 66.5478 28.0078 66.4425C27.9057 66.3372 27.8555 66.1335 27.8555 65.8297V64.1397H27.8589L29.8771 66.8361H31.6824V66.629C31.6028 66.6238 31.537 66.61 31.4834 66.5893C31.4332 66.5685 31.383 66.5254 31.3345 66.4581ZM29.0723 63.6236C28.8282 63.7738 28.4232 63.8532 27.8572 63.8618V61.666C27.8572 61.5348 27.8935 61.4399 27.9645 61.3812C28.0372 61.3242 28.1878 61.2949 28.418 61.2949C28.8438 61.2949 29.1363 61.4589 29.2973 61.7886C29.3908 61.9819 29.4375 62.246 29.4375 62.5809C29.4375 63.1264 29.3163 63.4734 29.0723 63.6236Z" fill="#2F2D5C"/>
<path d="M38.6059 66.4045C38.4986 66.2561 38.3376 65.9298 38.1195 65.4206L36.1878 60.8857H35.9472L34.0242 65.6105C33.8719 65.985 33.756 66.225 33.6729 66.3355C33.5465 66.5098 33.3786 66.603 33.1692 66.6186V66.8378H34.9364V66.6186C34.7391 66.6151 34.592 66.5996 34.4933 66.5685C34.3271 66.5115 34.2441 66.4218 34.2441 66.2992C34.2441 66.1974 34.2821 66.0368 34.3583 65.8141C34.3947 65.7106 34.476 65.4862 34.6041 65.1444H36.5479L36.7677 65.6674C36.8162 65.7831 36.8542 65.8815 36.8819 65.9626C36.9269 66.1007 36.9494 66.2026 36.9494 66.2699C36.9494 66.4183 36.9044 66.5115 36.8162 66.5478C36.7279 66.584 36.5427 66.6082 36.2605 66.6203V66.8395H39.0628V66.6203C38.8655 66.6238 38.7132 66.553 38.6059 66.4045ZM34.7339 64.8008L35.5145 62.8036H35.5872L36.4198 64.8008H34.7339Z" fill="#2F2D5C"/>
<path d="M44.6865 61.2239C45.0067 61.2498 45.2196 61.324 45.3252 61.45C45.4325 61.5743 45.4845 61.7832 45.4845 62.0749V64.6108H45.4429L42.4675 61.0047H40.6328V61.2239C40.7401 61.2377 40.8249 61.2705 40.8855 61.3223C40.9478 61.3741 41.1105 61.5484 41.3754 61.8419V65.9296C41.3754 66.1523 41.3286 66.3197 41.2352 66.4337C41.1417 66.5476 40.9357 66.608 40.6138 66.6166V66.8359H42.5749V66.6166C42.2166 66.6028 41.9812 66.5062 41.8652 66.3284C41.7925 66.2179 41.7561 66.0315 41.7561 65.7656V62.3822H41.815L45.6229 66.9964H45.8635V61.9092C45.8635 61.6468 45.9085 61.4776 46.0003 61.4017C46.092 61.3257 46.272 61.2653 46.5437 61.2222V61.0029H44.6848V61.2239H44.6865Z" fill="#2F2D5C"/>
<path d="M55.4094 64.9994H55.3367L53.6335 61.0049H51.4526V61.2241C51.74 61.2466 51.9407 61.2949 52.0532 61.3691C52.1658 61.4433 52.2229 61.597 52.2229 61.8317V65.9316C52.2229 66.1594 52.1727 66.3303 52.0757 66.4443C51.9771 66.5582 51.7625 66.6169 51.4336 66.6186V66.8378H53.457V66.6186C53.09 66.6048 52.8546 66.5306 52.7473 66.3976C52.64 66.2647 52.5864 66.0541 52.5864 65.7658V61.8628H52.6244L54.7673 66.8361H54.9992L57.1212 61.7627H57.1853V65.9816C57.1853 66.2423 57.1195 66.4115 56.9914 66.4891C56.8616 66.5668 56.6695 66.61 56.4133 66.6169V66.8361H59.2866V66.6169C58.9941 66.6065 58.7933 66.5513 58.686 66.4529C58.5786 66.3545 58.525 66.1473 58.525 65.8297V62.0113C58.525 61.6781 58.5786 61.4692 58.686 61.3847C58.7933 61.3001 58.9923 61.2466 59.2866 61.2241V61.0049H57.1039L55.4094 64.9994Z" fill="#2F2D5C"/>
<path d="M66.2843 66.4045C66.177 66.2561 66.0161 65.9298 65.798 65.4206L63.8663 60.8857H63.6257L61.7027 65.6105C61.5504 65.985 61.4344 66.225 61.3513 66.3355C61.225 66.5098 61.0571 66.603 60.8477 66.6186V66.8378H62.6149V66.6186C62.4176 66.6151 62.2704 66.5996 62.1718 66.5685C62.0056 66.5115 61.9225 66.4218 61.9225 66.2992C61.9225 66.1974 61.9606 66.0368 62.0368 65.8141C62.0731 65.7106 62.1545 65.4862 62.2826 65.1444H64.2263L64.4461 65.6674C64.4946 65.7831 64.5327 65.8815 64.5604 65.9626C64.6054 66.1007 64.6279 66.2026 64.6279 66.2699C64.6279 66.4183 64.5829 66.5115 64.4946 66.5478C64.4063 66.584 64.2211 66.6082 63.939 66.6203V66.8395H66.7413V66.6203C66.544 66.6238 66.3916 66.553 66.2843 66.4045ZM62.4124 64.8008L63.193 62.8036H63.2657L64.0982 64.8008H62.4124Z" fill="#2F2D5C"/>
<path d="M73.9366 66.4581L72.0984 64.0016C72.4082 63.9447 72.7025 63.8169 72.9794 63.6132C73.3429 63.3439 73.5246 62.9745 73.5246 62.505C73.5246 61.8697 73.1785 61.4295 72.4844 61.1861C72.1261 61.0653 71.6587 61.0049 71.0806 61.0049H68.2957V61.2241C68.5916 61.25 68.782 61.2949 68.8668 61.3622C68.9932 61.4623 69.0572 61.6798 69.0572 62.0113V65.8297C69.0572 66.1508 69.0036 66.3579 68.8963 66.4529C68.789 66.5478 68.5899 66.6031 68.2957 66.6169V66.8361H71.2191V66.6169C70.9145 66.6065 70.712 66.5478 70.6098 66.4425C70.5077 66.3372 70.4575 66.1335 70.4575 65.8297V64.1397H70.461L72.4792 66.8361H74.2845V66.629C74.2049 66.6238 74.1391 66.61 74.0854 66.5893C74.0352 66.5685 73.9833 66.5254 73.9366 66.4581ZM71.6743 63.6236C71.4303 63.7738 71.0252 63.8532 70.4592 63.8618V61.666C70.4592 61.5348 70.4956 61.4399 70.5666 61.3812C70.6393 61.3242 70.7898 61.2949 71.0201 61.2949C71.4459 61.2949 71.7384 61.4589 71.8993 61.7886C71.9928 61.9819 72.0395 62.246 72.0395 62.5809C72.0395 63.1264 71.9166 63.4734 71.6743 63.6236Z" fill="#2F2D5C"/>
<path d="M75.7576 61.2241C76.0172 61.2345 76.1972 61.2673 76.2976 61.3208C76.4638 61.4071 76.5469 61.578 76.5469 61.8317V66.0127C76.5469 66.2682 76.4603 66.4408 76.2855 66.5306C76.1782 66.5841 76.0016 66.6134 75.7576 66.6186V66.8378H78.7832V66.6186C78.5132 66.6186 78.3106 66.5772 78.1739 66.496C78.0389 66.4149 77.9714 66.2526 77.9714 66.011V61.83C77.9714 61.5728 78.0562 61.4019 78.2241 61.3156C78.3262 61.2655 78.5114 61.2345 78.7814 61.2241V61.0049H75.7559V61.2241H75.7576Z" fill="#2F2D5C"/>
<path d="M84.405 61.2239C84.7252 61.2498 84.9381 61.324 85.0437 61.45C85.151 61.5743 85.203 61.7832 85.203 62.0749V64.6108H85.1614L82.186 61.0047H80.3513V61.2239C80.4586 61.2377 80.5434 61.2705 80.604 61.3223C80.6663 61.3741 80.829 61.5484 81.0939 61.8419V65.9296C81.0939 66.1523 81.0471 66.3197 80.9537 66.4337C80.8602 66.5476 80.6542 66.608 80.3323 66.6166V66.8359H82.2968V66.6166C81.9385 66.6028 81.7031 66.5062 81.5872 66.3284C81.5145 66.2179 81.4781 66.0315 81.4781 65.7656V62.3822H81.537L85.3449 66.9964H85.5855V61.9092C85.5855 61.6468 85.6322 61.4776 85.7222 61.4017C85.814 61.3257 85.994 61.2653 86.2657 61.2222V61.0029H84.4068V61.2239H84.405Z" fill="#2F2D5C"/>
<path d="M93.248 66.4045C93.1406 66.2561 92.9797 65.9298 92.7616 65.4206L90.8299 60.8857H90.5893L88.6663 65.6105C88.514 65.985 88.398 66.225 88.315 66.3355C88.1886 66.5098 88.0207 66.603 87.8113 66.6186V66.8378H89.5785V66.6186C89.3812 66.6151 89.2341 66.5996 89.1354 66.5685C88.9692 66.5115 88.8862 66.4218 88.8862 66.2992C88.8862 66.1974 88.9242 66.0368 89.0004 65.8141C89.0367 65.7106 89.1181 65.4862 89.2462 65.1444H91.1882L91.408 65.6674C91.4565 65.7831 91.4946 65.8815 91.5223 65.9626C91.5673 66.1007 91.5898 66.2026 91.5898 66.2699C91.5898 66.4183 91.5448 66.5115 91.4565 66.5478C91.3682 66.584 91.183 66.6082 90.9009 66.6203V66.8395H93.7032V66.6203C93.5076 66.6238 93.3553 66.553 93.248 66.4045ZM89.3777 64.8008L90.1583 62.8036H90.231L91.0636 64.8008H89.3777Z" fill="#2F2D5C"/>
</svg>
