<svg width="56" height="57" viewBox="0 0 56 57" fill="none" xmlns="http://www.w3.org/2000/svg">
<path d="M55.6394 26.4374C55.3768 22.952 54.5052 19.6217 52.977 16.4705C51.425 13.2477 49.3237 10.4307 46.6732 8.01955C44.9779 6.46782 43.1274 5.15482 41.0978 4.06861C38.2921 2.56462 35.3074 1.5739 32.1555 1.08451C31.2362 0.953212 30.2811 0.845784 29.3379 0.833848C29.3021 0.833848 29.2543 0.845784 29.2304 0.786102C29.111 0.786102 28.9917 0.786102 28.8723 0.786102C28.6693 0.869657 28.4544 0.809975 28.2514 0.798039C27.8933 0.786102 27.5351 0.869657 27.1889 0.786102C26.974 0.786102 26.7471 0.786102 26.5322 0.786102C26.3293 0.881593 26.1024 0.857721 25.8875 0.881593C23.7146 1.03677 21.5895 1.45454 19.5241 2.12298C16.599 3.06595 13.8889 4.46251 11.4294 6.31265C8.77899 8.30603 6.54641 10.6814 4.74363 13.4625C3.00054 16.1482 1.77082 19.0488 1.04255 22.1642C0.421722 24.7902 0.206821 27.452 0.362027 30.1496C0.529173 33.0621 1.15 35.8791 2.21257 38.6006C3.52585 41.9428 5.42415 44.9149 7.89551 47.5409C8.87451 48.5794 9.9132 49.5343 11.0355 50.3937C13.7456 52.4707 16.7184 54.0343 20.0016 55.0131C21.9238 55.598 23.8937 55.968 25.8995 56.1113C27.9768 56.2664 30.0542 56.1948 32.1197 55.8845C34.9492 55.4548 37.6593 54.6311 40.2262 53.3659C43.8557 51.5754 46.9478 49.1046 49.5147 45.9773C51.9861 42.9454 53.7411 39.5435 54.7679 35.7597C55.5917 32.704 55.8782 29.6005 55.6394 26.4374ZM19.7151 51.4083C19.7031 51.3128 19.7748 51.3248 19.8106 51.3248C20.0136 51.3009 20.0971 51.1696 20.0971 50.9786C20.0971 50.7041 20.0852 50.4176 20.0971 50.1431C20.0971 49.9879 20.0494 49.9521 19.9061 49.964C19.5718 49.976 19.2256 49.976 18.8913 49.964C18.7361 49.964 18.6764 49.9998 18.6883 50.1669C18.7003 50.4176 18.7003 50.6802 18.6883 50.9309C18.6764 51.1696 18.748 51.3248 19.0107 51.3486C19.0465 51.3486 19.0823 51.3606 19.0704 51.4322C18.6525 51.4322 18.2346 51.4322 17.8048 51.4322C17.8407 51.3128 17.9242 51.3606 17.9839 51.3367C18.1272 51.289 18.2108 51.1935 18.2108 51.0383C18.2108 50.2863 18.2108 49.5224 18.2108 48.7704C18.2108 48.6152 18.1391 48.5197 17.9839 48.4839C17.9242 48.472 17.8407 48.4958 17.7929 48.3884C18.2227 48.3884 18.6406 48.3884 19.0584 48.3884C19.0584 48.4123 19.0584 48.4481 19.0465 48.4481C18.7241 48.4958 18.6406 48.6988 18.6645 48.9972C18.6883 49.2001 18.6764 49.403 18.6645 49.6059C18.6645 49.7372 18.6883 49.7969 18.8316 49.785C19.1898 49.773 19.5479 49.773 19.9061 49.785C20.0374 49.785 20.0852 49.7372 20.0732 49.6059C20.0613 49.4388 20.0732 49.2717 20.0732 49.0927C20.0732 48.7943 20.1568 48.4362 19.5957 48.46C19.6196 48.4362 19.6554 48.4123 19.6793 48.3884C20.0971 48.3884 20.515 48.3884 20.9448 48.3884C20.9329 48.4242 20.9329 48.4481 20.9329 48.4481C20.5508 48.5794 20.5508 48.5794 20.5508 48.9733C20.5508 49.5462 20.5508 50.1311 20.5508 50.7041C20.5508 51.2054 20.5508 51.2054 20.9806 51.4322C20.5389 51.4083 20.1329 51.4083 19.7151 51.4083ZM25.6249 50.6325C25.3264 51.289 24.6339 51.6351 23.9415 51.4799C23.2013 51.3128 22.7356 50.6921 22.7356 49.8685C22.7476 49.2478 22.9625 48.7346 23.5475 48.4481C24.0967 48.1736 24.6578 48.2213 25.1592 48.5794C25.7443 48.9733 25.9472 49.9282 25.6249 50.6325ZM21.9238 45.7624C20.0136 46.2876 18.1033 46.1802 16.217 45.6908C14.653 45.285 13.2203 44.5807 12.0025 43.5184C10.2355 41.9786 9.18492 40.0329 8.75512 37.7292C8.54021 36.5833 8.46858 35.4374 8.55215 34.2796C8.85063 30.0899 10.7728 26.9507 14.5933 25.0886C16.4557 24.1814 18.4615 23.9427 20.5269 24.1456C20.9448 24.1934 20.9448 24.1934 20.9448 23.7756C20.9448 19.1681 20.9448 14.5488 20.9448 9.94131C20.9448 9.41611 20.8254 8.95059 20.4195 8.5925C20.1091 8.31796 19.727 8.17473 19.3211 8.11504C19.0943 8.07923 18.8674 8.03149 18.6406 8.05536C18.5212 8.0673 18.4854 8.00762 18.4734 7.90019C18.4257 7.42273 18.4257 7.42273 18.9152 7.42273C21.291 7.42273 23.6669 7.42273 26.0547 7.42273C26.2338 7.42273 26.389 7.39886 26.3651 7.6734C26.3412 8.05536 26.3651 8.05536 26.0427 8.05536C25.5294 8.05536 25.0399 8.15085 24.622 8.41345C24.0489 8.75961 23.8818 9.33256 23.8818 9.96518C23.8818 12.1615 23.8818 14.3697 23.8818 16.566C23.8818 16.6854 23.8818 16.8047 23.8818 16.9241C26.568 16.9241 29.2662 16.9241 31.9645 16.9241C32.1077 16.9241 32.3107 16.9838 32.3823 16.9122C32.4778 16.8286 32.4181 16.6257 32.4181 16.4705C32.4181 14.31 32.4181 12.1615 32.4181 10.001C32.4181 8.97446 31.9525 8.38958 30.9496 8.15085C30.675 8.09117 30.4004 8.04343 30.1139 8.05536C29.9348 8.0673 29.8632 8.00762 29.8871 7.81663C29.899 7.74502 29.899 7.68533 29.8871 7.61372C29.8632 7.45854 29.9348 7.4108 30.09 7.4108C32.5375 7.42273 34.985 7.42273 37.4325 7.42273C37.5399 7.42273 37.6952 7.36305 37.7429 7.47048C37.8145 7.62565 37.7907 7.8047 37.7548 7.97181C37.731 8.07923 37.6235 8.04343 37.5399 8.04343C37.1698 8.05536 36.7997 8.10311 36.4416 8.22247C35.6655 8.50894 35.2835 9.04608 35.2835 9.86969C35.2835 11.2662 35.2835 12.6747 35.2835 14.0713C35.2835 17.1986 35.2835 20.326 35.2715 23.4414C35.2715 23.6801 35.3432 23.7278 35.57 23.7278C38.9726 23.7159 42.3872 23.7278 45.7898 23.7159C45.9092 23.7159 46.0166 23.7159 46.2076 23.7159C45.4674 24.2172 44.775 24.6231 44.0109 24.9334C43.9273 24.9692 43.8318 24.9692 43.7363 24.9692C43.0199 24.9692 42.2917 24.9573 41.5753 24.9573C39.1995 24.9573 36.8355 24.8976 34.4597 24.9573C33.5643 24.9812 32.6688 25.0886 31.8451 25.4825C30.9138 25.9361 30.3408 26.7 30.0303 27.6668C29.899 28.0727 29.7796 28.4905 29.7319 28.9202C29.708 29.1111 29.6364 29.2066 29.4215 29.1828C29.2424 29.1589 29.0036 29.2424 28.8723 29.1589C28.7171 29.0515 28.8603 28.8127 28.8723 28.6456C28.9678 27.7623 29.0872 26.879 29.1827 26.0077C29.2662 25.3512 29.3498 24.7066 29.4215 24.0501C29.4453 23.8233 29.505 23.7159 29.7677 23.7278C30.5676 23.7517 31.3675 23.7278 32.1674 23.7398C32.3584 23.7398 32.4301 23.692 32.4301 23.4891C32.4181 21.7941 32.4181 20.1111 32.4301 18.4161C32.4301 18.2132 32.3584 18.1774 32.1794 18.1774C29.4811 18.1774 26.7949 18.1894 24.0967 18.1774C23.8818 18.1774 23.8698 18.2729 23.8698 18.44C23.8698 20.4453 23.8698 22.4506 23.8698 24.456C23.8698 24.9095 23.8698 24.9095 24.2877 25.0408C24.431 25.0766 24.5623 25.1125 24.7056 25.1602C25.5652 25.4347 26.0547 24.9692 26.3651 24.3724C26.4128 24.2888 26.4128 24.1456 26.5203 24.1337C26.6994 24.1098 26.8904 24.1217 27.0814 24.1337C27.1769 24.1456 27.1531 24.253 27.1531 24.3247C27.1769 24.9692 27.2008 25.6138 27.2127 26.2584C27.2724 27.8459 27.3202 29.4334 27.3918 31.009C27.4038 31.2 27.368 31.2597 27.165 31.2597C26.6397 31.2478 26.6516 31.2597 26.4845 30.7345C26.0069 29.2066 25.2667 27.8459 24.0012 26.8194C23.058 26.0674 21.9954 25.6019 20.8015 25.4706C19.4882 25.3154 18.1988 25.4109 16.9452 25.8645C15.8349 26.2703 14.9276 26.9626 14.2351 27.9294C13.1725 29.3857 12.6353 31.0329 12.3965 32.7995C12.1935 34.2557 12.1577 35.712 12.3487 37.1682C12.6114 39.0542 13.2442 40.7849 14.4978 42.2531C15.811 43.769 17.4586 44.5926 19.4763 44.6404C21.2433 44.6881 22.9386 44.4017 24.5145 43.5542C25.4458 43.0528 26.2934 42.4322 27.0217 41.6682C27.1769 41.5011 27.2724 41.5131 27.4157 41.6921C27.7619 42.1337 27.7858 42.1337 27.3918 42.5515C25.8398 44.1391 24.025 45.1895 21.9238 45.7624ZM30.1617 49.1285C30.0781 49.1523 30.0781 49.0569 30.0662 49.0091C30.0542 48.9733 30.0542 48.9375 30.0423 48.9136C29.9348 48.6033 29.4811 48.4003 29.1827 48.5436C29.0991 48.5794 29.111 48.651 29.111 48.7226C29.111 49.4746 29.111 50.2386 29.111 50.9905C29.111 51.2651 29.2901 51.3248 29.4931 51.3964C29.0752 51.3964 28.6574 51.3964 28.2037 51.3964C28.6335 51.2054 28.6335 51.2054 28.6335 50.7279C28.6335 50.0714 28.6335 49.4149 28.6335 48.7704C28.6335 48.5913 28.5738 48.5436 28.4066 48.5317C27.9649 48.5078 27.6903 48.6749 27.6425 49.1643C27.6187 49.1523 27.5948 49.1404 27.5709 49.1285C27.5709 48.8897 27.559 48.6391 27.5709 48.4003C27.5709 48.3049 27.6784 48.3287 27.7381 48.3287C28.4902 48.3287 29.2543 48.3287 30.0065 48.3287C30.1497 48.3287 30.2094 48.3765 30.2094 48.5197C30.2094 48.6868 30.2094 48.842 30.2214 49.0091C30.2094 49.0569 30.2333 49.1165 30.1617 49.1285ZM34.5313 50.8354C34.4 51.4441 34.4 51.4441 33.7792 51.4441C33.23 51.4441 32.6808 51.4441 32.1197 51.4441C32.0361 51.4441 31.9525 51.468 31.8809 51.4083C31.8809 51.3128 31.9645 51.3486 32.0122 51.3367C32.1794 51.3009 32.2749 51.2054 32.2749 51.0144C32.2749 50.2624 32.2749 49.5224 32.2868 48.7704C32.2868 48.5078 32.0958 48.472 31.8689 48.4242C31.9644 48.3049 32.06 48.3407 32.1435 48.3407C32.8002 48.3407 33.4568 48.3526 34.1015 48.3287C34.3045 48.3287 34.3642 48.3884 34.3403 48.5794C34.3403 48.5913 34.3403 48.5913 34.3403 48.6033C34.3284 48.7346 34.4119 48.9375 34.3045 48.9733C34.1732 49.021 34.197 48.7823 34.1015 48.7107C34.0299 48.651 33.9583 48.5794 33.8747 48.5675C33.5643 48.5197 33.2539 48.5317 32.9315 48.5555C32.8121 48.5555 32.7644 48.651 32.7644 48.7704C32.7644 49.033 32.7644 49.2956 32.7644 49.5582C32.7644 49.6775 32.8121 49.7253 32.9315 49.7253C33.039 49.7253 33.1464 49.7253 33.2658 49.7253C33.6001 49.7253 33.9463 49.7611 34.0418 49.2836C34.1135 49.6656 34.0896 50.0118 34.0657 50.3818C33.8508 49.7372 33.3255 49.976 32.9076 49.9282C32.7882 49.9163 32.7763 49.9879 32.7763 50.0834C32.7763 50.4057 32.7763 50.7279 32.7763 51.0502C32.7763 51.1935 32.8479 51.2412 32.9793 51.2412C33.23 51.2293 33.4926 51.2412 33.7434 51.2293C34.0538 51.2173 34.2687 51.0502 34.4 50.7876C34.4358 50.7279 34.4478 50.6205 34.5552 50.6563C34.603 50.6802 34.5433 50.7757 34.5313 50.8354ZM38.889 50.7757C38.7338 51.4441 38.7338 51.4441 38.0414 51.4441C37.5161 51.4441 36.9908 51.4441 36.4654 51.4441C36.3819 51.4441 36.2983 51.4322 36.2267 51.4322C36.2267 51.3964 36.2267 51.3725 36.2386 51.3606C36.6206 51.2531 36.6206 51.2531 36.6206 50.8354C36.6206 50.2266 36.6206 49.6179 36.6206 48.9972C36.6206 48.5436 36.6206 48.5436 36.2028 48.3765C36.4535 48.3049 37.3131 48.3049 37.4922 48.3765C37.4683 48.46 37.3847 48.4362 37.325 48.46C37.1698 48.5078 37.0982 48.6033 37.0982 48.7584C37.0982 49.4985 37.0982 50.2386 37.0982 50.9786C37.0982 51.1218 37.1579 51.1935 37.2773 51.2054C37.6355 51.2531 38.0056 51.2651 38.3637 51.1457C38.5667 51.0741 38.698 50.907 38.7816 50.716C38.8055 50.6563 38.8413 50.5966 38.9129 50.6325C38.9368 50.6563 38.901 50.7279 38.889 50.7757ZM46.8046 39.5674C46.6374 40.5343 46.53 41.5131 46.3748 42.4799C46.2673 43.1841 46.1718 43.9003 46.1002 44.6165C46.0763 44.8194 46.0166 44.8791 45.8017 44.8791C39.9994 44.8791 34.1851 44.8791 28.3828 44.8791C28.2992 44.8791 28.2156 44.8791 28.132 44.8791C29.1588 44.6643 30.0662 44.2226 30.9496 43.7213C31.0929 43.6377 31.2242 43.6019 31.3794 43.6019C34.1612 43.6139 36.9549 43.6258 39.7367 43.6497C40.8232 43.6616 41.8857 43.6258 42.9364 43.3274C43.8437 43.0648 44.572 42.5635 45.0854 41.7637C45.5271 41.0714 45.8136 40.3194 46.0285 39.5316C46.0882 39.3168 46.1718 39.2093 46.4106 39.2451C46.4583 39.2571 46.518 39.2571 46.5658 39.2451C46.8046 39.2093 46.8404 39.3406 46.8046 39.5674ZM28.1559 44.1868C28.5618 43.8645 28.8842 43.5542 29.1827 43.2319C30.4124 41.9308 31.654 40.6417 32.7882 39.2571C33.7672 38.0515 34.6985 36.8101 35.6536 35.5926C36.0715 35.0555 36.5132 34.5422 36.9549 34.0289C37.5638 33.3008 38.3876 32.8472 39.1636 32.334C39.7487 31.9401 40.3575 31.5462 41.0261 31.2836C41.1933 31.2239 41.3843 31.0926 41.5276 31.2239C41.6708 31.3552 41.5514 31.5462 41.5037 31.7013C40.7276 33.9693 39.6412 36.0581 37.8623 37.7412C36.6803 38.8632 35.4984 39.9852 34.2209 40.9998C32.7644 42.1576 31.2481 43.22 29.4931 43.8884C29.0872 44.0197 28.6693 44.1391 28.1559 44.1868ZM47.2583 23.9069C47.1627 24.3485 46.9717 24.7663 46.7688 25.1602C46.1599 26.3538 45.4316 27.4639 44.381 28.3233C43.9512 28.6695 43.4736 28.9082 42.9364 29.0515C40.8829 29.6363 39.0204 30.5674 37.3728 31.9401C35.8566 33.1934 34.5433 34.6496 33.4329 36.2849C32.3226 37.9083 31.2362 39.5435 30.0662 41.1311C29.911 41.3459 29.7438 41.5727 29.5528 41.7518C29.5289 41.7518 29.517 41.7518 29.4931 41.7637C29.4931 41.7398 29.505 41.716 29.505 41.704C29.7916 40.9282 30.0423 40.1284 30.293 39.3406C30.3766 39.078 30.4601 38.8154 30.5437 38.5528C30.5915 38.3977 30.5795 38.2664 30.484 38.1351C30.1139 37.6218 29.7796 37.0847 29.4095 36.5714C29.0155 36.0223 28.4783 35.6881 27.8216 35.5449C27.2724 35.4255 26.9023 35.7478 26.8785 36.3446C26.8785 36.4162 26.9262 36.5117 26.8307 36.5475C26.7591 36.5714 26.7113 36.4878 26.6636 36.4401C26.377 36.1417 26.2099 35.7836 26.1741 35.3778C26.1263 34.9122 26.4367 34.5899 26.974 34.6138C27.2844 34.6258 27.4276 34.5541 27.5112 34.2319C27.7978 33.1337 28.6215 33.0621 29.4931 33.3963C29.911 33.5634 30.293 33.8141 30.6034 34.1483C30.878 34.4467 31.2481 34.5422 31.6182 34.6258C31.7734 34.6616 31.7854 34.5422 31.8212 34.4586C32.1316 33.5515 32.4898 32.6682 32.9196 31.8088C33.7553 30.1019 34.8417 28.5859 36.3699 27.4281C37.2057 26.7955 38.1608 26.4135 39.1995 26.2584C40.4531 26.0674 41.7186 25.9599 42.9722 25.7332C44.381 25.4706 45.6107 24.8499 46.7688 24.0501C46.8762 23.9785 46.9717 23.9069 47.0792 23.8353C47.1269 23.7995 47.1866 23.7278 47.2583 23.7875C47.2941 23.7756 47.2702 23.8472 47.2583 23.9069Z" fill="#57557B"/>
<path d="M24.3358 48.4482C23.9896 48.4363 23.703 48.5556 23.512 48.854C23.1897 49.3554 23.2016 50.4058 23.5359 50.8951C23.8821 51.4084 24.503 51.4442 24.9089 50.9787C25.1954 50.6564 25.2193 50.2625 25.2551 49.8806C25.2432 49.5463 25.2074 49.2479 25.076 48.9615C24.9328 48.675 24.694 48.4721 24.3358 48.4482Z" fill="#57557B"/>
</svg>
