<svg width="292" height="292" viewBox="0 0 292 292" fill="none" xmlns="http://www.w3.org/2000/svg">
<mask id="mask0" mask-type="alpha" maskUnits="userSpaceOnUse" x="0" y="0" width="292" height="292">
<circle cx="146" cy="146" r="146" fill="black"/>
</mask>
<g mask="url(#mask0)">
<path d="M-165.799 361C-165.799 361 -232.985 332.358 -203.535 220.487C-174.085 108.615 -42.8072 166.197 -16.1524 103.425C10.6022 40.7533 7.10819 -105.349 118.919 -62.1368C230.729 -18.925 432.886 131.468 317.582 361H-165.799Z" fill="#E6E5F8"/>
<path d="M287.747 304.835C278.994 287.398 256.121 301.658 256.121 301.658L157.853 340.486L207.834 361.029C243.061 350.228 273.205 340.839 275.534 339.709C282.523 336.391 296.501 322.272 287.747 304.835Z" fill="#7075E2"/>
<path d="M102.577 136.608C102.577 136.608 88.5991 156.374 85.2105 208.332" stroke="#9795BF" stroke-miterlimit="10"/>
<path d="M174.231 229.299L179.878 256.125" stroke="white" stroke-miterlimit="10"/>
<path d="M205.998 290.999H148.958V296.434H205.998V290.999Z" fill="#5D5B80"/>
<path d="M139.004 139.784C139.004 139.784 131.733 146.138 131.733 151.785C131.733 157.433 149.875 166.61 165.618 158.633C181.361 150.656 176.772 138.372 168.512 136.608L139.004 139.784Z" fill="#48739E"/>
<path d="M209.74 135.972C209.74 135.972 240.66 150.656 256.827 221.251C256.827 221.251 263.463 245.606 245.602 249.348L171.83 256.972L166.606 231.417L217.858 221.745L199.01 171.835" stroke="#9795BF" stroke-miterlimit="10"/>
<path d="M88.8815 245.253C88.8815 249.277 85.6341 252.454 81.6808 252.454C77.6569 252.454 74.4801 249.206 74.4801 245.253C74.4801 241.229 77.7275 238.052 81.6808 238.052C85.6341 238.052 88.8815 241.3 88.8815 245.253Z" fill="#E3E3FC"/>
<path d="M69.7502 166.822L44.1242 190.401L-16.0226 157.08L-29.6475 176.141L35.2999 229.228C35.2999 229.228 49.3482 238.052 62.1259 227.039L83.4456 209.814" stroke="#9795BF" stroke-miterlimit="10"/>
<path d="M151.844 76.6138L120.443 94.7298V126.131L153.711 81.7741L151.844 76.6138Z" fill="#BD878D"/>
<path d="M153.711 81.7739L120.443 126.131V149.407C120.443 149.407 132.52 162.253 151.844 155.775C171.278 149.407 172.156 134.695 172.156 134.695L153.711 81.7739Z" fill="#EEBAC0"/>
<path d="M118.247 53.6669C114.624 57.9488 112.757 62.0112 112.757 62.0112C112.757 62.0112 101.778 85.5071 112.757 97.0355C123.737 108.564 145.256 92.9731 151.405 84.4092C152.503 82.9818 153.601 80.6762 154.589 77.9313L118.247 53.6669Z" fill="#EEBAC0"/>
<ellipse cx="132.07" cy="72.2109" rx="22.796" ry="31" transform="rotate(36.2001 132.07 72.2109)" fill="#EEBAC0"/>
<path d="M133.925 49.2529C133.925 49.2529 126.831 45.5251 131.718 35.1185C136.605 24.8672 145.118 36.9824 145.118 36.9824C145.118 36.9824 145.748 32.478 149.059 34.8078C152.37 37.1377 166.243 52.0487 162.301 62.1447C158.36 72.2407 154.104 68.2023 154.104 68.2023" fill="#191B4C"/>
<path d="M116.352 100.609C128.295 106.017 137.49 99.1802 142.774 93.0578L107.897 70.4047C104.515 79.6904 103.352 94.7925 116.352 100.609Z" fill="white"/>
<path d="M-24.2654 209.793L-117.81 157.971L-139 187.615L-37.9896 270.18C-37.9896 270.18 -16.1406 283.904 3.73207 266.776L36.8898 239.987L15.6996 173.122L-24.2654 209.793Z" fill="white"/>
<path d="M66.6441 126.131L15.5899 173.123L36.7801 239.987L39.6348 237.681C44.7951 156.873 66.6441 126.131 66.6441 126.131Z" fill="#9795BF"/>
<path d="M257.844 200.352V200.353V374.314H38.6029L40.0248 237.81C42.6578 197.454 49.4014 169.614 55.4789 151.875C58.5181 143.004 61.3909 136.658 63.5003 132.534C64.5551 130.473 65.419 128.967 66.0176 127.978C66.3168 127.484 66.5498 127.119 66.707 126.88C66.7486 126.816 66.7849 126.761 66.8157 126.715L146.25 118.947L233.188 125.635C233.207 125.643 233.229 125.653 233.254 125.664C233.348 125.708 233.489 125.775 233.672 125.867C234.038 126.053 234.572 126.341 235.233 126.748C236.554 127.563 238.383 128.854 240.393 130.749C244.411 134.537 249.164 140.748 252.046 150.427C254.885 160.09 256.337 172.563 257.077 182.643C257.447 187.678 257.639 192.107 257.738 195.277C257.788 196.862 257.814 198.132 257.828 199.005C257.836 199.442 257.839 199.779 257.842 200.007C257.843 200.121 257.843 200.208 257.844 200.266L257.844 200.332L257.844 200.348L257.844 200.351V200.352Z" fill="white" stroke="#9795BF"/>
<path d="M170.908 152V179.817" stroke="#9795BF" stroke-width="6" stroke-linecap="round" stroke-linejoin="round"/>
<path d="M157 165.908H184.817" stroke="#9795BF" stroke-width="6" stroke-linecap="round" stroke-linejoin="round"/>
<mask id="path-22-inside-1" fill="white">
<path d="M233.311 125.143C233.311 125.143 281.401 147.98 306.544 257.774C306.544 257.774 316.864 295.653 289.087 301.472L174.352 313.329L166.227 273.584L245.938 258.542L216.623 180.918"/>
</mask>
<path d="M233.311 125.143C233.311 125.143 281.401 147.98 306.544 257.774C306.544 257.774 316.864 295.653 289.087 301.472L174.352 313.329L166.227 273.584L245.938 258.542L216.623 180.918" fill="white"/>
<path d="M306.544 257.774L305.569 257.997L305.574 258.017L305.579 258.037L306.544 257.774ZM289.087 301.472L289.189 302.466L289.241 302.461L289.292 302.45L289.087 301.472ZM174.352 313.329L173.372 313.53L173.554 314.417L174.455 314.324L174.352 313.329ZM166.227 273.584L166.042 272.601L165.044 272.79L165.247 273.784L166.227 273.584ZM245.938 258.542L246.123 259.525L247.294 259.304L246.873 258.189L245.938 258.542ZM233.311 125.143C232.882 126.046 232.882 126.046 232.881 126.046C232.882 126.046 232.881 126.046 232.882 126.046C232.882 126.046 232.883 126.046 232.885 126.047C232.889 126.049 232.896 126.053 232.906 126.057C232.925 126.067 232.956 126.082 232.997 126.103C233.081 126.146 233.21 126.213 233.381 126.305C233.724 126.491 234.237 126.781 234.903 127.19C236.235 128.01 238.18 129.309 240.6 131.212C245.438 135.02 252.178 141.248 259.711 150.901C274.774 170.203 293.026 203.222 305.569 257.997L307.519 257.551C294.919 202.531 276.555 169.235 261.287 149.67C253.655 139.889 246.8 133.546 241.837 129.641C239.355 127.688 237.347 126.345 235.951 125.487C235.253 125.057 234.708 124.749 234.334 124.547C234.147 124.445 234.002 124.37 233.903 124.32C233.853 124.295 233.814 124.275 233.787 124.262C233.773 124.255 233.763 124.25 233.755 124.246C233.751 124.245 233.748 124.243 233.745 124.242C233.744 124.241 233.743 124.241 233.742 124.24C233.741 124.24 233.74 124.239 233.311 125.143ZM306.544 257.774C305.579 258.037 305.579 258.036 305.579 258.036C305.579 258.037 305.579 258.037 305.579 258.037C305.579 258.038 305.58 258.039 305.58 258.041C305.581 258.044 305.583 258.05 305.585 258.059C305.589 258.075 305.596 258.1 305.605 258.134C305.622 258.202 305.649 258.305 305.682 258.44C305.749 258.711 305.844 259.111 305.956 259.625C306.18 260.654 306.47 262.133 306.733 263.928C307.26 267.524 307.673 272.358 307.236 277.353C306.798 282.355 305.514 287.452 302.703 291.631C299.912 295.782 295.574 299.091 288.882 300.493L289.292 302.45C296.488 300.943 301.277 297.335 304.363 292.747C307.429 288.188 308.774 282.723 309.228 277.528C309.683 272.326 309.252 267.327 308.712 263.638C308.441 261.791 308.142 260.266 307.91 259.2C307.794 258.667 307.695 258.248 307.624 257.961C307.588 257.817 307.56 257.707 307.54 257.631C307.531 257.593 307.523 257.564 307.517 257.544C307.515 257.534 307.513 257.526 307.511 257.521C307.51 257.518 307.51 257.516 307.509 257.514C307.509 257.513 307.509 257.512 307.509 257.512C307.509 257.511 307.509 257.511 306.544 257.774ZM288.984 300.477L174.249 312.335L174.455 314.324L289.189 302.466L288.984 300.477ZM175.332 313.129L167.207 273.384L165.247 273.784L173.372 313.53L175.332 313.129ZM166.413 274.567L246.123 259.525L245.752 257.56L166.042 272.601L166.413 274.567ZM246.873 258.189L217.558 180.565L215.687 181.271L245.002 258.896L246.873 258.189Z" fill="#9795BF" mask="url(#path-22-inside-1)"/>
<path d="M154.15 373.496H-53.5803L-67.6339 229.337H139.986L154.15 373.496Z" fill="#5D5B80"/>
<path d="M217.062 181.906L222.332 263.812L245.938 258.103L217.062 181.906Z" fill="#9795BF"/>
<path d="M148.441 374.704H-59.2896L-73.3432 229.337H134.277L148.441 374.704Z" fill="#DAD9F1"/>
<path d="M168.533 284.454C168.533 284.454 163.373 285.771 149.758 280.94C139.877 277.427 139.218 279.184 140.535 281.709C142.622 285.442 147.013 287.638 147.013 287.638C147.013 287.638 136.144 284.344 126.811 290.492C126.811 290.492 124.835 293.347 126.592 293.567C130.764 293.896 136.144 291.151 140.426 293.567C140.426 293.567 134.607 292.908 128.129 296.97C121.541 301.033 138.559 298.288 139.657 299.715C140.755 301.033 129.007 301.472 127.799 304.656C126.701 307.84 139.657 304.656 139.657 304.656C139.657 304.656 132.301 308.938 132.301 310.804C132.301 312.561 145.586 309.926 145.586 309.926C145.586 309.926 157.444 312.451 161.286 308.608L172.595 308.169L168.533 284.454Z" fill="#EEBAC0"/>
</g>
</svg>
