<svg width="355" height="223" viewBox="0 0 355 223" fill="none" xmlns="http://www.w3.org/2000/svg">
<g filter="url(#filter0_ddddd)">
<rect x="80.6562" y="0.691528" width="194.145" height="42.1138" rx="6" fill="white"/>
<rect x="81.6562" y="1.69153" width="192.145" height="40.1138" rx="5" stroke="#B2A9BC" stroke-width="2"/>
</g>
<path d="M144.195 14.7684C140.816 14.7684 138.005 17.4895 138.005 20.8384C138.005 24.1874 140.816 26.8786 144.195 26.8786C146.019 26.8786 147.364 26.2805 148.441 25.1742C149.547 24.0678 149.876 22.5428 149.876 21.3169C149.876 20.9281 149.846 20.5693 149.786 20.2703H144.195V21.9149H148.171C148.052 22.8418 147.753 23.5296 147.274 24.008C146.706 24.5761 145.779 25.234 144.195 25.234C141.743 25.234 139.829 23.2605 139.829 20.8384C139.829 18.4164 141.743 16.4429 144.195 16.4429C145.51 16.4429 146.497 16.9512 147.185 17.639L148.351 16.4728C147.364 15.5159 146.048 14.7684 144.195 14.7684ZM154.331 19.1041C152.208 19.1041 150.444 20.7487 150.444 23.0512C150.444 25.3237 152.178 26.9982 154.331 26.9982C156.484 26.9982 158.218 25.3237 158.218 23.0512C158.218 20.7786 156.454 19.1041 154.331 19.1041ZM154.331 25.4433C153.165 25.4433 152.148 24.4565 152.148 23.0512C152.148 21.6458 153.165 20.659 154.331 20.659C155.497 20.659 156.514 21.6159 156.514 23.0512C156.514 24.4565 155.497 25.4433 154.331 25.4433ZM162.763 19.1041C160.611 19.1041 158.876 20.7487 158.876 23.0512C158.876 25.3237 160.611 26.9982 162.763 26.9982C164.886 26.9982 166.651 25.3237 166.651 23.0512C166.651 20.7786 164.916 19.1041 162.763 19.1041ZM162.763 25.4433C161.597 25.4433 160.581 24.4565 160.581 23.0512C160.581 21.6458 161.597 20.659 162.763 20.659C163.93 20.659 164.946 21.6159 164.946 23.0512C164.946 24.4565 163.96 25.4433 162.763 25.4433ZM171.166 19.1041C169.222 19.1041 167.458 20.8085 167.458 23.0213C167.458 25.2041 169.222 26.9085 171.166 26.9085C172.093 26.9085 172.81 26.4898 173.199 26.0114H173.259V26.5795C173.259 28.0746 172.481 28.882 171.196 28.882C170.149 28.882 169.521 28.1344 169.252 27.5065L167.757 28.1344C168.176 29.181 169.312 30.4369 171.196 30.4369C173.199 30.4369 174.874 29.2408 174.874 26.3702V19.3733H173.259V20.0012H173.199C172.81 19.5228 172.093 19.1041 171.166 19.1041ZM171.315 25.3835C170.149 25.3835 169.162 24.3967 169.162 23.0213C169.162 21.6458 170.149 20.6291 171.315 20.6291C172.481 20.6291 173.379 21.6458 173.379 23.0213C173.379 24.3967 172.481 25.3835 171.315 25.3835ZM176.129 15.2468H177.834V26.7889H176.129V15.2468V15.2468ZM182.409 19.1041C180.376 19.1041 178.671 20.6889 178.671 23.0512C178.671 25.2639 180.346 26.9982 182.588 26.9982C184.412 26.9982 185.459 25.8918 185.877 25.2639L184.532 24.3668C184.083 25.0247 183.455 25.4433 182.588 25.4433C181.691 25.4433 181.063 25.0546 180.675 24.2472L185.967 22.0644L185.788 21.6159C185.459 20.7487 184.442 19.1041 182.409 19.1041ZM180.376 22.9316C180.316 21.4066 181.572 20.6291 182.439 20.6291C183.126 20.6291 183.724 20.958 183.904 21.4664L180.376 22.9316Z" fill="#757575"/>
<path d="M188.957 26.6095L192.904 16.114H194.429L198.376 26.6095H196.881L195.864 23.7689H191.469L190.452 26.6095H188.957ZM191.917 22.513H195.416L193.711 17.7885H193.652L191.917 22.513Z" fill="#757575"/>
<path d="M199.751 25.7424C199.094 24.9948 198.765 24.0978 198.765 23.0213C198.765 21.9748 199.094 21.0777 199.751 20.3003C200.439 19.5527 201.217 19.1939 202.173 19.1939C202.712 19.1939 203.19 19.3135 203.609 19.5228C204.057 19.762 204.386 20.0312 204.625 20.4199H204.685L204.625 19.4331V16.114H205.971V26.6095H204.685V25.6228H204.625C204.386 25.9816 204.057 26.2806 203.609 26.5198C203.16 26.759 202.682 26.8487 202.173 26.8487C201.217 26.8487 200.409 26.4899 199.751 25.7424ZM203.997 24.9051C204.446 24.4267 204.655 23.7988 204.655 23.0213C204.655 22.2738 204.446 21.6458 203.997 21.1674C203.579 20.689 203.041 20.4498 202.383 20.4498C201.725 20.4498 201.187 20.689 200.768 21.1674C200.32 21.6458 200.11 22.2738 200.11 23.0213C200.11 23.7689 200.32 24.3968 200.768 24.8752C201.217 25.3537 201.755 25.5929 202.383 25.5929C203.041 25.6228 203.579 25.3836 203.997 24.9051Z" fill="#757575"/>
<path d="M212.191 26.1907C211.653 26.6093 210.965 26.8485 210.128 26.8485C209.41 26.8485 208.782 26.6691 208.214 26.2804C207.676 25.8917 207.287 25.4132 207.048 24.7853L208.244 24.277C208.423 24.6956 208.663 25.0544 209.021 25.2936C209.35 25.5328 209.739 25.6524 210.128 25.6524C210.546 25.6524 210.905 25.5627 211.204 25.3833C211.503 25.2039 211.623 24.9647 211.623 24.7255C211.623 24.277 211.264 23.9181 210.576 23.7088L209.35 23.4098C207.945 23.051 207.257 22.3932 207.257 21.3765C207.257 20.7187 207.526 20.2104 208.065 19.7917C208.603 19.403 209.29 19.1937 210.098 19.1937C210.726 19.1937 211.294 19.3432 211.832 19.6422C212.34 19.9412 212.699 20.3599 212.909 20.8682L211.713 21.3765C211.563 21.0775 211.354 20.8383 211.055 20.6589C210.756 20.4795 210.397 20.3898 210.008 20.3898C209.649 20.3898 209.35 20.4795 209.051 20.6589C208.782 20.8383 208.633 21.0476 208.633 21.3167C208.633 21.7353 209.021 22.0344 209.799 22.1839L210.875 22.453C212.311 22.8118 212.998 23.5294 212.998 24.6059C213.028 25.2338 212.729 25.7721 212.191 26.1907Z" fill="#757575"/>
<path d="M116.715 14.1355C116.935 13.5625 117.238 13.035 117.687 12.6075C119.483 10.8704 122.451 11.3069 123.67 13.4897C124.586 15.145 125.558 16.7639 126.502 18.401C128.078 21.1204 129.672 23.8399 131.23 26.5684C132.54 28.8512 131.12 31.7343 128.518 32.1254C126.923 32.3619 125.43 31.6343 124.605 30.2155C123.221 27.8235 121.828 25.4315 120.445 23.0486C120.417 22.994 120.381 22.9485 120.344 22.9031C120.197 22.7848 120.133 22.612 120.041 22.4574C119.428 21.3842 118.795 20.3201 118.181 19.256C117.787 18.5647 117.375 17.8826 116.981 17.1914C116.624 16.5729 116.459 15.8999 116.477 15.1905C116.504 14.8267 116.55 14.4629 116.715 14.1355Z" fill="#3C8BD9"/>
<path d="M116.719 14.2285C116.636 14.5557 116.563 14.8828 116.545 15.2281C116.517 15.9915 116.71 16.7003 117.094 17.3637C118.101 19.0813 119.109 20.8079 120.107 22.5346C120.198 22.6891 120.271 22.8435 120.363 22.9889C119.814 23.9341 119.264 24.8701 118.706 25.8152C117.937 27.1329 117.168 28.4597 116.389 29.7774C116.353 29.7774 116.343 29.7592 116.334 29.7319C116.325 29.6592 116.353 29.5956 116.371 29.5229C116.746 28.1598 116.435 26.9511 115.492 25.9151C114.915 25.2881 114.183 24.9337 113.34 24.8156C112.241 24.6611 111.271 24.9428 110.401 25.6243C110.245 25.7425 110.145 25.9151 109.962 26.006C109.925 26.006 109.907 25.9878 109.897 25.9606C110.337 25.2063 110.767 24.452 111.207 23.6978C113.02 20.5716 114.833 17.4455 116.655 14.3285C116.673 14.2921 116.701 14.2649 116.719 14.2285Z" fill="#FABC04"/>
<path d="M109.976 25.9496C110.154 25.7962 110.323 25.6337 110.511 25.4893C112.791 23.7562 116.216 25.0109 116.713 27.7549C116.835 28.4138 116.77 29.0456 116.563 29.6775C116.554 29.7316 116.544 29.7768 116.526 29.8309C116.441 29.9753 116.366 30.1288 116.272 30.2732C115.437 31.6001 114.208 32.259 112.594 32.1597C110.745 32.0333 109.291 30.6974 109.037 28.9283C108.915 28.0708 109.094 27.2674 109.553 26.5273C109.647 26.3648 109.76 26.2204 109.863 26.0579C109.91 26.0218 109.891 25.9496 109.976 25.9496Z" fill="#34A852"/>
<rect x="232.688" y="13.3258" width="29.9008" height="16.6704" rx="8.33518" fill="#74C225"/>
<circle cx="253.989" cy="21.6609" r="6.74753" fill="white"/>
<circle cx="96.238" cy="21.7486" r="6.94797" fill="#74C225" stroke="white" stroke-width="8"/>
<defs>
<filter id="filter0_ddddd" x="0.65625" y="0.691528" width="354.145" height="222.114" filterUnits="userSpaceOnUse" color-interpolation-filters="sRGB">
<feFlood flood-opacity="0" result="BackgroundImageFix"/>
<feColorMatrix in="SourceAlpha" type="matrix" values="0 0 0 0 0 0 0 0 0 0 0 0 0 0 0 0 0 0 127 0"/>
<feOffset dy="3.43489"/>
<feGaussianBlur stdDeviation="1.37396"/>
<feColorMatrix type="matrix" values="0 0 0 0 0.176471 0 0 0 0 0.203922 0 0 0 0 0.552941 0 0 0 0.0124007 0"/>
<feBlend mode="normal" in2="BackgroundImageFix" result="effect1_dropShadow"/>
<feColorMatrix in="SourceAlpha" type="matrix" values="0 0 0 0 0 0 0 0 0 0 0 0 0 0 0 0 0 0 127 0"/>
<feOffset dy="8.6871"/>
<feGaussianBlur stdDeviation="3.47484"/>
<feColorMatrix type="matrix" values="0 0 0 0 0.176471 0 0 0 0 0.203922 0 0 0 0 0.552941 0 0 0 0.0177484 0"/>
<feBlend mode="normal" in2="effect1_dropShadow" result="effect2_dropShadow"/>
<feColorMatrix in="SourceAlpha" type="matrix" values="0 0 0 0 0 0 0 0 0 0 0 0 0 0 0 0 0 0 127 0"/>
<feOffset dy="17.7209"/>
<feGaussianBlur stdDeviation="7.08835"/>
<feColorMatrix type="matrix" values="0 0 0 0 0.176471 0 0 0 0 0.203922 0 0 0 0 0.552941 0 0 0 0.0222516 0"/>
<feBlend mode="normal" in2="effect2_dropShadow" result="effect3_dropShadow"/>
<feColorMatrix in="SourceAlpha" type="matrix" values="0 0 0 0 0 0 0 0 0 0 0 0 0 0 0 0 0 0 127 0"/>
<feOffset dy="36.5016"/>
<feGaussianBlur stdDeviation="14.6007"/>
<feColorMatrix type="matrix" values="0 0 0 0 0.176471 0 0 0 0 0.203922 0 0 0 0 0.552941 0 0 0 0.0275993 0"/>
<feBlend mode="normal" in2="effect3_dropShadow" result="effect4_dropShadow"/>
<feColorMatrix in="SourceAlpha" type="matrix" values="0 0 0 0 0 0 0 0 0 0 0 0 0 0 0 0 0 0 127 0"/>
<feOffset dy="100"/>
<feGaussianBlur stdDeviation="40"/>
<feColorMatrix type="matrix" values="0 0 0 0 0.176471 0 0 0 0 0.203922 0 0 0 0 0.552941 0 0 0 0.04 0"/>
<feBlend mode="normal" in2="effect4_dropShadow" result="effect5_dropShadow"/>
<feBlend mode="normal" in="SourceGraphic" in2="effect5_dropShadow" result="shape"/>
</filter>
</defs>
</svg>
