{
    "key": "group_5eebb532b37d4",
    "title": "Category Options",
    "fields": [
        {
            "key": "field_5eebb53946db3",
            "label": "Badge color",
            "name": "category_badge_color",
            "type": "color_picker",
            "instructions": "",
            "required": 0,
            "conditional_logic": 0,
            "wrapper": {
                "width": "",
                "class": "",
                "id": ""
            },
            "default_value": ""
        },
        {
            "key": "field_5eebb5e40578f",
            "label": "Badge icon",
            "name": "category_badge_icon",
            "type": "font-awesome",
            "instructions": "",
            "required": 0,
            "conditional_logic": 0,
            "wrapper": {
                "width": "",
                "class": "",
                "id": ""
            },
            "icon_sets": [
                "fas",
                "far"
            ],
            "custom_icon_set": "",
            "default_label": "",
            "default_value": "",
            "save_format": "class",
            "allow_null": 0,
            "show_preview": 1,
            "enqueue_fa": 0,
            "fa_live_preview": "",
            "choices": []
        }
    ],
    "location": [
        [
            {
                "param": "taxonomy",
                "operator": "==",
                "value": "category"
            }
        ]
    ],
    "menu_order": 0,
    "position": "normal",
    "style": "default",
    "label_placement": "top",
    "instruction_placement": "label",
    "hide_on_screen": "",
    "active": 1,
    "description": "",
    "modified": 1592506019
}