<svg width="465" height="325" viewBox="0 0 465 325" fill="none" xmlns="http://www.w3.org/2000/svg">
<path d="M458.939 22.6251H321.061V276.918H458.939V22.6251Z" fill="white"/>
<path d="M458.939 12.0295H321.061V22.6251H458.939V12.0295Z" fill="#8F8CBA"/>
<path d="M465 9.00244H315V12.0297H465V9.00244Z" fill="#8F8CBA"/>
<path d="M458.939 48.3574H321.061V51.3847H458.939V48.3574Z" fill="#8F8CBA"/>
<path d="M463.485 149.772H316.515V154.313H463.485V149.772Z" fill="#8F8CBA"/>
<path d="M347.727 63.6451V85.8958H341.97V77.1166H334.394V85.8958H328.636V63.6451H334.394V71.8189H341.97V63.6451H347.727Z" fill="#8F8CBA"/>
<path d="M363.333 84.8361C361.515 83.9279 360.151 82.5656 359.242 80.7493C358.182 79.0842 357.727 76.9651 357.727 74.846C357.727 72.5755 358.182 70.6078 359.242 68.9428C360.303 67.2778 361.666 65.9155 363.333 64.8559C365.151 63.9477 367.121 63.3423 369.394 63.3423C371.666 63.3423 373.636 63.7964 375.454 64.8559C377.273 65.7641 378.636 67.1264 379.545 68.9428C380.606 70.6078 381.06 72.7269 381.06 74.846C381.06 77.1165 380.606 79.0842 379.545 80.7493C378.485 82.4143 377.121 83.7766 375.454 84.8361C373.636 85.7443 371.666 86.3498 369.394 86.3498C367.121 86.1984 365.151 85.7443 363.333 84.8361ZM373.485 79.0842C374.545 78.0247 375 76.511 375 74.846C375 73.0296 374.545 71.6674 373.485 70.6078C372.424 69.5482 371.06 68.9428 369.394 68.9428C367.727 68.9428 366.363 69.5482 365.303 70.6078C364.242 71.6674 363.788 73.181 363.788 74.9974C363.788 76.8138 364.242 78.1761 365.303 79.2356C366.363 80.2952 367.727 80.9006 369.394 80.9006C371.06 80.7493 372.424 80.1438 373.485 79.0842Z" fill="#8F8CBA"/>
<path d="M405.303 68.7914H400V85.8957H394.242V68.7914H388.939V63.645H405.454V68.7914H405.303Z" fill="#8F8CBA"/>
<path d="M428.788 80.7492V85.8957H414.545V63.645H428.485V68.7914H420.303V72.1214H427.727V77.2679H420.303V80.7492H428.788Z" fill="#8F8CBA"/>
<path d="M453.03 80.7492V85.8957H439.091V63.645H444.848V80.7492H453.03Z" fill="#8F8CBA"/>
<path d="M355.909 101.335H331.667V139.176H355.909V101.335Z" fill="#8F8CBA"/>
<path d="M345.303 96.7939H342.273V143.717H345.303V96.7939Z" fill="white"/>
<path d="M366.515 119.499H321.061V121.012H366.515V119.499Z" fill="white"/>
<path d="M401.364 101.335H377.121V139.176H401.364V101.335Z" fill="#8F8CBA"/>
<path d="M390.758 96.7939H387.727V143.717H390.758V96.7939Z" fill="white"/>
<path d="M411.97 119.499H366.515V121.012H411.97V119.499Z" fill="white"/>
<path d="M446.818 101.335H422.576V139.176H446.818V101.335Z" fill="#8F8CBA"/>
<path d="M436.212 96.7939H433.182V143.717H436.212V96.7939Z" fill="white"/>
<path d="M457.424 119.499H411.97V121.012H457.424V119.499Z" fill="white"/>
<path d="M355.909 195.181H331.667V233.022H355.909V195.181Z" fill="#8F8CBA"/>
<path d="M345.303 192.154H342.273V237.563H345.303V192.154Z" fill="white"/>
<path d="M366.515 213.345H321.061V216.372H366.515V213.345Z" fill="white"/>
<path d="M446.818 195.181H422.576V233.022H446.818V195.181Z" fill="#8F8CBA"/>
<path d="M436.212 192.154H433.182V237.563H436.212V192.154Z" fill="white"/>
<path d="M457.424 213.345H411.97V216.372H457.424V213.345Z" fill="white"/>
<path d="M355.909 169.449H331.667V186.099H355.909V169.449Z" fill="#8F8CBA"/>
<path d="M401.363 169.449H377.121V186.099H401.363V169.449Z" fill="#8F8CBA"/>
<path d="M401.363 195.328H377.121V211.978H401.363V195.328Z" fill="#8F8CBA"/>
<path d="M446.818 169.449H422.576V186.099H446.818V169.449Z" fill="#8F8CBA"/>
<path d="M400.606 218.548H376.364V276.066H400.606V218.548Z" stroke="#B5B4D0" stroke-miterlimit="10"/>
<path d="M398.182 222.483H379.394V242.615H398.182V222.483Z" fill="#8F8CBA"/>
<path d="M398.182 253.513H379.394V273.645H398.182V253.513Z" stroke="#B5B4D0" stroke-miterlimit="10"/>
<path d="M398.788 247.458C398.788 248.972 397.576 250.183 396.061 250.183C394.545 250.183 393.333 248.972 393.333 247.458C393.333 245.945 394.545 244.734 396.061 244.734C397.576 244.734 398.788 245.945 398.788 247.458Z" stroke="#B5B4D0" stroke-miterlimit="10"/>
<path d="M30.2675 309.037C30.2675 313.614 26.5854 317.293 22.0032 317.293C17.421 317.293 13.7389 313.614 13.7389 309.037C13.7389 304.459 17.421 300.781 22.0032 300.781C26.5854 300.781 30.2675 304.459 30.2675 309.037Z" fill="#8682C0"/>
<path d="M69.5436 309.037C69.5436 313.614 65.8615 317.293 61.2793 317.293C56.6971 317.293 53.0149 313.614 53.0149 309.037C53.0149 304.459 56.6971 300.781 61.2793 300.781C65.8615 300.781 69.5436 304.459 69.5436 309.037Z" fill="#8682C0"/>
<path d="M60.7065 200.726C60.7065 206.366 56.1243 211.026 50.8875 211.026H23.2306C18.0756 211.026 14.0662 206.366 14.0662 200.726V137.538C14.0662 131.897 17.9938 127.647 23.2306 127.647H50.8875C56.0425 127.647 60.7065 131.897 60.7065 137.538V200.726ZM57.4335 137.211C57.4335 133.451 54.6515 130.099 51.2148 130.099H22.9033C19.4666 130.099 16.5209 133.451 16.5209 137.211V200.971C16.5209 204.731 19.4666 207.674 22.9033 207.674H51.2148C54.6515 207.674 57.4335 204.731 57.4335 200.971V137.211Z" fill="#8682C0"/>
<path d="M50.8875 129.363C50.8875 131.571 49.0873 133.369 46.8781 133.369H26.2581C24.0489 133.369 22.2487 131.571 22.2487 129.363V129.282C22.2487 127.075 24.0489 125.276 26.2581 125.276H46.7962C49.0055 125.276 50.8057 127.075 50.8057 129.282V129.363H50.8875Z" fill="#484576"/>
<path d="M77.8898 296.53C77.8898 301.271 74.044 305.031 69.38 305.031H8.66573C4.0017 305.031 0.155922 301.189 0.155922 296.53V203.996C0.155922 199.254 4.0017 195.494 8.66573 195.494H69.2981C74.044 195.494 77.808 199.336 77.808 203.996V296.53H77.8898Z" fill="#484576"/>
<path d="M45.0779 277.565C45.0779 280.508 43.1141 282.96 40.7412 282.96H10.7932C8.42025 282.96 6.45645 280.59 6.45645 277.565V220.099C6.45645 217.156 8.42025 214.704 10.7932 214.704H40.7412C43.1141 214.704 45.0779 217.075 45.0779 220.099V277.565Z" fill="#8682C0"/>
<path d="M31.6647 231.462H17.7423C14.3563 231.462 11.6115 234.207 11.6115 237.592C11.6115 240.978 14.3563 243.723 17.7423 243.723H31.6647C35.0506 243.723 37.7955 240.978 37.7955 237.592C37.7955 234.207 35.0506 231.462 31.6647 231.462Z" fill="white"/>
<path d="M234.83 101.652C234.83 101.652 231.885 98.8729 234.83 95.8484C237.858 92.8239 232.294 90.2081 229.921 93.6413C227.548 97.0746 229.021 102.878 229.021 102.878L234.83 101.652Z" fill="#9795BF"/>
<path d="M77.5625 296.53C77.5625 301.271 73.7167 305.031 69.0527 305.031H66.8434C62.0976 305.031 58.3336 301.189 58.3336 296.53V203.996C58.3336 199.255 62.1794 195.494 66.8434 195.494H69.0527C73.7985 195.494 77.5625 199.336 77.5625 203.996V296.53Z" fill="#8682C0"/>
<path d="M135.495 306.748L164.297 248.791L142.613 241.107L121.584 308.219L135.249 313.042C134.104 309.445 135.495 306.748 135.495 306.748Z" fill="#EEBAC0"/>
<path d="M142.532 324.65L142.286 321.135C142.286 321.135 139.259 319.173 137.049 316.312C136.231 315.167 135.658 314.105 135.331 313.042L121.666 308.219L119.13 316.312L142.532 324.65Z" fill="#4F49B2"/>
<path d="M142.613 241.107L139.913 249.609L162.742 251.979L168.47 241.107H142.613Z" fill="#191B4E"/>
<path d="M189.417 305.767L188.272 241.107L165.443 244.214L177.716 313.451L192.118 311.489C189.417 308.791 189.417 305.767 189.417 305.767Z" fill="#EEBAC0"/>
<path d="M203.9 318.437L202.018 315.413C202.018 315.413 198.418 315.086 195.145 313.533C193.836 312.961 192.854 312.225 192.118 311.489L177.716 313.451L179.189 321.789L203.9 318.437Z" fill="#4F49B2"/>
<path d="M164.297 241.107L166.916 253.042L188.354 248.546L188.19 241.107H164.297Z" fill="#191B4E"/>
<path d="M237.694 85.6306C237.694 85.6306 243.177 83.1783 243.995 85.1401C243.995 85.1401 243.913 86.5297 237.694 87.9194" fill="#EEBAC0"/>
<path d="M181.971 71.2434L205.21 102.551L230.739 88.9001L237.694 99.8538L207.664 123.069C207.664 123.069 203.328 125.93 198.173 124.949C197.764 124.868 197.273 124.786 196.782 124.622C191.054 122.742 178.453 99.0364 178.453 99.0364L181.971 71.2434Z" fill="#9795BF"/>
<path d="M200.873 98.8731C200.873 100.835 202.428 102.552 204.391 102.552H231.639C233.603 102.552 235.321 101.898 236.14 98.8731L248.086 58.8185C248.086 56.8566 246.531 55.3853 244.568 55.3853H217.974C216.011 55.3853 213.392 56.2027 212.819 58.8185L200.873 98.8731Z" fill="white"/>
<path d="M226.484 67.892C226.484 69.1181 227.548 70.1808 228.775 70.1808C230.003 70.1808 231.066 69.1181 231.066 67.892C231.066 66.6658 230.003 65.6031 228.775 65.6031C227.548 65.6031 226.484 66.5841 226.484 67.892Z" fill="#E4EAF0"/>
<path d="M160.288 25.8748C160.288 25.8748 143.923 25.3026 137.786 35.7658C130.667 47.864 139.177 49.2536 126.576 56.1201C113.975 62.9866 111.438 81.7877 121.175 88.8994H154.069L160.288 25.8748Z" fill="#161C4E"/>
<path d="M134.922 62.9055C134.922 62.9055 159.715 50.4804 176.98 65.1126C194.163 79.7448 183.526 140.072 183.526 140.072H133.776C133.776 140.072 117.002 69.9355 134.922 62.9055Z" fill="white"/>
<path d="M132.876 136.23H184.099" stroke="#9795BF" stroke-miterlimit="10"/>
<path d="M183.526 140.072H133.776C133.776 140.072 126.248 162.47 126.658 184.622C126.985 199.255 122.566 220.181 119.539 232.77H202.919L183.526 140.072Z" fill="#484576"/>
<path d="M119.539 232.77C117.984 239.391 116.757 243.642 116.757 243.642H205.21L202.919 232.77H119.539Z" fill="white"/>
<path d="M163.315 58.5732C163.315 58.5732 181.726 60.9438 184.181 78.2735C185.081 84.6496 186.963 94.7858 186.799 105.004C186.554 122.415 183.526 140.072 183.526 140.072" stroke="#9795BF" stroke-miterlimit="10"/>
<path d="M126.576 86.2027C126.576 86.2027 142.777 113.914 154.724 123.314C166.67 132.715 180.826 115.794 180.826 115.794L205.21 95.6032L196.536 81.298L166.834 99.2817L145.968 64.704" fill="white"/>
<path d="M201.855 98.219L193.509 83.0963" stroke="#E4EAF0" stroke-miterlimit="10"/>
<path d="M154.151 39.6085L165.688 47.9464L165.524 49.336L164.461 57.4287L153.66 40.7529L154.151 39.6085Z" fill="#161C4E"/>
<path d="M146.705 55.5485L153.66 40.7528L164.461 57.4286L162.988 68.464C162.988 68.464 154.396 69.6084 144.004 61.2705L146.705 55.5485Z" fill="#EEBAC0"/>
<path d="M158.488 26.2843C153.251 28.0009 153.578 34.8674 153.578 34.8674C153.578 36.0118 153.66 37.1562 153.905 38.1371L169.207 31.2707C164.052 23.6685 158.488 26.2843 158.488 26.2843Z" fill="#161C4E"/>
<path d="M169.37 31.5975C169.288 31.5158 169.288 31.434 169.207 31.3523L153.905 38.2188C155.296 44.9218 160.779 49.336 166.67 48.9272C173.462 48.5185 174.689 39.6084 169.37 31.5975Z" fill="#EEBAC0"/>
<path d="M129.112 89.881C129.112 89.881 133.94 120.126 144.004 128.709C149.078 133.042 154.724 123.314 154.724 123.314C154.724 123.314 152.923 122.579 148.423 117.265C143.923 111.788 129.112 89.881 129.112 89.881Z" fill="#9795BF"/>
<path d="M198.255 83.9956C198.255 83.9956 203 76.3934 207.828 75.6577L206.601 79.8267C206.601 79.8267 216.011 77.3743 217.483 79.0092C219.038 80.6441 212.656 81.2981 210.119 81.2981C207.501 81.2981 217.156 81.952 217.729 83.0147C218.383 84.0774 210.937 84.9765 210.937 84.9765C210.937 84.9765 217.156 85.5488 217.811 86.4479C218.383 87.3471 211.428 87.8376 211.428 87.8376C211.428 87.8376 216.42 87.6741 216.42 89.0637C216.42 90.4534 210.937 89.8812 210.937 89.8812L203.819 93.2327L198.255 83.9956Z" fill="#EEBAC0"/>
<path d="M126.576 86.2027C126.576 86.2027 141.222 116.366 154.724 123.314C165.688 128.955 180.826 115.794 180.826 115.794L205.21 95.6032L196.536 81.298L166.834 99.2817L149.487 71.8975" stroke="#9795BF" stroke-miterlimit="10"/>
<path d="M239.413 87.7557C239.413 87.7557 241.458 88.0827 240.394 89.3906C239.331 90.6985 237.694 91.6794 236.549 90.6985C235.403 89.6358 239.413 87.7557 239.413 87.7557Z" fill="#EEBAC0"/>
<path d="M238.676 90.6986C238.676 90.6986 240.722 91.0256 239.658 92.3335C238.594 93.6414 236.958 94.6223 235.812 93.6414C234.585 92.5787 238.676 90.6986 238.676 90.6986Z" fill="#EEBAC0"/>
<path d="M237.94 93.7231C237.94 93.7231 239.985 94.0501 238.922 95.358C237.858 96.6659 236.221 97.6469 235.076 96.6659C233.848 95.6033 237.94 93.7231 237.94 93.7231Z" fill="#EEBAC0"/>
<path d="M192.531 6.85962H183.824C181.061 6.85962 178.539 8.93139 178.539 11.6337V19.1401L180.971 21.0618L178.539 22.9834V28.268C178.539 30.9703 181.061 33.3123 183.824 33.3123H192.921L194.153 30.7V9.20162L192.531 6.85962Z" fill="#484576"/>
<path d="M241.161 11.6337C241.161 8.93139 239.119 6.85962 236.357 6.85962H198.344L196.123 9.20162V30.7L197.954 33.3123H236.357C239.119 33.3123 241.161 30.9703 241.161 28.268V23.3437L238.219 21.0618L241.161 18.7798V11.6337Z" fill="#484576"/>
<path d="M230.952 15.2667C230.952 15.597 230.682 15.8673 230.352 15.8673H199.726C199.395 15.8673 199.125 15.597 199.125 15.2667V14.9965C199.125 14.6662 199.395 14.396 199.726 14.396H230.352C230.682 14.396 230.952 14.6662 230.952 14.9965V15.2667Z" fill="#E4EAF0"/>
<path d="M230.952 23.0734C230.952 23.4037 230.682 23.6739 230.352 23.6739H199.726C199.395 23.6739 199.125 23.4037 199.125 23.0734V22.8032C199.125 22.4729 199.395 22.2026 199.726 22.2026H230.352C230.682 22.2026 230.952 22.4729 230.952 22.8032V23.0734Z" fill="#E4EAF0"/>
<path d="M218.642 26.8567C218.642 27.2471 218.312 27.5773 217.921 27.5773H199.876C199.485 27.5773 199.155 27.2471 199.155 26.8567V26.8267C199.155 26.4364 199.485 26.1061 199.876 26.1061H217.921C218.312 26.1061 218.642 26.4364 218.642 26.8267V26.8567Z" fill="#E4EAF0"/>
<path d="M223.146 19.0501C223.146 19.4404 222.815 19.7707 222.425 19.7707H199.876C199.485 19.7707 199.155 19.4404 199.155 19.0501V19.0201C199.155 18.6297 199.485 18.2994 199.876 18.2994H222.425C222.815 18.2994 223.146 18.6297 223.146 19.0201V19.0501Z" fill="#E4EAF0"/>
<path d="M228.04 0.193848L230.322 1.66511L233.054 1.51498L234.255 3.94706L236.687 5.17812L236.537 7.88043L238.038 10.1624L236.537 12.4443L236.687 15.1467L234.255 16.3777L233.054 18.8098L230.322 18.6597L228.04 20.1309L225.788 18.6597L223.056 18.8098L221.825 16.3777L219.422 15.1467L219.573 12.4443L218.071 10.1624L219.573 7.88043L219.422 5.17812L221.825 3.94706L223.056 1.51498L225.788 1.66511L228.04 0.193848Z" fill="#EEBAC0"/>
<path d="M224.947 6.01878C225.578 6.01878 226.118 6.52921 226.118 7.18978C226.118 7.82032 225.608 8.36079 224.947 8.36079C224.287 8.36079 223.776 7.85035 223.776 7.18978C223.776 6.52921 224.287 6.01878 224.947 6.01878ZM224.947 4.81775C223.656 4.81775 222.575 5.86865 222.575 7.18978C222.575 8.48089 223.626 9.56181 224.947 9.56181C226.238 9.56181 227.319 8.51091 227.319 7.18978C227.289 5.86865 226.238 4.81775 224.947 4.81775Z" fill="#E4EAF0"/>
<path d="M231.763 11.8739C232.394 11.8739 232.934 12.3843 232.934 13.0449C232.934 13.6754 232.424 14.2159 231.763 14.2159C231.102 14.2159 230.592 13.7054 230.592 13.0449C230.622 12.3843 231.132 11.8739 231.763 11.8739ZM231.763 10.6729C230.472 10.6729 229.391 11.7238 229.391 13.0449C229.391 14.336 230.442 15.4169 231.763 15.4169C233.084 15.4169 234.135 14.366 234.135 13.0449C234.135 11.7238 233.084 10.6729 231.763 10.6729Z" fill="#E4EAF0"/>
<path fill-rule="evenodd" clip-rule="evenodd" d="M224.718 15.4466L230.242 5.08777L231.482 5.74891L225.957 16.1078L224.718 15.4466Z" fill="#E4EAF0"/>
</svg>
