<svg width="188" height="292" viewBox="0 0 188 292" fill="none" xmlns="http://www.w3.org/2000/svg">
<rect x="1.68164" y="1.88339" width="184.38" height="288.627" rx="5" fill="white" stroke="#BCBCBC" stroke-width="2"/>
<rect x="27.5332" y="98.812" width="53.7028" height="3.94873" rx="1.97437" fill="#BCBCBC"/>
<rect x="27.5332" y="89.335" width="78.9747" height="3.94873" rx="1.97437" fill="#BCBCBC"/>
<rect x="27.5332" y="79.858" width="45.8053" height="3.94873" rx="1.97437" fill="#BCBCBC"/>
<rect x="86.7637" y="98.812" width="53.7028" height="3.94873" rx="1.97437" fill="#BCBCBC"/>
<path d="M35.4128 26.1237L32.5646 31.6245V34.3632H30.565V31.6245L27.7168 26.1237H29.9954L31.5764 29.4801L33.1575 26.1237H35.4128Z" fill="black"/>
<path d="M39.2115 27.7786C39.8548 27.7786 40.4283 27.9146 40.9321 28.1865C41.4436 28.4507 41.8427 28.8353 42.1295 29.3403C42.424 29.8453 42.5712 30.4358 42.5712 31.1117C42.5712 31.7876 42.424 32.3781 42.1295 32.8831C41.8427 33.3881 41.4436 33.7766 40.9321 34.0485C40.4283 34.3127 39.8548 34.4448 39.2115 34.4448C38.5682 34.4448 37.9908 34.3127 37.4793 34.0485C36.9678 33.7766 36.5648 33.3881 36.2703 32.8831C35.9835 32.3781 35.8401 31.7876 35.8401 31.1117C35.8401 30.4358 35.9835 29.8453 36.2703 29.3403C36.5648 28.8353 36.9678 28.4507 37.4793 28.1865C37.9908 27.9146 38.5682 27.7786 39.2115 27.7786ZM39.2115 29.5034C38.8317 29.5034 38.5101 29.6433 38.2466 29.923C37.9908 30.1949 37.863 30.5911 37.863 31.1117C37.863 31.6323 37.9908 32.0285 38.2466 32.3004C38.5101 32.5724 38.8317 32.7083 39.2115 32.7083C39.5913 32.7083 39.909 32.5724 40.1648 32.3004C40.4205 32.0285 40.5484 31.6323 40.5484 31.1117C40.5484 30.5911 40.4205 30.1949 40.1648 29.923C39.909 29.6433 39.5913 29.5034 39.2115 29.5034Z" fill="black"/>
<path d="M50.0542 27.8602V34.3632H48.0546V33.1861C47.8686 33.5668 47.5896 33.8698 47.2176 34.0952C46.8533 34.3205 46.4271 34.4331 45.9388 34.4331C45.1948 34.4331 44.6019 34.1845 44.1601 33.6873C43.7261 33.19 43.5091 32.5063 43.5091 31.6361V27.8602H45.4854V31.3914C45.4854 31.8343 45.5978 32.18 45.8225 32.4286C46.0551 32.6695 46.3651 32.7899 46.7526 32.7899C47.1556 32.7899 47.4733 32.6617 47.7059 32.4053C47.9384 32.1489 48.0546 31.7838 48.0546 31.3098V27.8602H50.0542Z" fill="black"/>
<path d="M53.4122 29.0839C53.6602 28.6876 53.978 28.373 54.3655 28.1399C54.7608 27.9068 55.187 27.7903 55.6443 27.7903V29.923H55.0746C54.5476 29.923 54.1369 30.0356 53.8423 30.2609C53.5556 30.4863 53.4122 30.867 53.4122 31.4031V34.3632H51.4243V27.8602H53.4122V29.0839Z" fill="black"/>
<path d="M62.8493 27.7786C63.3841 27.7786 63.8607 27.9146 64.2792 28.1865C64.7055 28.4507 65.0388 28.8353 65.279 29.3403C65.527 29.8375 65.651 30.428 65.651 31.1117C65.651 31.7876 65.527 32.3781 65.279 32.8831C65.0388 33.3881 64.7055 33.7766 64.2792 34.0485C63.8607 34.3127 63.3841 34.4448 62.8493 34.4448C62.3533 34.4448 61.927 34.3321 61.5705 34.1068C61.214 33.8815 60.9544 33.5746 60.7916 33.1861V34.3632H58.8037V25.7391H60.7916V29.0373C60.9544 28.6488 61.214 28.3419 61.5705 28.1166C61.927 27.8913 62.3533 27.7786 62.8493 27.7786ZM62.2099 29.5267C61.7914 29.5267 61.4465 29.6705 61.1752 29.9579C60.9117 30.2376 60.78 30.6222 60.78 31.1117C60.78 31.5934 60.9117 31.978 61.1752 32.2655C61.4465 32.5529 61.7914 32.6967 62.2099 32.6967C62.6362 32.6967 62.9772 32.5568 63.2329 32.2771C63.4965 31.9974 63.6282 31.6089 63.6282 31.1117C63.6282 30.6145 63.4965 30.226 63.2329 29.9463C62.9772 29.6666 62.6362 29.5267 62.2099 29.5267Z" fill="black"/>
<path d="M69.7168 27.7786C70.3601 27.7786 70.9336 27.9146 71.4374 28.1865C71.9489 28.4507 72.348 28.8353 72.6348 29.3403C72.9293 29.8453 73.0766 30.4358 73.0766 31.1117C73.0766 31.7876 72.9293 32.3781 72.6348 32.8831C72.348 33.3881 71.9489 33.7766 71.4374 34.0485C70.9336 34.3127 70.3601 34.4448 69.7168 34.4448C69.0736 34.4448 68.4962 34.3127 67.9846 34.0485C67.4731 33.7766 67.0701 33.3881 66.7756 32.8831C66.4888 32.3781 66.3455 31.7876 66.3455 31.1117C66.3455 30.4358 66.4888 29.8453 66.7756 29.3403C67.0701 28.8353 67.4731 28.4507 67.9846 28.1865C68.4962 27.9146 69.0736 27.7786 69.7168 27.7786ZM69.7168 29.5034C69.3371 29.5034 69.0154 29.6433 68.7519 29.923C68.4962 30.1949 68.3683 30.5911 68.3683 31.1117C68.3683 31.6323 68.4962 32.0285 68.7519 32.3004C69.0154 32.5724 69.3371 32.7083 69.7168 32.7083C70.0966 32.7083 70.4144 32.5724 70.6701 32.3004C70.9259 32.0285 71.0538 31.6323 71.0538 31.1117C71.0538 30.5911 70.9259 30.1949 70.6701 29.923C70.4144 29.6433 70.0966 29.5034 69.7168 29.5034Z" fill="black"/>
<path d="M77.1416 27.7786C77.7849 27.7786 78.3584 27.9146 78.8622 28.1865C79.3737 28.4507 79.7729 28.8353 80.0596 29.3403C80.3541 29.8453 80.5014 30.4358 80.5014 31.1117C80.5014 31.7876 80.3541 32.3781 80.0596 32.8831C79.7729 33.3881 79.3737 33.7766 78.8622 34.0485C78.3584 34.3127 77.7849 34.4448 77.1416 34.4448C76.4984 34.4448 75.921 34.3127 75.4095 34.0485C74.8979 33.7766 74.4949 33.3881 74.2004 32.8831C73.9137 32.3781 73.7703 31.7876 73.7703 31.1117C73.7703 30.4358 73.9137 29.8453 74.2004 29.3403C74.4949 28.8353 74.8979 28.4507 75.4095 28.1865C75.921 27.9146 76.4984 27.7786 77.1416 27.7786ZM77.1416 29.5034C76.7619 29.5034 76.4403 29.6433 76.1767 29.923C75.921 30.1949 75.7931 30.5911 75.7931 31.1117C75.7931 31.6323 75.921 32.0285 76.1767 32.3004C76.4403 32.5724 76.7619 32.7083 77.1416 32.7083C77.5214 32.7083 77.8392 32.5724 78.0949 32.3004C78.3507 32.0285 78.4786 31.6323 78.4786 31.1117C78.4786 30.5911 78.3507 30.1949 78.0949 29.923C77.8392 29.6433 77.5214 29.5034 77.1416 29.5034Z" fill="black"/>
<path d="M85.4616 34.3632L83.5202 31.6012V34.3632H81.5322V25.7391H83.5202V30.4707L85.4616 27.8602H87.7983L85.1826 31.1117L87.8565 34.3632H85.4616Z" fill="black"/>
<path d="M88.3964 26.0305C88.3964 25.7275 88.5049 25.4789 88.7219 25.2846C88.9389 25.0826 89.2257 24.9816 89.5822 24.9816C89.9387 24.9816 90.2255 25.0826 90.4425 25.2846C90.6595 25.4789 90.768 25.7275 90.768 26.0305C90.768 26.3257 90.6595 26.5744 90.4425 26.7764C90.2255 26.9706 89.9387 27.0677 89.5822 27.0677C89.2257 27.0677 88.9389 26.9706 88.7219 26.7764C88.5049 26.5744 88.3964 26.3257 88.3964 26.0305ZM90.5704 27.8602V34.3632H88.5824V27.8602H90.5704Z" fill="black"/>
<path d="M96.0583 27.7903C96.8023 27.7903 97.3913 28.0389 97.8253 28.5361C98.2671 29.0334 98.488 29.7171 98.488 30.5873V34.3632H96.5V30.8203C96.5 30.3853 96.3838 30.0473 96.1513 29.8064C95.9265 29.5578 95.6242 29.4335 95.2445 29.4335C94.8415 29.4335 94.5198 29.5617 94.2796 29.8181C94.0471 30.0745 93.9308 30.4396 93.9308 30.9136V34.3632H91.9429V27.8602H93.9308V29.0489C94.1168 28.6604 94.392 28.3536 94.7562 28.1282C95.1282 27.9029 95.5622 27.7903 96.0583 27.7903Z" fill="black"/>
<path d="M102.264 27.7786C102.76 27.7786 103.186 27.8913 103.542 28.1166C103.899 28.3419 104.163 28.6488 104.333 29.0373V27.8602H106.309V34.3282C106.309 34.9343 106.193 35.4781 105.961 35.9598C105.728 36.4493 105.372 36.8378 104.891 37.1252C104.411 37.4127 103.814 37.5564 103.101 37.5564C102.124 37.5564 101.341 37.3234 100.752 36.8572C100.171 36.3988 99.8224 35.7734 99.7061 34.9809H101.671C101.733 35.245 101.872 35.4509 102.089 35.5985C102.314 35.7462 102.605 35.82 102.961 35.82C103.372 35.82 103.701 35.6995 103.949 35.4587C104.205 35.2256 104.333 34.8488 104.333 34.3282V33.1861C104.163 33.5746 103.899 33.8815 103.542 34.1068C103.186 34.3321 102.76 34.4448 102.264 34.4448C101.729 34.4448 101.248 34.3127 100.822 34.0485C100.404 33.7766 100.07 33.3881 99.8224 32.8831C99.5821 32.3781 99.462 31.7876 99.462 31.1117C99.462 30.428 99.5821 29.8375 99.8224 29.3403C100.07 28.8353 100.404 28.4507 100.822 28.1865C101.248 27.9146 101.729 27.7786 102.264 27.7786ZM102.903 29.5267C102.477 29.5267 102.132 29.6666 101.868 29.9463C101.613 30.226 101.485 30.6145 101.485 31.1117C101.485 31.6089 101.613 31.9974 101.868 32.2771C102.132 32.5568 102.477 32.6967 102.903 32.6967C103.322 32.6967 103.663 32.5529 103.926 32.2655C104.197 31.978 104.333 31.5934 104.333 31.1117C104.333 30.6222 104.197 30.2376 103.926 29.9579C103.663 29.6705 103.322 29.5267 102.903 29.5267Z" fill="black"/>
<path d="M54.6952 57.4261C54.971 57.4261 55.1855 57.3878 55.3387 57.3112C55.5795 57.1908 55.6999 56.9741 55.6999 56.6611C55.6999 56.3459 55.5719 56.1336 55.3158 56.0242C55.1713 55.9629 54.9568 55.9322 54.6722 55.9322H53.5065V57.4261H54.6952ZM54.9152 59.6521C55.3158 59.6521 55.6014 59.5361 55.7722 59.3041C55.8794 59.1575 55.9331 58.9802 55.9331 58.7722C55.9331 58.422 55.7766 58.1834 55.4635 58.0565C55.2972 57.9886 55.0772 57.9547 54.8035 57.9547H53.5065V59.6521H54.9152ZM52.8662 55.3872H54.9382C55.5029 55.3872 55.9046 55.5557 56.1432 55.8928C56.2833 56.092 56.3534 56.3218 56.3534 56.5823C56.3534 56.8866 56.2669 57.1361 56.094 57.3309C56.0042 57.4338 55.8751 57.5279 55.7065 57.6132C55.9539 57.7074 56.1388 57.8135 56.2614 57.9317C56.4782 58.1418 56.5865 58.4319 56.5865 58.8018C56.5865 59.1126 56.4891 59.3939 56.2943 59.6456C56.0031 60.022 55.5401 60.2103 54.9053 60.2103H52.8662V55.3872Z" fill="black"/>
<path d="M58.6847 59.8294C59.0766 59.8294 59.3447 59.6817 59.4892 59.3862C59.6359 59.0885 59.7092 58.758 59.7092 58.3947C59.7092 58.0663 59.6567 57.7993 59.5516 57.5935C59.3852 57.2696 59.0984 57.1076 58.6913 57.1076C58.3301 57.1076 58.0674 57.2455 57.9032 57.5213C57.739 57.7971 57.657 58.1298 57.657 58.5194C57.657 58.8937 57.739 59.2056 57.9032 59.4551C58.0674 59.7047 58.3279 59.8294 58.6847 59.8294ZM58.7077 56.5922C59.1608 56.5922 59.5439 56.7432 59.857 57.0452C60.17 57.3473 60.3265 57.7916 60.3265 58.3782C60.3265 58.9451 60.1886 59.4136 59.9128 59.7835C59.637 60.1534 59.209 60.3383 58.6289 60.3383C58.1451 60.3383 57.7609 60.1753 57.4764 59.8491C57.1918 59.5208 57.0495 59.0808 57.0495 58.5293C57.0495 57.9383 57.1994 57.4677 57.4993 57.1175C57.7992 56.7673 58.202 56.5922 58.7077 56.5922Z" fill="black"/>
<path d="M62.428 59.8294C62.8198 59.8294 63.088 59.6817 63.2325 59.3862C63.3791 59.0885 63.4525 58.758 63.4525 58.3947C63.4525 58.0663 63.3999 57.7993 63.2949 57.5935C63.1285 57.2696 62.8417 57.1076 62.4346 57.1076C62.0734 57.1076 61.8107 57.2455 61.6465 57.5213C61.4823 57.7971 61.4002 58.1298 61.4002 58.5194C61.4002 58.8937 61.4823 59.2056 61.6465 59.4551C61.8107 59.7047 62.0712 59.8294 62.428 59.8294ZM62.451 56.5922C62.9041 56.5922 63.2872 56.7432 63.6002 57.0452C63.9133 57.3473 64.0698 57.7916 64.0698 58.3782C64.0698 58.9451 63.9319 59.4136 63.6561 59.7835C63.3802 60.1534 62.9523 60.3383 62.3722 60.3383C61.8884 60.3383 61.5042 60.1753 61.2196 59.8491C60.9351 59.5208 60.7928 59.0808 60.7928 58.5293C60.7928 57.9383 60.9427 57.4677 61.2426 57.1175C61.5425 56.7673 61.9453 56.5922 62.451 56.5922Z" fill="black"/>
<path d="M64.7626 55.3872H65.3307V58.1878L66.8477 56.6939H67.6029L66.2567 58.0105L67.6784 60.2103H66.9232L65.8265 58.4373L65.3307 58.8904V60.2103H64.7626V55.3872Z" fill="black"/>
<path d="M79.6832 58.2338L78.951 56.103L78.1728 58.2338H79.6832ZM78.6095 55.3872H79.3483L81.0984 60.2103H80.3826L79.8934 58.7657H77.9856L77.4635 60.2103H76.7937L78.6095 55.3872Z" fill="black"/>
<path d="M81.7847 56.6939L82.7238 59.5569L83.7056 56.6939H84.3525L83.0259 60.2103H82.3955L81.0984 56.6939H81.7847Z" fill="black"/>
<path d="M85.3113 59.2746C85.3113 59.4453 85.3737 59.5799 85.4984 59.6784C85.6232 59.7769 85.771 59.8261 85.9417 59.8261C86.1497 59.8261 86.3511 59.778 86.5459 59.6817C86.8743 59.5219 87.0384 59.2603 87.0384 58.897V58.4209C86.9662 58.4669 86.8732 58.5052 86.7593 58.5358C86.6455 58.5665 86.5339 58.5884 86.4244 58.6015L86.0665 58.6475C85.852 58.6759 85.6911 58.7208 85.5838 58.7821C85.4021 58.8849 85.3113 59.0491 85.3113 59.2746ZM86.7429 58.0795C86.8786 58.062 86.9695 58.005 87.0155 57.9087C87.0417 57.8562 87.0549 57.7807 87.0549 57.6822C87.0549 57.4808 86.9826 57.3353 86.8381 57.2455C86.6959 57.1536 86.4912 57.1076 86.2241 57.1076C85.9155 57.1076 85.6966 57.1908 85.5674 57.3571C85.4952 57.4491 85.4481 57.5859 85.4262 57.7676H84.8746C84.8855 57.3342 85.0256 57.0332 85.2949 56.8647C85.5663 56.6939 85.8804 56.6086 86.2373 56.6086C86.651 56.6086 86.987 56.6874 87.2453 56.845C87.5014 57.0026 87.6295 57.2477 87.6295 57.5804V59.6062C87.6295 59.6675 87.6415 59.7167 87.6656 59.7539C87.6919 59.7911 87.7455 59.8097 87.8265 59.8097C87.8528 59.8097 87.8823 59.8086 87.9152 59.8064C87.948 59.8021 87.983 59.7966 88.0202 59.79V60.2267C87.9283 60.253 87.8582 60.2694 87.8101 60.2759C87.7619 60.2825 87.6963 60.2858 87.6131 60.2858C87.4095 60.2858 87.2617 60.2136 87.1698 60.0691C87.1216 59.9925 87.0877 59.8841 87.068 59.7441C86.9476 59.9017 86.7747 60.0385 86.5492 60.1545C86.3237 60.2705 86.0753 60.3285 85.8038 60.3285C85.4777 60.3285 85.2106 60.23 85.0026 60.033C84.7969 59.8338 84.694 59.5854 84.694 59.2877C84.694 58.9616 84.7958 58.7087 84.9993 58.5293C85.2029 58.3498 85.47 58.2392 85.8005 58.1977L86.7429 58.0795Z" fill="black"/>
<path d="M88.6014 56.7104H89.2023V60.2103H88.6014V56.7104ZM88.6014 55.3872H89.2023V56.057H88.6014V55.3872Z" fill="black"/>
<path d="M90.1152 55.3872H90.7062V60.2103H90.1152V55.3872Z" fill="black"/>
<path d="M92.0492 59.2746C92.0492 59.4453 92.1116 59.5799 92.2364 59.6784C92.3611 59.7769 92.5089 59.8261 92.6796 59.8261C92.8876 59.8261 93.089 59.778 93.2838 59.6817C93.6122 59.5219 93.7764 59.2603 93.7764 58.897V58.4209C93.7041 58.4669 93.6111 58.5052 93.4973 58.5358C93.3834 58.5665 93.2718 58.5884 93.1623 58.6015L92.8044 58.6475C92.5899 58.6759 92.429 58.7208 92.3217 58.7821C92.14 58.8849 92.0492 59.0491 92.0492 59.2746ZM93.4808 58.0795C93.6166 58.062 93.7074 58.005 93.7534 57.9087C93.7796 57.8562 93.7928 57.7807 93.7928 57.6822C93.7928 57.4808 93.7205 57.3353 93.5761 57.2455C93.4338 57.1536 93.2291 57.1076 92.962 57.1076C92.6534 57.1076 92.4345 57.1908 92.3053 57.3571C92.2331 57.4491 92.186 57.5859 92.1641 57.7676H91.6125C91.6234 57.3342 91.7635 57.0332 92.0328 56.8647C92.3042 56.6939 92.6183 56.6086 92.9752 56.6086C93.3889 56.6086 93.7249 56.6874 93.9832 56.845C94.2393 57.0026 94.3674 57.2477 94.3674 57.5804V59.6062C94.3674 59.6675 94.3794 59.7167 94.4035 59.7539C94.4298 59.7911 94.4834 59.8097 94.5644 59.8097C94.5907 59.8097 94.6202 59.8086 94.6531 59.8064C94.6859 59.8021 94.7209 59.7966 94.7581 59.79V60.2267C94.6662 60.253 94.5962 60.2694 94.548 60.2759C94.4998 60.2825 94.4342 60.2858 94.351 60.2858C94.1474 60.2858 93.9996 60.2136 93.9077 60.0691C93.8595 59.9925 93.8256 59.8841 93.8059 59.7441C93.6855 59.9017 93.5126 60.0385 93.2871 60.1545C93.0616 60.2705 92.8132 60.3285 92.5417 60.3285C92.2156 60.3285 91.9485 60.23 91.7405 60.033C91.5348 59.8338 91.4319 59.5854 91.4319 59.2877C91.4319 58.9616 91.5337 58.7087 91.7373 58.5293C91.9408 58.3498 92.2079 58.2392 92.5384 58.1977L93.4808 58.0795Z" fill="black"/>
<path d="M95.2934 55.3708H95.868V57.1208C95.9972 56.9522 96.1515 56.8242 96.331 56.7366C96.5105 56.6469 96.7053 56.602 96.9155 56.602C97.3533 56.602 97.7079 56.753 97.9793 57.0551C98.253 57.355 98.3898 57.7982 98.3898 58.3848C98.3898 58.9408 98.2552 59.4026 97.9859 59.7703C97.7167 60.1381 97.3434 60.3219 96.8662 60.3219C96.5991 60.3219 96.3737 60.2573 96.1898 60.1282C96.0803 60.0516 95.9632 59.929 95.8384 59.7605V60.2103H95.2934V55.3708ZM96.8301 59.7999C97.1497 59.7999 97.3883 59.6729 97.5459 59.419C97.7057 59.1651 97.7856 58.8302 97.7856 58.4144C97.7856 58.0444 97.7057 57.738 97.5459 57.495C97.3883 57.2521 97.1552 57.1306 96.8465 57.1306C96.5773 57.1306 96.3408 57.2302 96.1373 57.4294C95.9359 57.6286 95.8352 57.9569 95.8352 58.4144C95.8352 58.7449 95.8768 59.013 95.9599 59.2187C96.1154 59.6062 96.4054 59.7999 96.8301 59.7999Z" fill="black"/>
<path d="M99.0826 56.7104H99.6835V60.2103H99.0826V56.7104ZM99.0826 55.3872H99.6835V56.057H99.0826V55.3872Z" fill="black"/>
<path d="M100.596 55.3872H101.187V60.2103H100.596V55.3872Z" fill="black"/>
<path d="M102.077 56.7104H102.678V60.2103H102.077V56.7104ZM102.077 55.3872H102.678V56.057H102.077V55.3872Z" fill="black"/>
<path d="M103.693 55.7122H104.29V56.6939H104.852V57.1766H104.29V59.4716C104.29 59.5941 104.332 59.6762 104.415 59.7178C104.461 59.7419 104.538 59.7539 104.645 59.7539C104.673 59.7539 104.704 59.7539 104.737 59.7539C104.77 59.7517 104.808 59.7484 104.852 59.7441V60.2103C104.784 60.23 104.713 60.2442 104.638 60.253C104.566 60.2617 104.487 60.2661 104.402 60.2661C104.126 60.2661 103.939 60.1961 103.841 60.056C103.742 59.9137 103.693 59.7298 103.693 59.5044V57.1766H103.217V56.6939H103.693V55.7122Z" fill="black"/>
<path d="M107.643 56.6939H108.296C108.213 56.9194 108.028 57.4338 107.741 58.2371C107.527 58.8412 107.347 59.3337 107.203 59.7145C106.861 60.6119 106.621 61.1591 106.481 61.3561C106.34 61.5531 106.1 61.6516 105.758 61.6516C105.675 61.6516 105.61 61.6483 105.564 61.6418C105.521 61.6352 105.466 61.6232 105.4 61.6057V61.0672C105.503 61.0957 105.578 61.1132 105.624 61.1197C105.669 61.1263 105.71 61.1296 105.745 61.1296C105.854 61.1296 105.934 61.111 105.985 61.0738C106.037 61.0388 106.081 60.995 106.116 60.9424C106.127 60.9249 106.166 60.8352 106.234 60.6732C106.302 60.5112 106.351 60.3909 106.382 60.3121L105.082 56.6939H105.752L106.694 59.5569L107.643 56.6939Z" fill="black"/>
<path d="M122.843 56.9106C122.843 56.6589 122.776 56.4794 122.642 56.3722C122.511 56.2649 122.326 56.2113 122.087 56.2113H121.145V57.6362H122.087C122.326 57.6362 122.511 57.5782 122.642 57.4622C122.776 57.3462 122.843 57.1623 122.843 56.9106ZM123.844 56.9041C123.844 57.4753 123.7 57.8792 123.411 58.1156C123.122 58.352 122.709 58.4702 122.173 58.4702H121.145V60.2103H120.14V55.3708H122.248C122.734 55.3708 123.122 55.4956 123.411 55.7451C123.7 55.9946 123.844 56.3809 123.844 56.9041Z" fill="black"/>
<path d="M126.501 58.4702C126.441 58.5074 126.381 58.538 126.32 58.5621C126.261 58.584 126.179 58.6048 126.074 58.6245L125.864 58.6639C125.667 58.6989 125.525 58.7416 125.44 58.7919C125.295 58.8773 125.223 59.0097 125.223 59.1892C125.223 59.349 125.267 59.465 125.355 59.5372C125.444 59.6073 125.553 59.6423 125.68 59.6423C125.881 59.6423 126.066 59.5832 126.235 59.465C126.405 59.3468 126.494 59.1312 126.501 58.8182V58.4702ZM125.932 58.0335C126.105 58.0116 126.229 57.9842 126.304 57.9514C126.437 57.8945 126.504 57.8059 126.504 57.6855C126.504 57.5388 126.452 57.4381 126.349 57.3834C126.249 57.3265 126.1 57.298 125.903 57.298C125.682 57.298 125.525 57.3528 125.433 57.4622C125.368 57.5432 125.324 57.6526 125.302 57.7905H124.399C124.419 57.4775 124.506 57.2203 124.662 57.019C124.909 56.7038 125.334 56.5462 125.936 56.5462C126.328 56.5462 126.676 56.6239 126.98 56.7793C127.284 56.9347 127.436 57.228 127.436 57.6592V59.3008C127.436 59.4146 127.439 59.5525 127.443 59.7145C127.449 59.8371 127.468 59.9203 127.499 59.964C127.529 60.0078 127.575 60.0439 127.637 60.0724V60.2103H126.619C126.59 60.1381 126.571 60.0702 126.56 60.0067C126.549 59.9432 126.54 59.871 126.533 59.79C126.404 59.9301 126.255 60.0494 126.087 60.1479C125.885 60.2639 125.658 60.3219 125.404 60.3219C125.08 60.3219 124.812 60.23 124.599 60.0461C124.389 59.8601 124.284 59.5974 124.284 59.2581C124.284 58.8182 124.454 58.4997 124.793 58.3027C124.979 58.1955 125.253 58.1189 125.614 58.0729L125.932 58.0335Z" fill="black"/>
<path d="M128.415 60.8965L128.533 60.903C128.625 60.9074 128.713 60.9041 128.796 60.8932C128.879 60.8823 128.949 60.8571 129.006 60.8177C129.061 60.7805 129.111 60.7028 129.157 60.5846C129.205 60.4664 129.225 60.3941 129.216 60.3679L127.903 56.6316H128.944L129.725 59.2713L130.464 56.6316H131.459L130.231 60.1512C129.994 60.8297 129.807 61.25 129.669 61.4119C129.531 61.5761 129.255 61.6582 128.842 61.6582C128.759 61.6582 128.692 61.6571 128.641 61.6549C128.591 61.6549 128.516 61.6516 128.415 61.6451V60.8965Z" fill="black"/>
<line x1="118.354" y1="64.3528" x2="137.307" y2="64.3528" stroke="black"/>
<rect x="28.0332" y="124.584" width="133.131" height="134.179" rx="3.5" fill="white" stroke="#BCBCBC"/>
<g filter="url(#filter0_d)">
<rect x="43.3281" y="223.592" width="103.457" height="20.5334" rx="4" fill="#FF9839"/>
</g>
<g filter="url(#filter1_d)">
<path d="M47.2196 147.487H143.21C145.084 147.487 146.602 149.004 146.602 150.875V163.838C146.602 165.71 145.084 167.227 143.21 167.227H47.2196C45.3462 167.227 43.8281 165.71 43.8281 163.838V150.875C43.8281 149.004 45.3462 147.487 47.2196 147.487Z" stroke="#BCBCBC"/>
</g>
<path d="M43.3281 139.879C43.3281 139.443 43.9528 139.089 44.7234 139.089H75.1022C75.8728 139.089 76.4975 139.443 76.4975 139.879V139.879C76.4975 140.315 75.8728 140.669 75.1022 140.669H44.7234C43.9528 140.669 43.3281 140.315 43.3281 139.879V139.879Z" fill="#BCBCBC"/>
<g filter="url(#filter2_d)">
<path d="M47.2196 188.553H143.21C145.084 188.553 146.602 190.071 146.602 191.942V204.905C146.602 206.777 145.084 208.294 143.21 208.294H47.2196C45.3462 208.294 43.8281 206.777 43.8281 204.905V191.942C43.8281 190.071 45.3462 188.553 47.2196 188.553Z" stroke="#BCBCBC"/>
</g>
<path d="M43.3281 180.946C43.3281 180.51 43.9528 180.156 44.7234 180.156H75.1022C75.8728 180.156 76.4975 180.51 76.4975 180.946V180.946C76.4975 181.382 75.8728 181.735 75.1022 181.735H44.7234C43.9528 181.735 43.3281 181.382 43.3281 180.946V180.946Z" fill="#BCBCBC"/>
<defs>
<filter id="filter0_d" x="19.3281" y="221.592" width="151.457" height="68.5334" filterUnits="userSpaceOnUse" color-interpolation-filters="sRGB">
<feFlood flood-opacity="0" result="BackgroundImageFix"/>
<feColorMatrix in="SourceAlpha" type="matrix" values="0 0 0 0 0 0 0 0 0 0 0 0 0 0 0 0 0 0 127 0"/>
<feOffset dy="22"/>
<feGaussianBlur stdDeviation="12"/>
<feColorMatrix type="matrix" values="0 0 0 0 0.309804 0 0 0 0 0.286275 0 0 0 0 0.698039 0 0 0 0.09 0"/>
<feBlend mode="normal" in2="BackgroundImageFix" result="effect1_dropShadow"/>
<feBlend mode="normal" in="SourceGraphic" in2="effect1_dropShadow" result="shape"/>
</filter>
<filter id="filter1_d" x="19.3281" y="144.987" width="151.774" height="68.7407" filterUnits="userSpaceOnUse" color-interpolation-filters="sRGB">
<feFlood flood-opacity="0" result="BackgroundImageFix"/>
<feColorMatrix in="SourceAlpha" type="matrix" values="0 0 0 0 0 0 0 0 0 0 0 0 0 0 0 0 0 0 127 0"/>
<feOffset dy="22"/>
<feGaussianBlur stdDeviation="12"/>
<feColorMatrix type="matrix" values="0 0 0 0 0.309804 0 0 0 0 0.286275 0 0 0 0 0.698039 0 0 0 0.09 0"/>
<feBlend mode="normal" in2="BackgroundImageFix" result="effect1_dropShadow"/>
<feBlend mode="normal" in="SourceGraphic" in2="effect1_dropShadow" result="shape"/>
</filter>
<filter id="filter2_d" x="19.3281" y="186.053" width="151.774" height="68.7407" filterUnits="userSpaceOnUse" color-interpolation-filters="sRGB">
<feFlood flood-opacity="0" result="BackgroundImageFix"/>
<feColorMatrix in="SourceAlpha" type="matrix" values="0 0 0 0 0 0 0 0 0 0 0 0 0 0 0 0 0 0 127 0"/>
<feOffset dy="22"/>
<feGaussianBlur stdDeviation="12"/>
<feColorMatrix type="matrix" values="0 0 0 0 0.309804 0 0 0 0 0.286275 0 0 0 0 0.698039 0 0 0 0.09 0"/>
<feBlend mode="normal" in2="BackgroundImageFix" result="effect1_dropShadow"/>
<feBlend mode="normal" in="SourceGraphic" in2="effect1_dropShadow" result="shape"/>
</filter>
</defs>
</svg>
