<svg width="128" height="122" viewBox="0 0 128 122" fill="none" xmlns="http://www.w3.org/2000/svg">
<g filter="url(#filter0_d)">
<rect x="4" y="4.9751" width="120" height="112.066" rx="18" fill="white"/>
</g>
<g filter="url(#filter1_i)">
<path d="M94.4868 32.7437H32.9769C29.5668 32.7437 26.8105 35.5041 26.8105 38.9066V84.1014C26.8105 87.5038 29.5668 90.2643 32.9769 90.2643H94.4868C97.8968 90.2643 100.653 87.5038 100.653 84.1014V38.9066C100.653 35.5041 97.8968 32.7437 94.4868 32.7437ZM33.7461 38.9066H93.7176C94.1406 38.9066 94.4868 39.2532 94.4868 39.6769V45.0695H32.9769V39.6769C32.9769 39.2532 33.3231 38.9066 33.7461 38.9066ZM93.7176 84.1014H33.7461C33.3231 84.1014 32.9769 83.7547 32.9769 83.331V61.504H94.4868V83.331C94.4868 83.7547 94.1406 84.1014 93.7176 84.1014ZM51.4247 71.262V76.3977C51.4247 77.2451 50.7325 77.9385 49.8864 77.9385H40.656C39.8099 77.9385 39.1176 77.2451 39.1176 76.3977V71.262C39.1176 70.4146 39.8099 69.7212 40.656 69.7212H49.8864C50.7325 69.7212 51.4247 70.4146 51.4247 71.262ZM76.0389 71.262V76.3977C76.0389 77.2451 75.3467 77.9385 74.5005 77.9385H57.0655C56.2194 77.9385 55.5271 77.2451 55.5271 76.3977V71.262C55.5271 70.4146 56.2194 69.7212 57.0655 69.7212H74.5005C75.3467 69.7212 76.0389 70.4146 76.0389 71.262Z" fill="#A9ABBC"/>
</g>
<defs>
<filter id="filter0_d" x="0" y="0.975098" width="128" height="120.066" filterUnits="userSpaceOnUse" color-interpolation-filters="sRGB">
<feFlood flood-opacity="0" result="BackgroundImageFix"/>
<feColorMatrix in="SourceAlpha" type="matrix" values="0 0 0 0 0 0 0 0 0 0 0 0 0 0 0 0 0 0 127 0"/>
<feOffset/>
<feGaussianBlur stdDeviation="2"/>
<feColorMatrix type="matrix" values="0 0 0 0 0.133333 0 0 0 0 0.121569 0 0 0 0 0.364706 0 0 0 0.2 0"/>
<feBlend mode="normal" in2="BackgroundImageFix" result="effect1_dropShadow"/>
<feBlend mode="normal" in="SourceGraphic" in2="effect1_dropShadow" result="shape"/>
</filter>
<filter id="filter1_i" x="26.8105" y="32.7437" width="73.8426" height="59.5207" filterUnits="userSpaceOnUse" color-interpolation-filters="sRGB">
<feFlood flood-opacity="0" result="BackgroundImageFix"/>
<feBlend mode="normal" in="SourceGraphic" in2="BackgroundImageFix" result="shape"/>
<feColorMatrix in="SourceAlpha" type="matrix" values="0 0 0 0 0 0 0 0 0 0 0 0 0 0 0 0 0 0 127 0" result="hardAlpha"/>
<feOffset dy="2"/>
<feGaussianBlur stdDeviation="2"/>
<feComposite in2="hardAlpha" operator="arithmetic" k2="-1" k3="1"/>
<feColorMatrix type="matrix" values="0 0 0 0 0 0 0 0 0 0 0 0 0 0 0 0 0 0 0.1 0"/>
<feBlend mode="normal" in2="shape" result="effect1_innerShadow"/>
</filter>
</defs>
</svg>
