{
    "key": "group_6010827205c65",
    "title": "Single: Job Offer",
    "fields": [
        {
            "key": "field_6010827db0e7c",
            "label": "Availability",
            "name": "job_availability",
            "type": "text",
            "instructions": "",
            "required": 0,
            "conditional_logic": 0,
            "wrapper": {
                "width": "",
                "class": "",
                "id": ""
            },
            "default_value": "",
            "placeholder": "Full time",
            "prepend": "",
            "append": "",
            "maxlength": ""
        },
        {
            "key": "field_60108290b0e7d",
            "label": "Expertise",
            "name": "job_expertise",
            "type": "text",
            "instructions": "",
            "required": 0,
            "conditional_logic": 0,
            "wrapper": {
                "width": "",
                "class": "",
                "id": ""
            },
            "default_value": "",
            "placeholder": "Senior",
            "prepend": "",
            "append": "",
            "maxlength": ""
        }
    ],
    "location": [
        [
            {
                "param": "post_type",
                "operator": "==",
                "value": "guru_job"
            }
        ]
    ],
    "menu_order": 0,
    "position": "normal",
    "style": "default",
    "label_placement": "top",
    "instruction_placement": "label",
    "hide_on_screen": "",
    "active": 1,
    "description": "",
    "modified": 1611694746
}