Fecha,Máximo,Mínimo,Cierre,Volumen
28/12/2007,"15251,7","15124,9","15182,3",175446
27/12/2007,"15397,9","15178,7","15256,2",190293
21/12/2007,"15348,3","15233,8","15289,3",345189
20/12/2007,"15271,8","15107,4","15140,2",219813
19/12/2007,"15350,7","15177,1","15177,1",251452
18/12/2007,"15441,4","15276,1","15282,1",214312
17/12/2007,"15444,5","15302,7","15318,5",212447
14/12/2007,"15596,2","15429,5","15575,7",197864
13/12/2007,"15757,1","15486,5","15499,2",263502
12/12/2007,"15983,4","15679,2",15860,253187
11/12/2007,"15906,8","15771,8","15890,5",175267
10/12/2007,"15892,7","15739,9","15832,7",196318
07/12/2007,"15855,5","15759,5","15819,6",185595
06/12/2007,"15901,4","15667,1","15695,9",178746
05/12/2007,"15849,2","15737,6","15802,2",202136
04/12/2007,15804,15615,"15708,2",222204
03/12/2007,"15846,5",15710,15761,90080
30/11/2007,"15799,2","15643,5","15759,9",287711
29/11/2007,"15692,6","15485,1","15656,6",257570
28/11/2007,"15592,6","15229,4","15566,5",293572
27/11/2007,"15346,2","15165,1","15315,6",278561
26/11/2007,"15575,3",15294,"15330,2",229019
23/11/2007,"15400,8",15267,"15392,2",210365
22/11/2007,"15456,8","15272,4","15317,1",204169
21/11/2007,"15568,2","15294,7","15364,5",267686
20/11/2007,15700,"15485,8",15700,278274
19/11/2007,"15935,3","15539,3","15539,3",272245
16/11/2007,"15826,2",15560,15769,290675
15/11/2007,15871,15661,"15725,8",278672
14/11/2007,"15943,6","15754,2","15808,9",272081
13/11/2007,"15824,5","15634,4","15814,8",259626
12/11/2007,"15821,9","15648,4","15774,7",239922
09/11/2007,"16040,4","15682,7","15731,2",278413
08/11/2007,"15968,4","15612,6","15961,3",387083
07/11/2007,"15955,3","15640,2","15841,9",267579
06/11/2007,"15966,4","15868,6","15895,4",201298
05/11/2007,"15846,4","15685,5","15825,9",235020
02/11/2007,"15862,6","15652,1","15823,7",248639
01/11/2007,"15928,3","15622,6","15759,6",208210
31/10/2007,"15897,3",15729,"15890,5",286439
30/10/2007,"15792,3","15676,6","15782,5",217427
29/10/2007,"15775,6","15680,7","15732,6",179428
26/10/2007,"15652,7","15418,7",15594,207505
25/10/2007,"15407,8","15323,5","15366,7",198735
24/10/2007,"15443,1","15187,5","15231,3",224054
23/10/2007,"15479,5","15363,7","15429,6",258231
22/10/2007,"15363,1","15199,3","15327,8",239518
19/10/2007,"15627,3","15472,1","15529,7",268640
18/10/2007,"15569,6","15406,2","15507,1",304161
17/10/2007,"15489,3","15218,1","15430,5",298224
16/10/2007,"15309,5","15114,6","15279,7",267262
15/10/2007,15310,"15185,1","15187,5",319365
12/10/2007,"15264,2","14991,6","15261,3",265736
11/10/2007,"15142,2","14877,8","15114,7",268005
10/10/2007,"14917,2","14807,9","14863,8",197786
09/10/2007,"14907,3","14754,6","14862,7",210832
08/10/2007,"14921,3","14801,6","14819,8",109211
05/10/2007,"14900,4","14712,6","14892,1",189912
04/10/2007,"14801,8",14711,"14714,4",217102
03/10/2007,"14800,3","14723,3",14766,167432
02/10/2007,"14817,6",14697,14790,282160
01/10/2007,"14629,1","14443,9",14603,263987
28/09/2007,"14618,4","14460,3","14576,5",212388
27/09/2007,"14704,5","14550,9","14570,2",198862
26/09/2007,"14552,7","14373,8","14513,7",222262
25/09/2007,"14446,1",14224,"14311,9",195564
24/09/2007,"14550,2",14404,"14490,7",120431
21/09/2007,"14550,1","14383,6","14450,6",281428
20/09/2007,"14458,2","14342,5","14431,9",170769
19/09/2007,"14537,5","14314,8","14494,8",379612
18/09/2007,"14045,7","13594,6",14042,276072
17/09/2007,"13822,2","13519,1","13696,9",276090
14/09/2007,"14025,5","13765,9",13861,230971
13/09/2007,"14101,4","13835,2","14090,3",213594
12/09/2007,"13992,7","13838,5","13980,4",226827
11/09/2007,"13991,7","13775,9",13977,165701
10/09/2007,"13935,8","13703,6","13726,3",244191
07/09/2007,"14210,1","13816,3",13824,237611
06/09/2007,"14345,7","14050,5","14198,4",249355
05/09/2007,"14562,1","14243,9","14252,5",174026
04/09/2007,"14593,1","14437,8","14575,2",138390
03/09/2007,"14561,1","14467,1","14546,9",99078
31/08/2007,14529,"14370,5","14479,8",183595
30/08/2007,"14346,1","14127,1","14313,4",156239
29/08/2007,"14209,3","14014,1","14183,6",167239
28/08/2007,"14300,5","14091,1","14096,4",118936
27/08/2007,"14403,4","14291,5","14305,5",87355
24/08/2007,14350,"14195,1","14343,8",93729
23/08/2007,"14482,1","14308,8","14319,3",122546
22/08/2007,"14412,2","14287,4","14354,7",115107
21/08/2007,"14324,2","14067,1","14239,8",167459
20/08/2007,"14381,3","14228,9","14273,7",156124
17/08/2007,"14375,6","13841,6","14237,5",318933
16/08/2007,"14295,7","13959,9","13979,7",289591
15/08/2007,"14547,5","14367,1","14520,5",163503
14/08/2007,"14733,4","14519,5","14546,2",161994
13/08/2007,14754,"14552,1","14731,8",204949
10/08/2007,"14703,5","14434,2","14453,9",332877
09/08/2007,"14988,8","14755,7","14841,9",261886
08/08/2007,"15028,7","14719,6","15004,2",226228
07/08/2007,14655,"14522,7","14652,9",160003
06/08/2007,"14539,3","14385,3","14432,1",178395
03/08/2007,"14719,5","14533,9","14534,3",184937
02/08/2007,14756,"14626,2","14678,6",212142
01/08/2007,"14733,5","14441,8","14595,7",294857
31/07/2007,"14802,4","14604,1","14802,4",221127
30/07/2007,"14650,3","14462,3","14507,9",195278
27/07/2007,"14655,5","14378,7","14587,5",257565
26/07/2007,"15012,9","14540,1","14540,4",305510
25/07/2007,"15036,9","14774,9","14937,7",244681
24/07/2007,"15135,2","14869,4","14913,3",215883
23/07/2007,"15056,7",14875,"15056,7",142001
20/07/2007,"15249,7","14925,8","14930,1",236399
19/07/2007,"15297,2","15123,5","15190,2",148957
18/07/2007,"15197,4","15037,8","15058,6",211436
17/07/2007,"15168,5","15047,9","15153,8",204487
16/07/2007,"15117,6","15009,9","15110,4",161061
13/07/2007,"15082,7","14981,1","15023,5",171217
12/07/2007,"14941,8","14672,5","14941,8",199227
11/07/2007,"14795,4","14601,8","14766,2",208393
10/07/2007,"15021,1","14751,5","14823,9",190935
09/07/2007,"15145,9",14951,"14978,2",116388
06/07/2007,"15047,6","14875,2","15043,4",141209
05/07/2007,"15025,7",14885,"14914,9",138983
04/07/2007,"15000,7","14878,1","14989,7",144833
03/07/2007,"14917,9","14854,9","14869,4",160350
02/07/2007,"14850,9","14741,2","14804,7",154132
29/06/2007,"14878,2","14712,2",14892,203840
28/06/2007,"14840,7","14744,3","14819,9",195361
27/06/2007,"14751,3","14582,4","14681,7",272534
26/06/2007,"14884,8","14708,5",14742,219282
25/06/2007,"14857,9","14595,1","14848,3",224718
22/06/2007,14943,"14756,8","14787,7",152917
21/06/2007,"14951,1","14790,8","14882,4",247328
20/06/2007,15095,15011,"15047,5",174906
19/06/2007,"15164,4","14913,3","15033,7",198431
18/06/2007,"15251,2","15053,2","15099,4",187375
15/06/2007,"15288,5","15110,8","15252,1",361359
14/06/2007,"15078,4","14927,5","15078,4",277248
13/06/2007,"14842,4","14638,1","14817,3",235277
12/06/2007,14951,"14704,7","14764,3",250569
11/06/2007,"14977,9","14870,1","14940,6",203733
08/06/2007,"14874,2","14604,6","14816,5",293714
07/06/2007,15042,"14678,3","14725,9",370544
06/06/2007,"15282,4","14925,4","14928,8",327366
05/06/2007,"15461,9","15304,8","15314,9",228560
04/06/2007,"15511,8","15372,5","15423,2",167530
01/06/2007,"15543,8","15321,5","15501,5",288415
31/05/2007,"15340,5","15243,8","15329,4",276198
30/05/2007,"15144,4","15035,4","15137,3",163691
29/05/2007,"15198,6","15123,8","15188,6",230108
28/05/2007,"15126,7","15067,7","15119,4",46951
25/05/2007,"15086,3","14970,1","15047,3",164575
24/05/2007,15220,"15082,7","15094,9",189649
23/05/2007,"15223,9","15072,7","15223,9",197645
22/05/2007,"15107,8","15015,1","15068,7",137038
21/05/2007,"15158,5",15042,"15059,2",147841
18/05/2007,"15114,3","14937,3","15068,4",266560
17/05/2007,"14997,6","14899,4","14968,2",158038
16/05/2007,"14928,5","14763,8","14918,8",217246
15/05/2007,"14824,2","14650,9","14824,2",219612
14/05/2007,"14796,7","14668,8","14688,3",131731
11/05/2007,"14751,1","14449,3","14736,3",259159
10/05/2007,"14712,3","14500,7","14575,6",212214
09/05/2007,"14647,1","14513,9","14609,4",206034
08/05/2007,"14664,6","14508,3","14567,3",165000
07/05/2007,14693,"14566,4","14656,8",116431
04/05/2007,"14636,5","14426,2","14620,3",309616
03/05/2007,"14454,6",14176,"14395,6",276750
02/05/2007,"14462,9",14363,"14416,9",198617
30/04/2007,"14532,6","14354,9","14374,6",170261
27/04/2007,"14618,3",14342,"14403,6",240071
26/04/2007,"14789,7","14570,3",14608,233703
25/04/2007,"14635,4","14468,7","14602,1",249075
24/04/2007,"14988,4","14516,5","14578,7",365177
23/04/2007,"15111,7","14948,4","14996,6",126867
20/04/2007,"15136,2",14857,"15080,9",278685
19/04/2007,"14821,7","14623,3","14821,7",234856
18/04/2007,"14930,2","14800,1","14869,5",157542
17/04/2007,"15020,3","14855,1","14965,6",174908
16/04/2007,"15059,5","14999,2","15020,8",222283
13/04/2007,"14984,5",14894,"14965,3",174237
12/04/2007,"14978,4","14775,2",14883,215105
11/04/2007,"15063,8","14956,9","14997,6",185219
10/04/2007,15022,14908,"15005,5",158757
05/04/2007,"14970,2","14914,1","14963,6",70023
04/04/2007,"14988,6",14891,"14933,7",141281
03/04/2007,14972,"14783,8","14953,2",278637
02/04/2007,"14735,8","14580,5","14730,8",208640
30/03/2007,"14730,4","14539,4","14641,7",212044
29/03/2007,"14605,3","14519,5","14605,3",205075
28/03/2007,"14535,5","14410,9","14467,3",162054
27/03/2007,"14578,3","14495,7","14536,8",247503
26/03/2007,14626,"14414,6","14469,6",234019
23/03/2007,"14555,2","14433,2","14545,7",213009
22/03/2007,14541,"14409,5","14490,1",236921
21/03/2007,"14385,4","14275,7","14310,5",236980
20/03/2007,"14323,2","14151,7","14323,2",255354
19/03/2007,"14250,2","14093,2","14250,2",204286
16/03/2007,"14039,6","13866,4","13974,5",327449
15/03/2007,"13940,4","13755,9","13940,4",277408
14/03/2007,"13794,2","13602,4","13602,4",360198
13/03/2007,"14206,2","13982,5","13982,9",222017
12/03/2007,"14359,8","14088,1","14146,5",200040
09/03/2007,"14306,1","14098,1","14257,2",183694
08/03/2007,14201,"13983,6",14194,235753
07/03/2007,13972,"13823,8","13912,7",232209
06/03/2007,"13859,3","13699,2","13825,9",224567
05/03/2007,"13830,2","13654,9","13749,1",327845
02/03/2007,"14193,7","13880,2","13962,2",0
01/03/2007,"14411,9","13820,6","14064,9",216039
28/02/2007,"14366,2","14070,9","14248,4",199405
27/02/2007,"14747,2","14401,6","14408,3",308227
26/02/2007,"14882,2","14786,6","14856,1",147577
23/02/2007,"14827,8","14703,9","14767,1",157731
22/02/2007,"14880,7","14761,7","14791,3",182851
21/02/2007,"14963,6","14765,3","14788,8",189029
20/02/2007,"14937,2","14836,5","14886,1",181351
19/02/2007,"14947,8","14872,9","14915,8",131459
16/02/2007,"14862,4","14777,5","14851,2",317403
15/02/2007,"14938,3","14848,8","14876,9",147226
14/02/2007,14910,"14815,2","14905,7",183538
13/02/2007,"14855,1",14781,"14824,6",150810
12/02/2007,"14834,2",14729,14769,167531
09/02/2007,"14927,2","14866,5","14875,5",173550
08/02/2007,14893,"14773,7",14826,207881
07/02/2007,"14867,3",14708,"14854,6",226398
06/02/2007,"14743,8","14644,6","14703,2",215577
05/02/2007,"14625,9",14559,"14616,7",170956
02/02/2007,"14631,2","14545,3","14631,2",166193
01/02/2007,"14656,9","14570,9","14571,5",210970
31/01/2007,"14580,3",14450,"14553,2",193218
30/01/2007,"14564,1","14459,8","14553,4",162071
29/01/2007,"14512,4","14391,7",14507,147978
26/01/2007,"14486,9","14377,5","14415,4",177064
25/01/2007,"14605,6","14490,6","14537,3",182130
24/01/2007,"14560,2","14415,8","14540,7",200698
23/01/2007,"14394,2","14304,7","14368,6",159666
22/01/2007,"14500,4","14351,7","14359,7",173861
19/01/2007,"14398,3",14182,"14397,9",213139
18/01/2007,"14383,5",14221,"14265,3",211868
17/01/2007,"14408,2",14233,14295,196719
16/01/2007,"14482,6","14314,6","14355,6",182449
15/01/2007,"14455,7","14411,9","14416,7",167235
12/01/2007,"14373,7","14292,8","14368,2",193200
11/01/2007,"14220,9","14115,6","14127,5",95593
10/01/2007,"14239,4","14065,7","14116,1",253322
09/01/2007,"14417,5","14293,6","14311,5",236256
08/01/2007,"14380,6","14296,7","14322,3",214476
05/01/2007,"14390,5","14286,1","14304,7",227567
04/01/2007,"14382,4","14231,2","14382,4",214563
03/01/2007,"14396,6","14307,7","14375,1",199468
02/01/2007,"14381,1","14157,3","14364,4",184474
