Fecha,Máximo,Mínimo,Cierre,Volumen
31/12/1996,"5217,79","5138,71","5154,77",0
30/12/1996,"5149,48","5113,79","5144,95",0
27/12/1996,"5185,89","5082,36","5107,02",0
26/12/1996,"5113,97","5005,28","5101,76",0
23/12/1996,"5007,47","4952,89","4996,52",0
20/12/1996,"5009,04","4944,16","4966,75",0
19/12/1996,"4908,85","4811,08","4908,85",0
18/12/1996,"4828,96","4768,13","4815,56",0
17/12/1996,"4763,66","4713,94","4733,27",0
16/12/1996,"4741,06","4702,01","4737,1",0
13/12/1996,"4651,12","4603,3","4650,99",0
12/12/1996,"4701,83","4649,17","4663,87",0
11/12/1996,"4732,21","4669,44","4677,8",0
10/12/1996,"4758,71","4731,48","4753,18",0
09/12/1996,"4710,42","4649,71","4704,11",0
05/12/1996,"4747,72","4702,77","4714,04",0
04/12/1996,"4728,25","4707,77","4724,53",0
03/12/1996,"4757,21","4698,82","4757,18",0
02/12/1996,"4698,5","4655,28","4683,5",0
29/11/1996,"4667,91","4632,08","4667,8",0
28/11/1996,"4624,3","4550,14","4616,72",0
27/11/1996,"4584,56","4542,24","4566,54",0
26/11/1996,"4616,41","4587,55","4597,2",0
25/11/1996,"4589,59","4571,21","4584,83",0
22/11/1996,"4549,8","4503,57","4544,34",0
21/11/1996,"4516,98","4481,9","4511,57",0
20/11/1996,"4530,46","4500,15","4512,91",0
19/11/1996,"4507,5","4445,97","4506,85",0
18/11/1996,"4496,1","4474,88","4483,69",0
15/11/1996,"4499,82","4458,91","4489,9",0
14/11/1996,"4504,09","4477,45","4492,91",0
13/11/1996,"4469,9","4450,92","4469,9",0
12/11/1996,"4470,1","4423,86","4460,54",0
11/11/1996,"4430,87","4412,62","4421,36",0
08/11/1996,"4458,64","4416,03","4428,08",0
07/11/1996,"4434,37","4404,04","4433,72",0
06/11/1996,"4427,25","4396,82","4427,25",0
05/11/1996,"4373,88","4337,94","4373,87",0
04/11/1996,"4324,1","4298,74","4316,64",0
30/10/1996,"4364,51","4306,69","4308,77",0
29/10/1996,"4364,2","4338,78","4352,18",0
28/10/1996,"4413,09","4378,05","4383,62",0
25/10/1996,"4402,18","4383,51","4396,91",0
24/10/1996,"4413,48","4373,63","4406,65",0
23/10/1996,"4404,21","4373,18","4384,79",0
22/10/1996,"4410,13","4384,79","4403,41",0
21/10/1996,"4404,09","4378,67","4402,61",0
18/10/1996,"4386,54","4338,4","4377,37",0
17/10/1996,"4332,63","4278,2","4322,27",0
16/10/1996,"4336,51","4288,79","4295,47",0
15/10/1996,"4328,36","4275,42","4328,36",0
14/10/1996,"4266,37","4227,87","4266,07",0
11/10/1996,"4260,88","4225,35","4243,07",0
10/10/1996,"4264,35","4224,83","4247,48",0
09/10/1996,"4300,24","4248,17","4257,78",0
08/10/1996,4280,4255,4260,0
07/10/1996,"4289,57","4267,07","4271,25",0
04/10/1996,"4272,29","4208,74","4266,3",0
03/10/1996,"4266,18","4236,46","4243,86",0
02/10/1996,"4270,14","4249,93","4262,39",0
30/09/1996,"4229,25","4167,79","4215,57",0
27/09/1996,"4230,72","4180,83","4195,06",0
26/09/1996,"4226,48","4195,54","4213,92",0
25/09/1996,"4177,83","4149,81","4177,83",0
24/09/1996,"4136,63","4094,95","4135,72",0
23/09/1996,"4121,23","4086,64","4097,98",0
20/09/1996,"4113,28","4086,81","4093,6",0
19/09/1996,"4093,1","4065,5","4082,2",0
18/09/1996,"4105,56","4066,29","4069,81",0
17/09/1996,"4120,44",4073,"4083,56",0
16/09/1996,"4122,08","4093,74","4101,63",0
13/09/1996,"4090,18","4037,03","4079,31",0
12/09/1996,"4034,28","4000,17","4030,44",0
11/09/1996,"4004,1","3976,66","4001,34",0
10/09/1996,"4018,11","3990,06","4003,71",0
09/09/1996,"3995,63","3958,84","3987,88",0
06/09/1996,"3963,15","3898,17","3963,07",0
05/09/1996,"3973,22","3938,59","3953,33",0
04/09/1996,"4025,18","3961,86","3966,22",0
03/09/1996,"4018,28","3969,4",4004,0
02/09/1996,"4042,84","4020,43","4033,56",0
30/08/1996,"4057,48","4022,06","4025,47",0
29/08/1996,"4087,93","4038,84","4046,18",0
28/08/1996,"4099,59","4078,8","4084,46",0
27/08/1996,"4078,12","4032,65","4075,53",0
26/08/1996,"4055,13","4026,32","4040,99",0
23/08/1996,"4079,76","4038,68","4069,95",0
22/08/1996,"4062,8","3998,41","4060,15",0
21/08/1996,"4012,68","3987,32","3997,78",0
20/08/1996,"4025,26","4003,25","4022,23",0
19/08/1996,"4046,37","4002,87","4012,26",0
16/08/1996,"4057,19","4035,13","4052,04",0
14/08/1996,"4034,16","4016,12","4025,69",0
13/08/1996,"4053,23","4023,77","4030,62",0
12/08/1996,"4026,7","3994,82","4018,87",0
09/08/1996,"4058,93","4010,5","4030,51",0
08/08/1996,"4084,84","4048,06","4070,07",0
07/08/1996,"4085,55",4064,4072,0
06/08/1996,"4117,28","4094,55",4101,0
05/08/1996,"4144,42","4116,65","4130,15",0
02/08/1996,"4123,28","4050,1","4120,21",0
01/08/1996,"4046,43","3992,22","4039,98",0
31/07/1996,"3983,54","3919,85","3979,35",0
30/07/1996,"3947,97","3890,58","3932,4",0
29/07/1996,"3972,68","3910,65","3935,67",0
26/07/1996,"4025,88","3955,64","3964,25",0
25/07/1996,"4010,8","3962,46","4010,8",0
24/07/1996,"3994,4","3950,64","3976,45",0
22/07/1996,"4055,97","3991,15","3997,6",0
19/07/1996,"4091,17","4043,16","4055,1",0
18/07/1996,"4051,63","4022,55","4037,05",0
17/07/1996,"4040,24","3995,76","4001,93",0
16/07/1996,"4039,74","3953,61","3985,46",0
15/07/1996,"4105,46","4050,49","4056,76",0
12/07/1996,"4141,58","4108,82","4114,65",0
11/07/1996,"4176,44","4131,17","4151,17",0
10/07/1996,"4221,04","4171,1","4177,38",0
09/07/1996,"4217,73","4185,14","4209,99",0
05/07/1996,"4246,49","4176,01","4193,72",0
04/07/1996,"4254,27","4234,04","4249,69",0
03/07/1996,"4259,44","4225,99","4228,71",0
02/07/1996,"4306,48","4248,49","4255,91",0
01/07/1996,"4281,61","4237,57","4278,31",0
28/06/1996,"4267,37","4227,67","4264,1",0
27/06/1996,"4254,59","4223,9","4233,1",0
26/06/1996,"4269,44","4246,17","4257,95",0
25/06/1996,"4291,45","4264,05","4269,44",0
24/06/1996,"4272,46","4242,86","4264,44",0
21/06/1996,"4243,07","4204,12","4241,49",0
20/06/1996,"4223,49","4198,62","4211,52",0
19/06/1996,"4252,63","4216,58","4228,23",0
18/06/1996,"4241,15","4194,84","4240,12",0
17/06/1996,"4234,8","4206,38",4224,0
14/06/1996,"4239,19","4213,42","4237,12",0
13/06/1996,"4258,97","4234,02","4241,98",0
12/06/1996,"4261,8","4229,23","4255,57",0
11/06/1996,"4224,4","4159,4","4224,4",0
10/06/1996,"4184,69","4161,99","4173,2",0
07/06/1996,"4190,29","4108,34","4136,47",0
06/06/1996,"4172,51","4134,02","4168,38",0
05/06/1996,"4130,07","4113,41","4125,18",0
04/06/1996,"4117,62","4086,3","4116,54",0
03/06/1996,"4089,68","4066,71","4066,76",0
31/05/1996,"4131,37","4111,66","4111,66",0
28/05/1996,"4186,86","4159,12","4170,46",0
27/05/1996,"4150,7","4128,26","4150,7",0
24/05/1996,"4142,52","4121,14","4137,51",0
23/05/1996,"4152,07","4128,5","4137,62",0
22/05/1996,"4139,52","4120,14","4128,14",0
21/05/1996,"4155,81","4142,39","4155,15",0
20/05/1996,"4156,67","4126,54","4143,45",0
17/05/1996,"4109,72","4062,86","4109,72",0
16/05/1996,"4069,23","4058,44","4067,58",0
14/05/1996,"4070,84","4041,91","4068,95",0
13/05/1996,"4077,66","4056,63","4062,85",0
10/05/1996,"4057,87","4008,3","4057,87",0
09/05/1996,"4019,48","3980,63","4015,09",0
08/05/1996,"4033,84","3987,29","4004,05",0
07/05/1996,"4067,09","4033,57","4040,83",0
06/05/1996,"4073,62","4046,11","4062,87",0
03/05/1996,"4060,95","4014,87","4060,8",0
30/04/1996,"4096,75","4076,84","4082,9",0
29/04/1996,"4137,53","4093,71","4112,15",0
26/04/1996,"4124,38","4098,05","4124,31",0
25/04/1996,"4098,42","4075,85","4096,23",0
24/04/1996,"4085,5","4052,53","4082,2",0
23/04/1996,"4071,47","4040,57","4058,53",0
22/04/1996,"4083,09","4052,22","4070,34",0
19/04/1996,"4038,52","3982,83","4038,51",0
18/04/1996,"3995,42","3951,18","3984,59",0
17/04/1996,"3965,32","3933,27","3964,21",0
16/04/1996,"3960,74","3944,91","3954,22",0
15/04/1996,"3950,58","3936,33","3949,6",0
12/04/1996,"3919,54","3889,03","3918,12",0
11/04/1996,"3909,28","3875,52","3888,72",0
10/04/1996,"3917,46","3890,21","3911,01",0
09/04/1996,"3889,07","3855,42","3886,22",0
08/04/1996,"3872,19","3830,23","3850,64",0
03/04/1996,"3901,94","3883,11","3894,78",0
02/04/1996,"3879,91","3856,18","3879,91",0
01/04/1996,"3865,77","3840,22","3862,66",0
29/03/1996,"3862,59","3823,36","3857,12",0
28/03/1996,"3830,19","3796,6","3830,19",0
27/03/1996,"3845,75","3826,75","3839,41",0
25/03/1996,"3848,52","3791,54","3842,37",0
22/03/1996,"3804,94","3784,19","3791,54",0
21/03/1996,"3820,97","3794,05","3810,12",0
20/03/1996,"3785,07","3733,21","3782,72",0
18/03/1996,"3718,03","3683,75","3717,65",0
15/03/1996,"3713,2","3664,8","3685,82",0
14/03/1996,"3700,56","3666,67","3700,56",0
13/03/1996,"3720,29","3681,67","3688,66",0
12/03/1996,"3741,68","3685,18","3694,34",0
11/03/1996,"3715,19","3665,01","3703,48",0
08/03/1996,"3808,5","3702,14","3762,31",0
07/03/1996,"3755,22","3722,04","3755,22",0
06/03/1996,"3720,8","3675,54","3720,77",0
05/03/1996,"3707,31","3634,66","3652,81",0
04/03/1996,"3759,78","3673,95","3713,81",0
01/03/1996,"3938,92","3903,99","3918,17",0
29/02/1996,"3915,91","3890,37","3915,52",0
28/02/1996,"3909,89","3876,6","3909,89",0
27/02/1996,"3860,26","3845,71","3858,22",0
26/02/1996,"3862,07","3841,38","3847,49",0
23/02/1996,"3885,47","3857,27","3862,12",0
22/02/1996,"3880,33","3852,17","3863,64",0
21/02/1996,"3837,44","3787,69","3837,44",0
20/02/1996,"3795,02","3751,94","3780,16",0
19/02/1996,"3796,2","3764,16","3781,97",0
16/02/1996,"3823,18","3768,69","3790,05",0
15/02/1996,"3786,1","3713,76","3786,1",0
14/02/1996,"3733,96","3712,38","3729,44",0
13/02/1996,3733,"3704,08","3731,96",0
09/02/1996,"3685,39","3615,29","3685,39",0
08/02/1996,"3670,41","3646,3","3660,43",0
07/02/1996,"3710,54","3693,38","3697,91",0
06/02/1996,"3694,58","3678,97","3694,58",0
05/02/1996,"3687,99","3666,85","3680,77",0
02/02/1996,"3741,05","3719,62","3727,37",0
01/02/1996,"3750,91","3727,27","3750,91",0
31/01/1996,"3735,36","3708,16","3734,49",0
30/01/1996,"3708,69","3652,94","3707,09",0
26/01/1996,"3739,08","3704,48","3720,67",0
25/01/1996,3768,"3742,77","3753,02",0
24/01/1996,"3735,97","3707,91","3735,83",0
23/01/1996,"3718,59","3706,29","3710,77",0
22/01/1996,"3744,79","3722,76","3733,47",0
19/01/1996,"3747,76","3729,42","3742,09",0
18/01/1996,"3742,48","3713,61","3735,36",0
17/01/1996,"3721,05","3696,67","3718,28",0
16/01/1996,"3703,61","3679,46","3703,61",0
15/01/1996,"3695,02","3677,45","3680,1",0
12/01/1996,"3691,03","3671,62","3679,34",0
11/01/1996,"3655,69","3633,6","3651,31",0
10/01/1996,"3672,97","3643,41","3655,73",0
09/01/1996,"3689,74","3683,62","3689,74",0
08/01/1996,"3698,79","3679,75","3696,57",0
05/01/1996,"3705,45","3671,42","3693,53",0
04/01/1996,"3725,51","3700,33","3718,22",0
03/01/1996,"3744,88","3713,15","3717,72",0
02/01/1996,"3685,61","3640,04","3685,36",0
