Fecha,Máximo,Mínimo,Cierre,Volumen
28/12/2001,"8519,7","8408,3","8434,5",83642
27/12/2001,"8425,7","8273,4","8424,2",86410
21/12/2001,"8315,6","8112,2","8292,3",153007
20/12/2001,"8263,8","8132,2","8233,4",131905
19/12/2001,"8512,4","8277,6","8335,2",127926
18/12/2001,"8599,4","8462,1","8495,1",75729
17/12/2001,"8578,4",8278,"8552,2",75056
14/12/2001,"8363,3","8256,5",8276,75076
13/12/2001,"8578,6","8343,6","8350,5",85499
12/12/2001,"8711,4","8524,4","8544,3",79019
11/12/2001,"8690,6","8497,1","8627,8",75309
10/12/2001,"8664,6","8542,3","8546,6",64009
07/12/2001,8876,"8702,2","8736,3",100263
05/12/2001,"8821,7","8552,6","8818,8",128750
04/12/2001,"8514,6","8336,6","8514,6",106858
03/12/2001,"8302,9","8131,6","8265,9",89803
30/11/2001,"8361,9","8229,2","8320,7",91011
29/11/2001,"8415,8","8233,3","8272,9",107080
28/11/2001,"8516,4","8335,3","8360,3",84356
27/11/2001,"8650,9","8443,1","8449,3",105180
26/11/2001,"8651,8","8536,6",8581,67835
23/11/2001,"8577,3","8431,3","8535,4",74010
22/11/2001,"8540,9","8450,6","8511,9",65227
21/11/2001,"8549,4","8390,5","8403,6",94996
20/11/2001,"8710,6","8487,7",8542,94618
19/11/2001,"8742,5","8637,6","8713,1",82537
16/11/2001,8539,"8387,8","8536,8",115817
15/11/2001,"8606,5","8393,2","8482,1",137224
14/11/2001,"8569,6","8381,2","8430,2",128329
13/11/2001,"8402,8","8159,7","8383,1",116578
12/11/2001,"8268,7","7961,8","8051,1",85805
09/11/2001,"8285,8","8192,4","8223,5",72290
08/11/2001,"8416,7","8095,9","8363,3",138801
07/11/2001,"8118,4","7939,6","8118,4",116682
06/11/2001,"8070,5","7967,7","8002,4",122641
05/11/2001,"7946,7",7712,"7941,2",84817
02/11/2001,"7817,2","7607,8","7667,8",80335
01/11/2001,"7762,3","7616,9","7762,3",59697
31/10/2001,"7824,4","7514,9","7743,8",106074
30/10/2001,"7673,3","7550,1",7596,119892
29/10/2001,"7959,7","7779,9","7795,3",81508
26/10/2001,"8001,9","7900,5","7958,3",98335
25/10/2001,"8176,6","7834,2","7876,1",100590
24/10/2001,"8126,1","7888,3","8104,8",125824
23/10/2001,"7949,8","7827,7","7931,7",106025
22/10/2001,"7774,2","7585,1","7772,6",66723
19/10/2001,"7832,6","7547,6","7581,3",121546
18/10/2001,7882,"7721,5","7802,3",104667
17/10/2001,"7935,2","7743,7","7906,7",122007
16/10/2001,"7713,3","7520,1","7644,6",103336
15/10/2001,"7551,5","7429,1","7481,8",114893
11/10/2001,"7739,2","7533,3","7560,3",122210
10/10/2001,"7517,6",7202,"7511,9",107470
09/10/2001,"7313,2","7122,2","7268,6",103197
08/10/2001,"7233,1","6925,9","7221,6",113032
05/10/2001,"7385,7","7125,7","7151,4",153259
04/10/2001,"7441,6","7335,2","7440,8",120297
03/10/2001,"7309,5","7144,3","7239,8",95311
02/10/2001,"7309,5",7102,"7269,5",97727
01/10/2001,7341,"7128,5","7160,1",113648
28/09/2001,"7368,2","7255,8","7330,9",107140
27/09/2001,"7197,9","6961,9","7171,5",125272
26/09/2001,"7145,3",6908,"7036,5",135252
25/09/2001,7038,"6768,8","7000,5",155878
24/09/2001,"6895,9","6583,3","6883,3",104374
21/09/2001,"6638,8","6260,1","6474,3",202452
20/09/2001,"7001,6","6702,5","6744,5",144629
19/09/2001,7105,"6888,6","6927,9",136831
18/09/2001,"7046,2","6838,3","7043,8",122662
17/09/2001,"7094,8","6660,6","7042,9",147497
14/09/2001,"7391,6","6909,1","6911,8",125221
13/09/2001,"7357,2","7243,2","7308,1",86305
12/09/2001,"7405,4","6887,9","7339,3",149299
11/09/2001,"7773,9","7150,6","7328,4",143796
10/09/2001,"7779,6","7522,8",7685,114247
07/09/2001,"7950,1","7718,1","7729,9",127504
06/09/2001,"8176,2","7892,8","7903,6",108647
05/09/2001,"8259,3","8120,1","8125,4",57835
04/09/2001,"8306,1","8141,8","8303,3",67993
03/09/2001,"8374,4","8123,1","8180,8",61341
31/08/2001,"8333,4","8165,3","8333,4",64161
30/08/2001,"8474,8","8244,8","8244,8",53412
29/08/2001,"8469,2","8287,4","8408,2",55908
28/08/2001,"8581,8","8347,5","8366,6",57907
27/08/2001,"8627,9","8495,8","8508,3",42394
24/08/2001,"8532,9","8382,4","8532,9",59596
23/08/2001,"8421,7","8273,7","8403,3",0
22/08/2001,"8373,9","8171,2","8280,9",78966
21/08/2001,"8268,3","8171,5","8214,1",56051
20/08/2001,"8223,3","8083,8","8186,6",48780
17/08/2001,"8383,6","8127,4","8200,1",91825
16/08/2001,"8382,5","8242,3","8322,9",89427
14/08/2001,"8505,8",8379,8450,71324
13/08/2001,8351,"8189,8","8327,5",66221
10/08/2001,"8380,1","8159,2","8188,5",77974
09/08/2001,"8439,2","8279,5","8299,2",0
08/08/2001,"8560,3","8379,2","8453,5",64980
07/08/2001,"8624,7","8489,1","8552,7",51681
06/08/2001,8669,"8555,5",8634,60471
03/08/2001,"8646,5","8558,6","8585,4",47739
02/08/2001,"8684,9","8482,9","8602,5",82536
01/08/2001,"8608,2","8462,8","8557,3",80290
31/07/2001,8480,"8319,3","8457,7",85847
30/07/2001,"8450,7","8255,9","8428,7",72142
27/07/2001,"8312,5","8155,5",8217,81049
26/07/2001,8284,"8162,3","8220,1",69372
25/07/2001,"8360,6","8135,4","8164,1",78225
24/07/2001,"8401,3","8295,1","8356,6",55892
23/07/2001,"8463,4","8248,3","8395,6",72436
20/07/2001,"8324,5","8237,2","8324,5",55258
19/07/2001,"8354,2","8177,6","8322,7",95058
18/07/2001,"8403,6","8148,6","8210,1",105170
17/07/2001,"8387,6","8220,6","8360,8",98912
16/07/2001,"8349,7","8217,2","8280,2",54080
13/07/2001,"8313,8",8142,8295,97524
12/07/2001,"8424,6","8074,5","8150,7",134245
11/07/2001,"8369,5","8228,9","8266,1",125500
10/07/2001,"8648,9","8448,6","8465,1",88035
09/07/2001,"8577,1","8344,6","8526,2",102637
06/07/2001,"8738,8","8456,4","8487,7",146488
05/07/2001,"8892,2","8761,5","8787,6",84221
04/07/2001,"8994,2","8850,9","8898,3",70466
03/07/2001,"9104,9","8954,7","9015,9",93617
02/07/2001,"9078,7","8827,7","9070,7",77054
29/06/2001,"8900,3","8811,2","8878,4",139965
28/06/2001,8895,"8634,1","8866,5",141506
27/06/2001,"8890,7","8766,1","8794,5",98178
26/06/2001,"8956,2","8758,4","8792,7",99447
25/06/2001,"9026,3","8884,3","8964,3",82389
22/06/2001,"9047,6","8857,1","8913,1",85843
21/06/2001,"9086,7","8900,9","8943,9",102656
20/06/2001,"9038,8","8862,8","9013,7",110707
19/06/2001,"9105,4","9008,7","9047,9",113227
18/06/2001,"9307,7","9016,8","9018,7",125521
15/06/2001,"9481,8","9266,1","9348,4",132133
14/06/2001,"9496,9","9443,4","9471,3",55923
13/06/2001,"9538,5","9455,2","9522,5",83895
12/06/2001,"9616,6","9432,1","9444,9",80965
11/06/2001,"9652,6","9545,8","9597,8",64576
08/06/2001,"9663,9","9570,6","9588,6",70000
07/06/2001,"9600,5","9485,6","9516,8",70121
06/06/2001,"9637,1","9519,9","9533,9",58768
05/06/2001,"9598,4","9489,5","9590,5",55677
04/06/2001,"9561,5","9441,8","9550,1",65861
01/06/2001,"9476,3","9374,3","9399,4",80069
31/05/2001,"9514,5","9370,6","9488,1",83962
30/05/2001,"9526,3","9426,7","9439,9",79701
29/05/2001,"9580,9","9455,8","9487,2",62180
28/05/2001,9576,"9451,5","9545,6",35246
25/05/2001,"9638,9","9422,2","9485,6",68882
24/05/2001,"9671,4","9584,6","9616,2",51322
23/05/2001,"9707,2","9575,2","9623,9",70528
22/05/2001,"9747,1","9596,6","9626,9",105614
21/05/2001,"9739,3","9583,9","9678,2",61306
18/05/2001,"9755,6","9621,8","9728,4",98361
17/05/2001,"9741,9","9642,1",9664,104041
16/05/2001,"9637,1","9473,4","9588,1",105181
15/05/2001,"9668,3","9550,9","9668,3",43979
14/05/2001,9702,"9578,6","9607,5",67150
11/05/2001,"9845,8","9657,8",9686,73832
10/05/2001,"9854,6","9624,5","9782,8",92629
09/05/2001,9668,"9497,6","9654,3",81320
08/05/2001,"9707,8","9539,8","9673,3",63897
07/05/2001,"9673,5","9558,2",9600,39685
04/05/2001,9583,"9399,2","9542,7",82749
03/05/2001,"9718,4",9467,"9488,2",80703
02/05/2001,"9833,1","9633,5","9633,5",78314
30/04/2001,"9772,1","9623,5",9761,76696
26/04/2001,"9544,1","9351,5","9507,1",94758
25/04/2001,"9398,6","9242,5","9353,2",68454
24/04/2001,"9450,3","9261,8","9418,9",91459
23/04/2001,"9530,2","9243,5",9255,104866
20/04/2001,"9854,1","9546,5","9547,8",85342
19/04/2001,"9886,6","9750,5",9798,114733
18/04/2001,"9856,7","9614,5","9786,1",86713
17/04/2001,9573,"9417,2","9526,5",75186
12/04/2001,"9663,2","9564,5","9648,8",47626
11/04/2001,"9684,8","9529,6","9635,6",88986
10/04/2001,"9618,5",9436,"9601,8",91148
09/04/2001,"9493,5","9251,1",9441,71160
06/04/2001,"9482,1",9210,"9313,6",89446
05/04/2001,"9401,7",9158,"9340,2",148726
04/04/2001,"9166,6","8784,8","9152,4",99508
03/04/2001,"9241,3","9011,8","9011,8",94213
02/04/2001,"9379,1","9160,7","9288,3",77717
30/03/2001,"9352,4",9149,"9259,9",90651
29/03/2001,"9212,6","8980,7","9205,1",76793
28/03/2001,"9274,6","9115,7","9163,4",112240
27/03/2001,"9263,3","8951,8","9243,1",98218
26/03/2001,"9067,4","8849,8","9044,3",86042
23/03/2001,"8829,4","8679,2","8810,5",107458
22/03/2001,"8878,4","8531,8","8531,8",156035
21/03/2001,"9173,9","8899,8","8899,8",146029
20/03/2001,"9392,4","9193,7","9235,8",98851
19/03/2001,"9393,3","9246,8","9251,3",68780
16/03/2001,"9459,1","9254,1",9290,116350
15/03/2001,"9513,8","9345,1","9451,9",89458
14/03/2001,"9633,2","9173,9",9393,126711
13/03/2001,"9592,4","9372,1","9510,9",97732
12/03/2001,"9678,9","9493,6","9511,8",63491
09/03/2001,9808,9678,"9727,3",73993
08/03/2001,9963,"9789,5","9807,3",86092
07/03/2001,"9950,3","9802,9","9904,7",92426
06/03/2001,"9916,7","9740,3","9904,5",80303
05/03/2001,"9695,2","9593,2","9688,1",72819
02/03/2001,9604,"9447,4","9546,1",76196
01/03/2001,9509,"9379,6","9490,6",80637
28/02/2001,"9687,9","9462,8","9551,4",112461
27/02/2001,"9574,1",9445,"9538,4",113802
26/02/2001,"9520,1","9362,8","9476,4",77982
23/02/2001,"9538,4","9231,6","9344,8",115067
22/02/2001,"9613,7","9348,8","9414,3",0
21/02/2001,"9722,2","9475,7","9583,7",103201
20/02/2001,"9923,7","9680,5","9705,9",80136
19/02/2001,"9908,7","9740,9","9861,3",63745
16/02/2001,"9811,9",9670,"9789,5",96160
15/02/2001,"9913,4","9764,1","9865,3",102561
14/02/2001,"9898,4","9719,6","9775,7",118313
13/02/2001,"10125,6","9993,6","10054,2",79202
12/02/2001,"10115,6","9872,2",10083,82256
09/02/2001,"9984,4","9875,3","9936,3",0
08/02/2001,"10056,4",9879,"10006,6",91147
07/02/2001,"9890,4","9776,8","9853,6",81814
06/02/2001,"9940,3","9836,1","9924,1",117988
05/02/2001,9865,"9754,6","9846,7",72649
02/02/2001,10127,"9848,5","9848,5",82610
01/02/2001,"10168,3","10033,6",10123,100907
31/01/2001,"10147,8","9983,2",10116,108814
30/01/2001,"10065,4","9963,1","10036,2",88927
29/01/2001,"10127,4","9899,6","9949,9",77924
26/01/2001,"10113,8",9970,"10090,1",88586
25/01/2001,"10187,3","10069,5",10132,86909
24/01/2001,"10205,5","10060,7","10116,2",117090
23/01/2001,"10125,6","9898,7","10079,3",93784
22/01/2001,"10049,2","9911,9","10019,2",91085
19/01/2001,"10219,5","9949,4","9955,5",173447
18/01/2001,"10081,8","9910,8","10056,4",114122
17/01/2001,"10020,1","9754,7","10000,2",129085
16/01/2001,"9888,3","9722,4","9736,6",81515
15/01/2001,"9936,5","9814,5",9892,115624
12/01/2001,"9902,5","9747,7","9890,2",121216
11/01/2001,"9699,8","9527,2","9699,8",95718
10/01/2001,"9642,8","9507,2","9605,4",89631
09/01/2001,"9694,9","9494,2","9581,8",105990
08/01/2001,"9641,3","9468,7","9605,4",98306
05/01/2001,"9706,7","9536,8","9555,8",123722
04/01/2001,"9713,8","9456,8","9575,3",147015
03/01/2001,"9200,9","8950,1","9163,1",96848
02/01/2001,"9246,7","8946,2","9080,2",68509
