Fecha,Máximo,Mínimo,Cierre,Volumen
31/12/1991,"2608,42","2564,25","2603,3",0
30/12/1991,"2561,21","2521,39","2561,21",0
27/12/1991,"2516,67","2503,41","2513,68",0
26/12/1991,"2499,5","2476,36","2492,25",0
23/12/1991,"2457,82","2445,96","2457,28",0
20/12/1991,"2475,3","2438,84","2465,05",0
19/12/1991,"2466,4","2439,93","2452,57",0
18/12/1991,"2492,02","2476,61","2482,06",0
17/12/1991,"2512,6","2501,08","2507,28",0
16/12/1991,"2532,35","2514,36","2514,36",0
13/12/1991,"2571,29","2543,77","2546,77",0
12/12/1991,"2536,41","2518,54","2535,64",0
11/12/1991,"2538,04","2518,23","2524,26",0
10/12/1991,"2565,25","2549,32","2551,31",0
05/12/1991,"2588,7","2576,6","2588,14",0
04/12/1991,"2603,32","2598,09","2600,3",0
03/12/1991,"2596,46","2582,44","2596,21",0
01/12/1991,"2579,27","2558,52","2573,69",0
29/11/1991,"2619,93","2598,84","2610,56",0
28/11/1991,"2613,02","2601,11","2609,91",0
27/11/1991,"2589,39","2561,77","2587,63",0
26/11/1991,"2590,01","2562,07","2585,8",0
25/11/1991,"2582,95","2552,12","2567,27",0
22/11/1991,"2598,19","2586,98","2597,86",0
21/11/1991,"2617,47","2592,9","2604,15",0
20/11/1991,"2615,29","2591,54","2615,21",0
18/11/1991,"2605,08","2600,59","2600,59",0
15/11/1991,"2644,62","2614,95","2634,62",0
14/11/1991,"2646,08","2625,08","2632,6",0
13/11/1991,"2672,39","2650,4","2660,16",0
12/11/1991,"2683,98","2671,41","2677,74",0
11/11/1991,"2717,77","2689,28","2698,45",0
08/11/1991,"2708,04","2687,49",2704,0
07/11/1991,"2692,29","2673,04","2673,12",0
06/11/1991,"2710,26","2690,86","2694,11",0
05/11/1991,"2712,07","2697,91","2709,04",0
04/11/1991,"2739,36","2705,17","2709,92",0
31/10/1991,"2768,87","2760,51","2765,08",0
30/10/1991,"2776,87","2768,51","2775,69",0
29/10/1991,"2792,34","2776,98","2777,56",0
28/10/1991,"2787,04","2764,79","2786,8",0
25/10/1991,"2762,21","2752,73","2756,1",0
24/10/1991,"2786,28","2765,63","2771,42",0
23/10/1991,"2796,56","2781,95","2796,56",0
22/10/1991,"2806,61","2781,33","2806,58",0
21/10/1991,2784,"2772,31","2777,75",0
18/10/1991,"2761,13","2742,4","2759,38",0
17/10/1991,"2762,7","2743,59","2747,95",0
16/10/1991,"2752,28","2739,21","2751,47",0
15/10/1991,"2736,16","2724,05","2735,95",0
14/10/1991,"2740,42","2720,3","2726,26",0
11/10/1991,"2755,17","2739,65","2744,07",0
10/10/1991,"2762,48","2751,71","2762,48",0
09/10/1991,"2760,33","2751,61","2758,95",0
08/10/1991,"2759,27","2746,47","2754,41",0
07/10/1991,"2763,78","2737,44","2760,65",0
04/10/1991,"2751,19","2727,73","2740,89",0
03/10/1991,"2777,41","2755,03","2759,74",0
02/10/1991,"2790,53","2756,3","2774,11",0
01/10/1991,"2822,55","2801,42","2804,29",0
30/09/1991,"2830,71","2808,24","2830,47",0
27/09/1991,"2838,75","2818,92","2826,25",0
26/09/1991,"2865,39","2844,88","2847,59",0
25/09/1991,"2861,43","2850,93","2857,59",0
24/09/1991,"2856,48","2841,43","2851,12",0
23/09/1991,"2871,99","2852,54","2857,61",0
20/09/1991,"2855,97","2806,86","2842,63",0
19/09/1991,"2800,91","2777,11","2800,02",0
18/09/1991,"2789,19","2768,29","2789,19",0
17/09/1991,"2775,07","2761,89","2773,08",0
16/09/1991,"2770,17","2757,86","2767,01",0
13/09/1991,"2781,56","2765,43","2772,87",0
12/09/1991,"2766,34","2749,12","2763,62",0
11/09/1991,"2752,54","2745,74","2749,87",0
10/09/1991,"2764,26","2750,66","2756,07",0
09/09/1991,"2774,53","2765,69","2772,94",0
06/09/1991,"2787,19","2775,73","2779,46",0
05/09/1991,"2791,67","2784,12","2790,43",0
04/09/1991,"2788,06","2771,58","2788,06",0
03/09/1991,"2787,52","2779,84","2783,06",0
02/09/1991,"2784,4",2766,"2784,4",0
30/08/1991,"2766,6",2747,"2766,18",0
29/08/1991,2751,2747,"2747,1",0
28/08/1991,2757,2751,"2751,15",0
27/08/1991,2763,2757,"2757,72",0
26/08/1991,2763,2726,2763,0
23/08/1991,"2726,61","2699,52","2726,56",0
22/08/1991,"2721,02","2701,89","2705,55",0
21/08/1991,"2722,06","2631,48","2695,38",0
20/08/1991,"2606,59","2550,82","2606,59",0
19/08/1991,"2657,01","2437,48","2502,8",0
16/08/1991,"2735,4","2727,92","2735,1",0
14/08/1991,"2742,13","2733,86","2738,6",0
13/08/1991,"2738,62","2723,49","2737,8",0
12/08/1991,"2723,71","2711,59","2723,3",0
09/08/1991,"2731,17","2717,25",2723,0
08/08/1991,"2744,52","2736,26","2740,9",0
07/08/1991,"2759,38","2751,27","2753,9",0
06/08/1991,2757,2736,"2739,6",0
05/08/1991,2782,2762,"2777,7",0
02/08/1991,2754,2733,"2752,6",0
01/08/1991,"2730,7",2707,"2730,7",0
31/07/1991,"2708,4",2700,"2708,4",0
30/07/1991,"2715,4",2710,"2715,4",0
29/07/1991,"2716,8",2696,"2716,8",0
26/07/1991,2705,2698,"2701,9",0
25/07/1991,"2700,5",2683,"2700,5",0
24/07/1991,2708,2697,"2703,4",0
23/07/1991,2731,2708,"2724,8",0
22/07/1991,"2703,4",2672,"2703,4",0
19/07/1991,2680,2662,"2679,4",0
18/07/1991,2672,2655,"2667,6",0
17/07/1991,2698,2686,2691,0
16/07/1991,2712,2702,"2707,4",0
15/07/1991,2703,2693,"2702,2",0
12/07/1991,"2681,3",2662,"2681,3",0
11/07/1991,2670,2651,"2652,4",0
10/07/1991,"2684,8",2659,"2684,8",0
09/07/1991,2701,2693,"2693,5",0
08/07/1991,2711,2689,"2694,2",0
05/07/1991,2744,2730,"2734,4",0
04/07/1991,2752,2721,"2748,7",0
03/07/1991,2734,2711,"2722,5",0
02/07/1991,2760,2747,"2753,7",0
01/07/1991,2765,2747,"2753,7",0
28/06/1991,2789,2748,"2752,8",0
27/06/1991,2795,2786,"2794,9",0
26/06/1991,2796,2787,"2792,9",0
25/06/1991,"2785,8",2773,"2785,8",0
24/06/1991,2789,2775,"2787,4",0
21/06/1991,2792,2776,"2787,8",0
20/06/1991,2792,2769,"2776,1",0
19/06/1991,2814,2789,"2794,4",0
18/06/1991,2839,2827,"2832,3",0
17/06/1991,2854,2838,"2844,1",0
14/06/1991,2845,2837,"2844,9",0
13/06/1991,"2850,7","2850,7","2850,7",0
12/06/1991,"2869,2",2860,"2869,2",0
11/06/1991,2874,2860,"2866,1",0
10/06/1991,"2869,7",2845,"2869,7",0
07/06/1991,2867,2849,"2852,5",0
06/06/1991,2887,2874,"2883,2",0
05/06/1991,2898,2888,"2897,6",0
04/06/1991,2884,2872,"2883,6",0
03/06/1991,2890,2881,"2884,5",0
31/05/1991,2863,2856,"2862,3",0
30/05/1991,2857,2847,"2854,9",0
29/05/1991,2849,2838,"2847,6",0
28/05/1991,2850,2836,"2837,7",0
27/05/1991,2848,2827,"2847,7",0
24/05/1991,2856,2834,"2839,3",0
23/05/1991,2868,2851,"2864,2",0
22/05/1991,2852,2839,"2847,5",0
21/05/1991,2858,2849,"2852,2",0
20/05/1991,2858,2841,"2857,9",0
17/05/1991,2852,2828,"2829,6",0
16/05/1991,2864,2842,"2853,6",0
14/05/1991,2850,2838,"2847,4",0
13/05/1991,"2828,9",2808,"2828,9",0
10/05/1991,2823,2806,"2822,3",0
09/05/1991,2793,2769,2793,0
08/05/1991,2764,2749,"2759,7",0
07/05/1991,2762,2746,"2760,7",0
06/05/1991,"2751,2",2736,"2751,2",0
03/05/1991,2752,2739,"2750,1",0
30/04/1991,"2755,3",2698,"2755,3",0
29/04/1991,"2732,7",2724,"2732,7",0
26/04/1991,2747,2733,"2739,2",0
25/04/1991,2768,2752,"2759,7",0
24/04/1991,2778,2770,"2775,2",0
23/04/1991,2778,2768,2778,0
22/04/1991,2758,2749,"2755,6",0
19/04/1991,2789,2775,"2781,4",0
18/04/1991,2797,2783,"2794,8",0
17/04/1991,2798,2789,2795,0
16/04/1991,2783,2776,"2780,7",0
15/04/1991,2787,2776,"2785,8",0
12/04/1991,2775,2757,"2762,9",0
11/04/1991,2751,2731,"2750,4",0
10/04/1991,2736,2729,"2735,4",0
09/04/1991,2758,2742,"2757,7",0
08/04/1991,2749,2731,"2740,6",0
05/04/1991,2762,2738,"2761,4",0
04/04/1991,2789,2760,"2766,7",0
03/04/1991,2821,2801,"2807,5",0
02/04/1991,2809,2799,"2808,6",0
01/04/1991,2824,2803,"2809,6",0
27/03/1991,2793,2777,2789,0
26/03/1991,2769,2758,"2765,6",0
25/03/1991,"2739,2",2703,"2739,2",0
22/03/1991,2749,2719,"2731,5",0
21/03/1991,"2769,7",2750,"2769,7",0
20/03/1991,2764,2736,"2748,5",0
18/03/1991,2827,2805,"2823,7",0
15/03/1991,2807,2787,"2806,4",0
14/03/1991,2780,2751,"2770,4",0
13/03/1991,"2745,3",2714,"2745,3",0
12/03/1991,2777,2746,"2752,9",0
11/03/1991,"2776,3",2742,"2776,3",0
08/03/1991,"2927,4",2689,"2729,4",0
07/03/1991,2690,2663,2689,0
06/03/1991,2707,2683,2688,0
05/03/1991,"2650,4",2603,"2650,4",0
04/03/1991,2607,2595,"2606,9",0
01/03/1991,2613,2592,"2602,2",0
28/02/1991,2659,2617,"2622,8",0
27/02/1991,2629,2595,"2628,8",0
26/02/1991,2625,2607,"2618,8",0
25/02/1991,2675,2641,"2666,5",0
22/02/1991,"2610,5",2593,"2610,5",0
21/02/1991,2578,2544,2575,0
20/02/1991,2568,2541,"2556,5",0
19/02/1991,2609,2561,"2573,2",0
18/02/1991,"2587,7",2556,"2587,7",0
15/02/1991,2581,2506,"2546,1",0
14/02/1991,2540,2518,"2532,2",0
13/02/1991,2513,2484,"2510,4",0
12/02/1991,2511,2473,"2486,9",0
11/02/1991,"2495,5",2447,"2495,5",0
08/02/1991,"2441,3",2419,"2441,3",0
07/02/1991,2429,2415,"2427,7",0
06/02/1991,"2407,4",2385,"2407,4",0
05/02/1991,2403,2389,"2398,8",0
04/02/1991,2375,2339,"2373,9",0
01/02/1991,2328,2313,"2327,9",0
31/01/1991,2357,2322,"2333,7",0
30/01/1991,2347,2310,"2346,5",0
29/01/1991,"2293,3",2282,"2293,3",0
28/01/1991,2291,2268,2291,0
25/01/1991,2284,2272,"2276,2",0
24/01/1991,"2259,5",2232,"2259,5",0
23/01/1991,"2219,4",2207,"2219,4",0
22/01/1991,2232,2226,"2231,5",0
21/01/1991,2253,2242,"2251,2",0
18/01/1991,2292,2270,"2277,2",0
17/01/1991,2336,2183,"2312,1",0
16/01/1991,2160,2149,"2159,3",0
15/01/1991,"2162,9",2128,"2162,9",0
14/01/1991,2168,2127,"2151,2",0
11/01/1991,2214,2192,"2195,5",0
10/01/1991,2220,2190,"2197,5",0
09/01/1991,2269,2205,"2264,8",0
08/01/1991,2206,2184,"2205,9",0
07/01/1991,2232,2214,"2225,8",0
04/01/1991,2250,2241,"2248,7",0
03/01/1991,2234,2196,"2222,4",0
02/01/1991,2211,2198,"2207,6",0
