{
    "language": "en",
    "textAngle": 0.0,
    "orientation": "Up",
    "regions": [
        {
            "boundingBox": "96,112,420,216",
            "lines": [
                {
                    "boundingBox": "96,112,255,80",
                    "words": [
                        {
                            "boundingBox": "96,112,255,80",
                            "text": "udemy"
                        }
                    ]
                },
                {
                    "boundingBox": "97,309,419,19",
                    "words": [
                        {
                            "boundingBox": "97,309,179,18",
                            "text": "CERTIFICATE"
                        },
                        {
                            "boundingBox": "289,309,33,19",
                            "text": "OF"
                        },
                        {
                            "boundingBox": "335,309,181,18",
                            "text": "COMPLETION"
                        }
                    ]
                }
            ]
        },
        {
            "boundingBox": "1011,105,493,71",
            "lines": [
                {
                    "boundingBox": "1071,105,432,12",
                    "words": [
                        {
                            "boundingBox": "1071,105,73,12",
                            "text": "Certificate"
                        },
                        {
                            "boundingBox": "1149,109,20,8",
                            "text": "no:"
                        },
                        {
                            "boundingBox": "1175,105,328,12",
                            "text": "UC-2b54af6c-a04a-4e65-9741-f8e571fd547d"
                        }
                    ]
                },
                {
                    "boundingBox": "1011,134,492,16",
                    "words": [
                        {
                            "boundingBox": "1011,134,73,12",
                            "text": "Certificate"
                        },
                        {
                            "boundingBox": "1090,134,20,12",
                            "text": "url:"
                        },
                        {
                            "boundingBox": "1116,134,387,16",
                            "text": "ude.my/UC-2b54af6c-a04a-4e65-9741-f8e571fd547d"
                        }
                    ]
                },
                {
                    "boundingBox": "1322,164,182,12",
                    "words": [
                        {
                            "boundingBox": "1322,164,72,12",
                            "text": "Reference"
                        },
                        {
                            "boundingBox": "1399,164,60,12",
                            "text": "Number:"
                        },
                        {
                            "boundingBox": "1465,164,39,12",
                            "text": "0004"
                        }
                    ]
                }
            ]
        },
        {
            "boundingBox": "98,370,941,743",
            "lines": [
                {
                    "boundingBox": "98,370,941,92",
                    "words": [
                        {
                            "boundingBox": "98,370,172,73",
                            "text": "The"
                        },
                        {
                            "boundingBox": "291,370,345,73",
                            "text": "Modern"
                        },
                        {
                            "boundingBox": "656,370,318,92",
                            "text": "Python"
                        },
                        {
                            "boundingBox": "995,377,44,66",
                            "text": "3"
                        }
                    ]
                },
                {
                    "boundingBox": "98,488,448,83",
                    "words": [
                        {
                            "boundingBox": "98,488,448,83",
                            "text": "Bootcamp"
                        }
                    ]
                },
                {
                    "boundingBox": "98,606,255,19",
                    "words": [
                        {
                            "boundingBox": "98,607,113,18",
                            "text": "Instructors"
                        },
                        {
                            "boundingBox": "229,606,46,19",
                            "text": "Colt"
                        },
                        {
                            "boundingBox": "282,606,71,19",
                            "text": "Steele"
                        }
                    ]
                },
                {
                    "boundingBox": "98,961,377,48",
                    "words": [
                        {
                            "boundingBox": "98,961,323,48",
                            "text": "Gunasekar"
                        },
                        {
                            "boundingBox": "434,962,41,46",
                            "text": "V"
                        }
                    ]
                },
                {
                    "boundingBox": "98,1053,211,23",
                    "words": [
                        {
                            "boundingBox": "98,1054,48,18",
                            "text": "Date"
                        },
                        {
                            "boundingBox": "163,1053,61,23",
                            "text": "sept."
                        },
                        {
                            "boundingBox": "231,1053,19,22",
                            "text": "2,"
                        },
                        {
                            "boundingBox": "257,1053,52,18",
                            "text": "2021"
                        }
                    ]
                },
                {
                    "boundingBox": "98,1090,269,23",
                    "words": [
                        {
                            "boundingBox": "98,1090,72,23",
                            "text": "Length"
                        },
                        {
                            "boundingBox": "189,1090,48,19",
                            "text": "30.5"
                        },
                        {
                            "boundingBox": "243,1091,53,18",
                            "text": "total"
                        },
                        {
                            "boundingBox": "303,1091,64,18",
                            "text": "hours"
                        }
                    ]
                }
            ]
        }
    ],
    "modelVersion": "2021-04-01"
}