appdirs==1.4.3
click==7.1.1
distlib==0.3.0
fastapi==0.53.2
filelock==3.0.12
h11==0.9.0
pbr==5.4.4
pydantic==1.4
six==1.14.0
starlette==0.13.2
stevedore==1.32.0
uvicorn==0.11.3
virtualenv==20.0.7
virtualenv-clone==0.5.3
virtualenvwrapper==4.8.4
websockets==8.1
