<svg width="60" height="60" viewBox="0 0 60 60" fill="none" xmlns="http://www.w3.org/2000/svg">
<path d="M59 5V25C59 25.5522 58.5522 26 58 26H38C37.4478 26 37 25.5522 37 25V18L33 15L37 12V5C37 4.44775 37.4478 4 38 4H58C58.5522 4 59 4.44775 59 5Z" fill="#BDDBFF"/>
<path d="M59 35V55C59 55.5522 58.5522 56 58 56H38C37.4478 56 37 55.5522 37 55V48L33 45L37 42V35C37 34.4478 37.4478 34 38 34H58C58.5522 34 59 34.4478 59 35Z" fill="#BDDBFF"/>
<path d="M20 58H6V54.02C5.99805 52.2329 7.18164 50.6616 8.8999 50.1699L11.5498 49.4102L15 52L18.4502 49.4102L21.1001 50.1699C22.8184 50.6616 24.002 52.2329 24 54.02V58H20Z" fill="#BDDBFF"/>
<path d="M17 39L15.5098 39.9902C14.5254 40.6504 13.3657 41.0024 12.1802 41H10V40C10 37.2388 12.2388 35 15 35C17.7612 35 20 37.2388 20 40V41H19.2402C19.1597 41.0034 19.0791 40.9966 19 40.98C18.3301 40.9077 17.7446 40.4956 17.4502 39.8901L17 39Z" fill="#BDDBFF"/>
<path d="M20 28H6V24.02C5.99805 22.2329 7.18164 20.6616 8.8999 20.1699L11.5498 19.4102L15 22L18.4502 19.4102L21.1001 20.1699C22.8184 20.6616 24.002 22.2329 24 24.02V28H20Z" fill="#BDDBFF"/>
<path d="M17 9L15.5098 9.99024C14.5254 10.6504 13.3657 11.0024 12.1802 11H10V10C10 7.23877 12.2388 5 15 5C17.7612 5 20 7.23877 20 10V11H19.2402C19.1597 11.0034 19.0791 10.9966 19 10.98C18.3301 10.9077 17.7446 10.4956 17.4502 9.89014L17 9Z" fill="#BDDBFF"/>
<path d="M58 3H38C36.8955 3 36 3.89551 36 5V11.5L32.3999 14.2002C32.1484 14.3887 32 14.6851 32 15C32 15.3149 32.1484 15.6113 32.3999 15.7998L36 18.5V25C36 26.1045 36.8955 27 38 27H58C59.1045 27 60 26.1045 60 25V5C60 3.89551 59.1045 3 58 3ZM58 25H38V18C38 17.6851 37.8516 17.3887 37.6001 17.2002L34.667 15L37.6001 12.7998C37.8516 12.6113 38 12.3149 38 12V5H58V25Z" fill="#5588C3"/>
<path d="M58 33H38C36.8955 33 36 33.8955 36 35V41.5L32.3999 44.2002C32.1484 44.3887 32 44.6851 32 45C32 45.3149 32.1484 45.6113 32.3999 45.7998L36 48.5V55C36 56.1045 36.8955 57 38 57H58C59.1045 57 60 56.1045 60 55V35C60 33.8955 59.1045 33 58 33ZM58 55H38V48C38 47.6851 37.8516 47.3887 37.6001 47.2002L34.667 45L37.6001 42.7998C37.8516 42.6113 38 42.3149 38 42V35H58V55Z" fill="#5588C3"/>
<path d="M5 14H7V16H5V14Z" fill="#5588C3"/>
<path d="M23 14H25V16H23V14Z" fill="#5588C3"/>
<path d="M28 1H2C0.895508 1 0 1.89551 0 3V27C0 28.1045 0.895508 29 2 29H28C29.1045 29 30 28.1045 30 27V3C30 1.89551 29.1045 1 28 1ZM18.3398 9.4458L17.895 8.5542C17.7671 8.29688 17.5347 8.10742 17.2573 8.03369C16.9795 7.95947 16.6841 8.00879 16.4448 8.16797L14.957 9.16016C14.1362 9.7085 13.1709 10.0005 12.1841 10H11C10.9922 7.79102 12.7769 5.99365 14.9858 5.98584C17.1953 5.97803 18.9922 7.7627 19 9.97217C18.7134 9.90283 18.4717 9.70996 18.3398 9.4458ZM12.1841 12C13.5659 12.001 14.917 11.5918 16.0659 10.8242L16.6138 10.459C16.9287 11.0146 17.415 11.4531 18 11.709V13C18 14.6567 16.6567 16 15 16C13.3433 16 12 14.6567 12 13V12H12.1841ZM15 18C15.3359 18.0005 15.6709 17.9668 16 17.8999V19C16.0034 19.2847 16.1289 19.5542 16.3452 19.7402L15 20.75L13.6548 19.7402C13.8711 19.5542 13.9966 19.2847 14 19V17.8999C14.3291 17.9668 14.6641 18.0005 15 18ZM11.3501 20.5112L14.3999 22.7998C14.7554 23.0669 15.2446 23.0669 15.6001 22.7998L18.6489 20.5112L20.8242 21.1318C22.1104 21.5039 22.9971 22.6807 23 24.02V27H21V24H19V27H11V24H9V27H7V24.02C7.00293 22.6807 7.88965 21.5039 9.17578 21.1309L11.3501 20.5112ZM25 27V24.02C24.9951 21.7886 23.5181 19.8281 21.375 19.208L18 18.2441V16.9741C19.2544 16.0376 19.9956 14.5654 20 13V12C20.5522 12 21 11.5522 21 11V10C21 6.68652 18.3135 4 15 4C11.6865 4 9 6.68652 9 10V11C9 11.5522 9.44775 12 10 12V13C10.0044 14.5654 10.7456 16.0376 12 16.9741V18.2441L8.62598 19.208C6.48193 19.8276 5.00488 21.7886 5 24.02V27H2V3H28V27H25Z" fill="#5588C3"/>
<path d="M5 44H7V46H5V44Z" fill="#5588C3"/>
<path d="M23 44H25V46H23V44Z" fill="#5588C3"/>
<path d="M28 31H2C0.895508 31 0 31.8955 0 33V57C0 58.1045 0.895508 59 2 59H28C29.1045 59 30 58.1045 30 57V33C30 31.8955 29.1045 31 28 31ZM18.3398 39.4458L17.895 38.5542C17.7671 38.2969 17.5347 38.1074 17.2573 38.0337C16.9795 37.9595 16.6841 38.0088 16.4448 38.168L14.957 39.1602C14.1362 39.7085 13.1709 40.0005 12.1841 40H11C10.9922 37.791 12.7769 35.9937 14.9858 35.9858C17.1953 35.978 18.9922 37.7627 19 39.9722C18.7134 39.9028 18.4717 39.71 18.3398 39.4458ZM12.1841 42C13.5659 42.001 14.917 41.5918 16.0659 40.8242L16.6138 40.459C16.9287 41.0146 17.415 41.4531 18 41.709V43C18 44.6567 16.6567 46 15 46C13.3433 46 12 44.6567 12 43V42H12.1841ZM15 48C15.3359 48.0005 15.6709 47.9668 16 47.8999V49C16.0034 49.2847 16.1289 49.5542 16.3452 49.7402L15 50.75L13.6548 49.7402C13.8711 49.5542 13.9966 49.2847 14 49V47.8999C14.3291 47.9668 14.6641 48.0005 15 48ZM11.3501 50.5112L14.3999 52.7998C14.7554 53.0669 15.2446 53.0669 15.6001 52.7998L18.6489 50.5112L20.8242 51.1318C22.1104 51.5039 22.9971 52.6807 23 54.02V57H21V54H19V57H11V54H9V57H7V54.02C7.00293 52.6807 7.88965 51.5039 9.17578 51.1309L11.3501 50.5112ZM25 57V54.02C24.9951 51.7886 23.5181 49.8281 21.375 49.208L18 48.2441V46.9741C19.2544 46.0376 19.9956 44.5654 20 43V42C20.5522 42 21 41.5522 21 41V40C21 36.6865 18.3135 34 15 34C11.6865 34 9 36.6865 9 40V41C9 41.5522 9.44775 42 10 42V43C10.0044 44.5654 10.7456 46.0376 12 46.9741V48.2441L8.62598 49.208C6.48193 49.8276 5.00488 51.7886 5 54.02V57H2V33H28V57H25Z" fill="#5588C3"/>
<path d="M41 14H55V16H41V14Z" fill="#5588C3"/>
<path d="M41 10H55V12H41V10Z" fill="#5588C3"/>
<path d="M41 18H55V20H41V18Z" fill="#5588C3"/>
<path d="M41 44H55V46H41V44Z" fill="#5588C3"/>
<path d="M41 40H55V42H41V40Z" fill="#5588C3"/>
<path d="M41 48H55V50H41V48Z" fill="#5588C3"/>
</svg>
