<svg width="44" height="44" viewBox="0 0 44 44" fill="none" xmlns="http://www.w3.org/2000/svg">
<path d="M17.9998 20.6667C19.0547 20.6667 20.0858 20.3539 20.9629 19.7678C21.8399 19.1818 22.5235 18.3489 22.9272 17.3743C23.3309 16.3998 23.4365 15.3274 23.2307 14.2929C23.0249 13.2583 22.517 12.308 21.7711 11.5621C21.0252 10.8162 20.0749 10.3083 19.0403 10.1025C18.0058 9.89669 16.9334 10.0023 15.9589 10.406C14.9843 10.8096 14.1514 11.4932 13.5653 12.3703C12.9793 13.2474 12.6665 14.2785 12.6665 15.3333C12.6665 16.7478 13.2284 18.1044 14.2286 19.1046C15.2288 20.1048 16.5853 20.6667 17.9998 20.6667ZM17.9998 12.6667C18.5273 12.6667 19.0428 12.8231 19.4814 13.1161C19.9199 13.4091 20.2617 13.8256 20.4635 14.3128C20.6653 14.8001 20.7182 15.3363 20.6153 15.8536C20.5124 16.3709 20.2584 16.846 19.8855 17.219C19.5125 17.5919 19.0374 17.8459 18.5201 17.9488C18.0028 18.0517 17.4666 17.9988 16.9793 17.797C16.4921 17.5952 16.0756 17.2534 15.7826 16.8149C15.4896 16.3763 15.3332 15.8608 15.3332 15.3333C15.3332 14.6261 15.6141 13.9478 16.1142 13.4477C16.6143 12.9476 17.2926 12.6667 17.9998 12.6667ZM28.6665 23.3333C29.4576 23.3333 30.231 23.0987 30.8888 22.6592C31.5466 22.2197 32.0593 21.595 32.362 20.8641C32.6648 20.1332 32.744 19.3289 32.5896 18.553C32.4353 17.7771 32.0543 17.0643 31.4949 16.5049C30.9355 15.9455 30.2228 15.5645 29.4469 15.4102C28.6709 15.2559 27.8667 15.3351 27.1358 15.6378C26.4049 15.9406 25.7802 16.4533 25.3406 17.1111C24.9011 17.7689 24.6665 18.5422 24.6665 19.3333C24.6665 20.3942 25.0879 21.4116 25.8381 22.1618C26.5882 22.9119 27.6056 23.3333 28.6665 23.3333ZM28.6665 18C28.9302 18 29.188 18.0782 29.4073 18.2247C29.6265 18.3712 29.7974 18.5795 29.8983 18.8231C29.9993 19.0667 30.0257 19.3348 29.9742 19.5935C29.9228 19.8521 29.7958 20.0897 29.6093 20.2761C29.4228 20.4626 29.1853 20.5896 28.9266 20.641C28.668 20.6925 28.3999 20.6661 28.1563 20.5652C27.9126 20.4643 27.7044 20.2934 27.5579 20.0741C27.4114 19.8548 27.3332 19.597 27.3332 19.3333C27.3332 18.9797 27.4736 18.6406 27.7237 18.3905C27.9737 18.1405 28.3129 18 28.6665 18ZM28.6665 24.6667C27.1889 24.6683 25.7538 25.1608 24.5865 26.0667C23.2805 24.7658 21.6186 23.8808 19.8103 23.5232C18.002 23.1657 16.1283 23.3516 14.4255 24.0575C12.7227 24.7634 11.2671 25.9578 10.2422 27.4899C9.21726 29.022 8.669 30.8233 8.6665 32.6667C8.6665 33.0203 8.80698 33.3594 9.05703 33.6095C9.30708 33.8595 9.64622 34 9.99984 34C10.3535 34 10.6926 33.8595 10.9426 33.6095C11.1927 33.3594 11.3332 33.0203 11.3332 32.6667C11.3332 30.8986 12.0355 29.2029 13.2858 27.9526C14.536 26.7024 16.2317 26 17.9998 26C19.7679 26 21.4636 26.7024 22.7139 27.9526C23.9641 29.2029 24.6665 30.8986 24.6665 32.6667C24.6665 33.0203 24.807 33.3594 25.057 33.6095C25.3071 33.8595 25.6462 34 25.9998 34C26.3535 34 26.6926 33.8595 26.9426 33.6095C27.1927 33.3594 27.3332 33.0203 27.3332 32.6667C27.3364 31.1046 26.9417 29.5674 26.1865 28.2C26.7757 27.7344 27.4841 27.444 28.2307 27.3622C28.9772 27.2804 29.7317 27.4104 30.4078 27.7373C31.0839 28.0642 31.6543 28.5749 32.0537 29.2108C32.4532 29.8468 32.6656 30.5823 32.6665 31.3333C32.6665 31.687 32.807 32.0261 33.057 32.2761C33.3071 32.5262 33.6462 32.6667 33.9998 32.6667C34.3535 32.6667 34.6926 32.5262 34.9426 32.2761C35.1927 32.0261 35.3332 31.687 35.3332 31.3333C35.3332 29.5652 34.6308 27.8695 33.3806 26.6193C32.1303 25.369 30.4346 24.6667 28.6665 24.6667Z" fill="#5588C3"/>
</svg>
