<svg width="44" height="44" viewBox="0 0 44 44" fill="none" xmlns="http://www.w3.org/2000/svg">
<path d="M21.9998 23.3333C22.7362 23.3333 23.3332 22.7364 23.3332 22C23.3332 21.2636 22.7362 20.6667 21.9998 20.6667C21.2635 20.6667 20.6665 21.2636 20.6665 22C20.6665 22.7364 21.2635 23.3333 21.9998 23.3333Z" fill="#5588C3"/>
<path d="M27.3333 23.3333C28.0697 23.3333 28.6667 22.7364 28.6667 22C28.6667 21.2636 28.0697 20.6667 27.3333 20.6667C26.597 20.6667 26 21.2636 26 22C26 22.7364 26.597 23.3333 27.3333 23.3333Z" fill="#5588C3"/>
<path d="M16.6668 23.3333C17.4032 23.3333 18.0002 22.7364 18.0002 22C18.0002 21.2636 17.4032 20.6667 16.6668 20.6667C15.9304 20.6667 15.3335 21.2636 15.3335 22C15.3335 22.7364 15.9304 23.3333 16.6668 23.3333Z" fill="#5588C3"/>
<path d="M31.4268 12.5733C29.2391 10.3713 26.3517 9.00162 23.2623 8.70033C20.173 8.39903 17.0753 9.18504 14.5033 10.9228C11.9314 12.6607 10.0463 15.2413 9.17318 18.22C8.30001 21.1987 8.49346 24.3887 9.72016 27.24C9.84801 27.505 9.88996 27.8033 9.84016 28.0933L8.66682 33.7333C8.62162 33.9496 8.63085 34.1737 8.69369 34.3854C8.75653 34.5972 8.871 34.7901 9.02682 34.9467C9.15456 35.0735 9.30666 35.1731 9.47394 35.2396C9.64122 35.306 9.82022 35.3379 10.0002 35.3333H10.2668L15.9735 34.1867C16.2635 34.1518 16.5577 34.1932 16.8268 34.3067C19.6782 35.5334 22.8681 35.7268 25.8468 34.8537C28.8255 33.9805 31.4062 32.0954 33.144 29.5235C34.8818 26.9515 35.6678 23.8539 35.3665 20.7645C35.0652 17.6752 33.6955 14.7877 31.4935 12.6L31.4268 12.5733ZM32.5335 23.72C32.2728 25.312 31.6544 26.8241 30.7249 28.1425C29.7954 29.461 28.5789 30.5514 27.167 31.3318C25.7552 32.1122 24.1847 32.5622 22.5738 32.6479C20.9629 32.7336 19.3535 32.4528 17.8668 31.8267C17.3395 31.6024 16.7731 31.4846 16.2002 31.48C15.9499 31.4818 15.7001 31.5041 15.4535 31.5467L11.6935 32.3067L12.4535 28.5467C12.6049 27.7324 12.5073 26.8913 12.1735 26.1333C11.5473 24.6466 11.2666 23.0373 11.3523 21.4264C11.438 19.8155 11.888 18.245 12.6683 16.8331C13.4487 15.4213 14.5392 14.2048 15.8576 13.2753C17.1761 12.3457 18.6882 11.7274 20.2802 11.4667C21.9512 11.1924 23.6635 11.32 25.2755 11.8388C26.8874 12.3575 28.3527 13.2526 29.5501 14.4501C30.7475 15.6475 31.6426 17.1127 32.1614 18.7247C32.6802 20.3367 32.8077 22.049 32.5335 23.72Z" fill="#5588C3"/>
</svg>