<svg width="16" height="16" viewBox="0 0 16 16" fill="none" xmlns="http://www.w3.org/2000/svg">
<path d="M16 0.942702L15.0573 0L8 7.0573L0.942702 0L0 0.942702L7.0573 8L0 15.0573L0.942702 16L8 8.9427L15.0573 16L16 15.0573L8.9427 8L16 0.942702Z" fill="black"/>
</svg>
