<svg width="154" height="44" viewBox="0 0 154 44" fill="none" xmlns="http://www.w3.org/2000/svg">
<g clip-path="url(#clip0)">
<path d="M0 39.6175C13.9985 44.5259 28.3343 45.4024 42.4172 41.8964C47.1396 40.6693 51.7776 39.0916 56.5 39.0916C59.7888 39.0916 63.0776 39.9681 66.3664 39.9681C69.9925 39.9681 73.6187 38.7411 77.2448 38.0399C88.0388 36.2869 99.0015 39.7928 109.627 35.9363C108.615 35.0598 107.603 34.008 106.591 33.1315C107.856 33.6574 109.374 32.6056 110.133 30.3267C109.037 28.9243 107.94 27.6972 106.844 26.2948C108.025 25.7689 109.121 25.243 110.301 24.5418C110.976 22.0877 111.904 19.8088 113 18.2311C109.374 16.3028 105.157 13.1474 104.314 5.60957C103.471 5.78487 102.543 5.78487 101.7 5.96017C102.375 5.08368 102.881 3.68129 103.134 2.1036C100.857 0.525909 98.4112 0.175311 96.05 1.21295e-05C68.1373 -1.75298 40.2246 5.96017 12.3119 1.9283C10.3724 1.9283 8.26418 1.753 6.74627 4.20718C7.4209 6.13547 8.43284 7.36256 9.52911 7.88846C8.68582 8.58965 7.84254 9.64145 7.67388 11.3944C7.50522 13.1474 8.43284 15.251 9.19179 14.3745C8.34851 15.6016 7.58955 16.6534 6.74627 17.7052C7.33657 18.5817 7.84254 19.2829 8.43284 20.1594C7.4209 21.0359 6.49328 21.7371 5.48134 22.6136C5.56567 23.4901 5.81866 24.3665 6.2403 24.8924C5.90299 25.4183 5.65 26.2948 5.48134 27.1713C4.80672 27.6972 4.21642 28.3984 3.54179 28.9243C4.04776 29.4502 4.55373 29.8008 5.0597 30.3267C3.71045 30.6773 2.44552 33.1315 2.19254 35.9363C1.26493 36.2869 0.421642 37.6893 0 39.6175Z" fill="#F46425"/>
<path d="M24.6064 25.86C25.2731 25.86 25.8598 25.68 26.3664 25.32C26.8864 24.96 27.1464 24.42 27.1464 23.7C27.1464 22.9667 26.8664 22.4067 26.3064 22.02C25.7598 21.6334 24.9731 21.3 23.9464 21.02C22.9331 20.7267 22.1931 20.4734 21.7264 20.26C21.2731 20.0467 20.8398 19.7667 20.4264 19.42C19.5998 18.7267 19.1864 17.6534 19.1864 16.2C19.1864 15.0134 19.6064 13.9934 20.4464 13.14C21.2998 12.2867 22.4598 11.86 23.9264 11.86C24.6331 11.86 25.3664 11.9667 26.1264 12.18C26.8998 12.38 27.3798 12.48 27.5664 12.48C27.7531 12.48 27.9198 12.3467 28.0664 12.08H28.2864L28.4264 16.12H28.1064C27.4664 14.96 26.7931 14.0333 26.0864 13.34C25.3931 12.6333 24.6331 12.28 23.8064 12.28C22.9931 12.28 22.3598 12.4733 21.9064 12.86C21.4531 13.2334 21.2264 13.74 21.2264 14.38C21.2264 15.0067 21.4931 15.4933 22.0264 15.84C22.5731 16.1734 23.2398 16.4467 24.0264 16.66C24.8131 16.8734 25.3264 17.02 25.5664 17.1C25.8198 17.18 26.1264 17.2934 26.4864 17.44C26.8598 17.5734 27.1598 17.72 27.3864 17.88C27.6264 18.0267 27.8731 18.22 28.1264 18.46C28.3931 18.6867 28.5998 18.94 28.7464 19.22C29.1064 19.86 29.2864 20.62 29.2864 21.5C29.2864 22.94 28.8331 24.1 27.9264 24.98C27.0331 25.8467 25.8531 26.28 24.3864 26.28C23.6264 26.28 22.7531 26.18 21.7664 25.98C20.7931 25.78 20.2531 25.68 20.1464 25.68C19.9598 25.68 19.7798 25.88 19.6064 26.28H19.3264L19.1264 21.52H19.4664C20.0531 22.68 20.7998 23.6934 21.7064 24.56C22.6264 25.4267 23.5931 25.86 24.6064 25.86ZM35.0986 21.38H35.6786V19.84C35.6786 18.5734 35.6053 17.7267 35.4586 17.3C35.3253 16.86 35.0586 16.64 34.6586 16.64C34.4186 16.64 34.1986 16.7067 33.9986 16.84C33.812 16.96 33.7186 17.1334 33.7186 17.36C33.7186 17.5734 33.7586 17.7934 33.8386 18.02H34.3386C34.4453 18.3 34.4986 18.64 34.4986 19.04C34.4986 19.4267 34.332 19.7667 33.9986 20.06C33.6653 20.34 33.2453 20.48 32.7386 20.48C31.592 20.48 31.0186 19.9267 31.0186 18.82C31.0186 17.18 32.412 16.36 35.1986 16.36C36.7853 16.36 37.8786 16.6333 38.4786 17.18C39.092 17.7133 39.3986 18.7 39.3986 20.14V24.2C39.3986 24.8934 39.592 25.24 39.9786 25.24C40.432 25.24 40.6986 24.5534 40.7786 23.18L41.0786 23.2C41.0253 24.3734 40.8053 25.18 40.4186 25.62C40.032 26.06 39.3986 26.28 38.5186 26.28C36.9186 26.28 35.9986 25.7867 35.7586 24.8C35.5853 25.3067 35.3253 25.68 34.9786 25.92C34.632 26.16 34.1253 26.28 33.4586 26.28C31.4853 26.28 30.4986 25.4734 30.4986 23.86C30.4986 22.9134 30.872 22.2667 31.6186 21.92C32.3786 21.56 33.5386 21.38 35.0986 21.38ZM34.2986 23.84C34.2986 24.5334 34.332 24.98 34.3986 25.18C34.4786 25.38 34.6186 25.48 34.8186 25.48C35.032 25.48 35.2253 25.3134 35.3986 24.98C35.5853 24.6334 35.6786 24.16 35.6786 23.56V21.7H35.5386C34.712 21.7 34.2986 22.3067 34.2986 23.52V23.84ZM41.1952 11.08H46.0952V25.72H47.2152V26.08H41.2752V25.72H42.3752V11.44H41.1952V11.08ZM52.4033 21.38H52.9833V19.84C52.9833 18.5734 52.91 17.7267 52.7633 17.3C52.63 16.86 52.3633 16.64 51.9633 16.64C51.7233 16.64 51.5033 16.7067 51.3033 16.84C51.1167 16.96 51.0233 17.1334 51.0233 17.36C51.0233 17.5734 51.0633 17.7934 51.1433 18.02H51.6433C51.75 18.3 51.8033 18.64 51.8033 19.04C51.8033 19.4267 51.6367 19.7667 51.3033 20.06C50.97 20.34 50.55 20.48 50.0433 20.48C48.8967 20.48 48.3233 19.9267 48.3233 18.82C48.3233 17.18 49.7167 16.36 52.5033 16.36C54.09 16.36 55.1833 16.6333 55.7833 17.18C56.3967 17.7133 56.7033 18.7 56.7033 20.14V24.2C56.7033 24.8934 56.8967 25.24 57.2833 25.24C57.7367 25.24 58.0033 24.5534 58.0833 23.18L58.3833 23.2C58.33 24.3734 58.11 25.18 57.7233 25.62C57.3367 26.06 56.7033 26.28 55.8233 26.28C54.2233 26.28 53.3033 25.7867 53.0633 24.8C52.89 25.3067 52.63 25.68 52.2833 25.92C51.9367 26.16 51.43 26.28 50.7633 26.28C48.79 26.28 47.8033 25.4734 47.8033 23.86C47.8033 22.9134 48.1767 22.2667 48.9233 21.92C49.6833 21.56 50.8433 21.38 52.4033 21.38ZM51.6033 23.84C51.6033 24.5334 51.6367 24.98 51.7033 25.18C51.7833 25.38 51.9233 25.48 52.1233 25.48C52.3367 25.48 52.53 25.3134 52.7033 24.98C52.89 24.6334 52.9833 24.16 52.9833 23.56V21.7H52.8433C52.0167 21.7 51.6033 22.3067 51.6033 23.52V23.84ZM62.6399 21.94C62.6399 23.34 62.7132 24.2734 62.8599 24.74C63.0065 25.1934 63.2732 25.42 63.6599 25.42C64.0599 25.42 64.3999 25.2467 64.6799 24.9C64.9732 24.5534 65.1199 24.04 65.1199 23.36V19C65.1199 18.4267 65.0065 17.94 64.7799 17.54C64.5532 17.14 64.2199 16.94 63.7799 16.94C63.3399 16.94 63.0399 17.2334 62.8799 17.82C62.7199 18.4067 62.6399 19.4334 62.6399 20.9V21.94ZM65.3799 26.08L65.1599 24.68C64.7065 25.7467 63.7865 26.28 62.3999 26.28C61.2532 26.28 60.3599 25.8667 59.7199 25.04C59.0932 24.2134 58.7799 22.98 58.7799 21.34C58.7799 18.02 60.0999 16.36 62.7399 16.36C63.9132 16.36 64.6865 16.6867 65.0599 17.34V11.44H63.8399V11.08H68.8399V25.72H69.8199V26.08H65.3799ZM70.6024 26.28V22.7H70.8424C71.189 23.86 71.6557 24.6734 72.2424 25.14C72.829 25.6067 73.5624 25.84 74.4424 25.84C75.8024 25.84 76.4824 25.4067 76.4824 24.54C76.4824 24.1667 76.3157 23.8867 75.9824 23.7C75.4624 23.4067 74.7957 23.18 73.9824 23.02C73.0757 22.78 72.3157 22.46 71.7024 22.06C70.969 21.58 70.6024 20.82 70.6024 19.78C70.6024 18.74 70.9224 17.9134 71.5624 17.3C72.2024 16.6733 73.0557 16.36 74.1224 16.36C74.7757 16.36 75.449 16.5133 76.1424 16.82C76.3957 16.9267 76.589 16.98 76.7224 16.98C76.8557 16.98 76.969 16.9334 77.0624 16.84C77.1557 16.7467 77.269 16.5734 77.4024 16.32H77.6224V19.38H77.3824C76.7024 17.6467 75.649 16.78 74.2224 16.78C73.5957 16.78 73.129 16.8933 72.8224 17.12C72.5157 17.3334 72.3624 17.6067 72.3624 17.94C72.3624 18.14 72.409 18.3 72.5024 18.42C72.5957 18.5267 72.669 18.6067 72.7224 18.66C72.7757 18.7134 72.8624 18.7734 72.9824 18.84C73.1024 18.8934 73.2024 18.94 73.2824 18.98C73.3624 19.0067 73.4824 19.0467 73.6424 19.1C73.8157 19.1533 73.9424 19.1867 74.0224 19.2C74.929 19.4267 75.5824 19.6267 75.9824 19.8C76.3824 19.96 76.7624 20.16 77.1224 20.4C77.8557 20.9067 78.2224 21.7267 78.2224 22.86C78.2224 23.98 77.8891 24.8334 77.2224 25.42C76.5557 25.9934 75.6424 26.28 74.4824 26.28C73.6557 26.28 72.8557 26.0867 72.0824 25.7C71.9224 25.5934 71.7957 25.54 71.7024 25.54C71.409 25.54 71.1224 25.7867 70.8424 26.28H70.6024Z" fill="white"/>
</g>
<defs>
<clipPath id="clip0">
<rect width="154" height="44" fill="white"/>
</clipPath>
</defs>
</svg>
