^C:\USERS\ASTANA\SOURCE\REPOS\HELLOWORLD\HELLOWORLD\RELEASE\HELLOWORLD.OBJ
C:\Users\Astana\source\repos\HelloWorld\HelloWorld\Release\HelloWorld.IPDB
C:\Users\Astana\source\repos\HelloWorld\HelloWorld\Release\HelloWorld.iobj
